(kicad_symbol_lib (version 20211014) (generator kicad_symbol_editor)
  (symbol "ADP-2-1W" (in_bom yes) (on_board yes)
    (property "Reference" "U" (id 0) (at -6.35 7.62 0)
      (effects (font (size 1.27 1.27)))
    )
    (property "Value" "ADP-2-1W" (id 1) (at 6.35 7.62 0)
      (effects (font (size 1.27 1.27)))
    )
    (property "Footprint" "RF_Mini-Circuits:Mini-Circuits_CD636_LandPatternPL-035" (id 2) (at -3.81 -11.43 0)
      (effects (font (size 1.27 1.27)) hide)
    )
    (property "Datasheet" "" (id 3) (at -1.27 -8.89 0)
      (effects (font (size 1.27 1.27)) hide)
    )
    (property "ki_fp_filters" "Mini?Circuits*CD636*" (id 4) (at 0 0 0)
      (effects (font (size 1.27 1.27)) hide)
    )
    (symbol "ADP-2-1W_0_1"
      (rectangle (start -6.35 6.35) (end 6.35 -6.35)
        (stroke (width 0.254) (type default) (color 0 0 0 0))
        (fill (type background))
      )
      (polyline
        (pts
          (xy 0 0)
          (xy 5.08 -5.08)
        )
        (stroke (width 0.508) (type default) (color 0 0 0 0))
        (fill (type none))
      )
      (polyline
        (pts
          (xy -5.08 0)
          (xy 0 0)
          (xy 5.08 5.08)
        )
        (stroke (width 0.508) (type default) (color 0 0 0 0))
        (fill (type none))
      )
    )
    (symbol "ADP-2-1W_1_1"
      (pin passive line (at -10.16 0 0) (length 5.08)
        (name "SUM" (effects (font (size 1.27 1.27))))
        (number "1" (effects (font (size 1.27 1.27))))
      )
      (pin passive line (at 10.16 5.08 180) (length 5.08)
        (name "PORT1" (effects (font (size 1.27 1.27))))
        (number "3" (effects (font (size 1.27 1.27))))
      )
      (pin passive line (at 10.16 -5.08 180) (length 5.08)
        (name "PORT2" (effects (font (size 1.27 1.27))))
        (number "4" (effects (font (size 1.27 1.27))))
      )
      (pin passive line (at -5.08 -10.16 90) (length 3.81)
        (name "GND" (effects (font (size 1.27 1.27))))
        (number "6" (effects (font (size 1.27 1.27))))
      )
    )
  )
  (symbol "SMA_2" (pin_numbers hide) (pin_names (offset 1.016) hide) (in_bom yes) (on_board yes)
    (property "Reference" "J" (id 0) (at 3.81 1.905 0)
      (effects (font (size 1.27 1.27)))
    )
    (property "Value" "SMA_2" (id 1) (at 4.445 -0.635 0)
      (effects (font (size 1.27 1.27)))
    )
    (property "Footprint" "" (id 2) (at 4.445 -2.54 0)
      (effects (font (size 1.27 1.27)))
    )
    (property "Datasheet" "" (id 3) (at 0 0 0)
      (effects (font (size 1.524 1.524)))
    )
    (symbol "SMA_2_0_1"
      (arc (start -1.905 -0.508) (mid -1.1909 -1.5311) (end 0 -1.905)
        (stroke (width 0) (type default) (color 0 0 0 0))
        (fill (type none))
      )
      (arc (start 0 -1.905) (mid 1.905 0) (end 0 1.905)
        (stroke (width 0) (type default) (color 0 0 0 0))
        (fill (type none))
      )
      (circle (center 0 0) (radius 0.635)
        (stroke (width 0) (type default) (color 0 0 0 0))
        (fill (type outline))
      )
      (arc (start 0 1.905) (mid -1.2136 1.47) (end -1.905 0.381)
        (stroke (width 0) (type default) (color 0 0 0 0))
        (fill (type none))
      )
    )
    (symbol "SMA_2_1_1"
      (pin bidirectional line (at -3.175 0 0) (length 2.54)
        (name "RF" (effects (font (size 0 0))))
        (number "1" (effects (font (size 0 0))))
      )
      (pin passive line (at 0 -4.445 90) (length 2.54)
        (name "~" (effects (font (size 1.016 1.016))))
        (number "2" (effects (font (size 1.016 1.016))))
      )
    )
  )
  (symbol "rfi_shield_clip" (pin_names (offset 1.016)) (in_bom yes) (on_board yes)
    (property "Reference" "P" (id 0) (at 0 5.08 0)
      (effects (font (size 1.524 1.524)))
    )
    (property "Value" "rfi_shield_clip" (id 1) (at 0 7.62 0)
      (effects (font (size 1.524 1.524)))
    )
    (property "Footprint" "" (id 2) (at 0 0 0)
      (effects (font (size 1.524 1.524)))
    )
    (property "Datasheet" "" (id 3) (at 0 0 0)
      (effects (font (size 1.524 1.524)))
    )
    (symbol "rfi_shield_clip_0_1"
      (rectangle (start -2.54 3.81) (end 2.54 -1.27)
        (stroke (width 0) (type default) (color 0 0 0 0))
        (fill (type none))
      )
    )
    (symbol "rfi_shield_clip_1_1"
      (pin power_in line (at 0 -2.54 90) (length 1.27)
        (name "Gnd" (effects (font (size 1.016 1.016))))
        (number "1" (effects (font (size 1.016 1.016))))
      )
    )
  )
)
