EESchema Schematic File Version 4
EELAYER 30 0
EELAYER END
$Descr A3 16535 11693
encoding utf-8
Sheet 1 1
Title "RF Signal Divider"
Date "2020-07-16"
Rev "2.0"
Comp "Dyadic Pty Ltd"
Comment1 "2020"
Comment2 ""
Comment3 ""
Comment4 ""
$EndDescr
$Comp
L project:SMA_2 J4
U 1 1 5DDEC15F
P 6900 4250
F 0 "J4" H 7003 4240 50  0000 L CNN
F 1 "PORT1" H 7003 4149 50  0000 L CNN
F 2 "RF_SMA_Connectors:SMA_EDGE_4" H 7075 4150 50  0001 C CNN
F 3 "" H 6900 4250 60  0000 C CNN
	1    6900 4250
	1    0    0    -1  
$EndComp
$Comp
L project:SMA_2 J5
U 1 1 5DDEC1B8
P 4225 4450
F 0 "J5" H 4194 4690 50  0000 C CNN
F 1 "SUM" H 4194 4599 50  0000 C CNN
F 2 "RF_SMA_Connectors:SMA_EDGE_4" H 4400 4350 50  0001 C CNN
F 3 "" H 4225 4450 60  0000 C CNN
	1    4225 4450
	-1   0    0    -1  
$EndComp
$Comp
L project:SMA_2 J6
U 1 1 5DDEC284
P 6250 4650
F 0 "J6" H 6353 4640 50  0000 L CNN
F 1 "PORT2" H 6353 4549 50  0000 L CNN
F 2 "RF_SMA_Connectors:SMA_EDGE_4" H 6425 4550 50  0001 C CNN
F 3 "" H 6250 4650 60  0000 C CNN
	1    6250 4650
	1    0    0    -1  
$EndComp
$Comp
L project:ADP-2-1W U2
U 1 1 5DDEC50C
P 5200 4450
F 0 "U2" H 5200 4875 50  0000 C CNN
F 1 "PS2012G" H 5200 4784 50  0000 C CNN
F 2 "Splitters:SUSUMU_PS2012GT2-R50-T1" H 5050 4000 50  0001 C CNN
F 3 "" H 5150 4100 50  0001 C CNN
F 4 "Susumu" H 5200 4450 50  0001 C CNN "MFN"
F 5 "PS2012GT2-R50-T1" H 5200 4450 50  0001 C CNN "MFP"
F 6 "408-2050-1-ND" H 5200 4450 50  0001 C CNN "S1PN"
F 7 "Digi-Key" H 5200 4450 50  0001 C CNN "S1PL"
F 8 "754-PS2012GT2-R50-T1" H 5200 4450 50  0001 C CNN "S2PN"
F 9 "Mouser" H 5200 4450 50  0001 C CNN "S2PL"
F 10 "RF POWER DIVIDER 0HZ-17.5GHZ" H 5200 4450 50  0001 C CNN "Description"
F 11 "0805 (2012 Metric)" H 5200 4450 50  0001 C CNN "Package ID"
	1    5200 4450
	1    0    0    -1  
$EndComp
$Comp
L power:GND #PWR05
U 1 1 5DDEC7DA
P 6900 4425
F 0 "#PWR05" H 6900 4175 50  0001 C CNN
F 1 "GND" H 6905 4252 50  0000 C CNN
F 2 "" H 6900 4425 50  0001 C CNN
F 3 "" H 6900 4425 50  0001 C CNN
	1    6900 4425
	1    0    0    -1  
$EndComp
$Comp
L power:GND #PWR07
U 1 1 5DDEC824
P 6250 4825
F 0 "#PWR07" H 6250 4575 50  0001 C CNN
F 1 "GND" H 6255 4652 50  0000 C CNN
F 2 "" H 6250 4825 50  0001 C CNN
F 3 "" H 6250 4825 50  0001 C CNN
	1    6250 4825
	1    0    0    -1  
$EndComp
$Comp
L power:GND #PWR06
U 1 1 5DDEC837
P 4225 4625
F 0 "#PWR06" H 4225 4375 50  0001 C CNN
F 1 "GND" H 4230 4452 50  0000 C CNN
F 2 "" H 4225 4625 50  0001 C CNN
F 3 "" H 4225 4625 50  0001 C CNN
	1    4225 4625
	1    0    0    -1  
$EndComp
$Comp
L power:GND #PWR08
U 1 1 5DDEC84A
P 5000 4850
F 0 "#PWR08" H 5000 4600 50  0001 C CNN
F 1 "GND" H 5005 4677 50  0000 C CNN
F 2 "" H 5000 4850 50  0001 C CNN
F 3 "" H 5000 4850 50  0001 C CNN
	1    5000 4850
	1    0    0    -1  
$EndComp
Wire Wire Line
	5600 4250 6775 4250
Wire Wire Line
	5600 4650 6125 4650
Wire Wire Line
	4350 4450 4800 4450
$Comp
L project:SMA_2 J1
U 1 1 5DDECBEA
P 6875 2650
F 0 "J1" H 6978 2640 50  0000 L CNN
F 1 "PORT1" H 6978 2549 50  0000 L CNN
F 2 "RF_SMA_Connectors:SMA_EDGE_4" H 7050 2550 50  0001 C CNN
F 3 "" H 6875 2650 60  0000 C CNN
	1    6875 2650
	1    0    0    -1  
$EndComp
$Comp
L project:SMA_2 J2
U 1 1 5DDECBF0
P 4200 2850
F 0 "J2" H 4169 3090 50  0000 C CNN
F 1 "SUM" H 4169 2999 50  0000 C CNN
F 2 "RF_SMA_Connectors:SMA_EDGE_4" H 4375 2750 50  0001 C CNN
F 3 "" H 4200 2850 60  0000 C CNN
	1    4200 2850
	-1   0    0    -1  
$EndComp
$Comp
L project:SMA_2 J3
U 1 1 5DDECBF6
P 6225 3050
F 0 "J3" H 6328 3040 50  0000 L CNN
F 1 "PORT2" H 6328 2949 50  0000 L CNN
F 2 "RF_SMA_Connectors:SMA_EDGE_4" H 6400 2950 50  0001 C CNN
F 3 "" H 6225 3050 60  0000 C CNN
	1    6225 3050
	1    0    0    -1  
$EndComp
$Comp
L project:ADP-2-1W U1
U 1 1 5DDECC04
P 5175 2850
F 0 "U1" H 5175 3275 50  0000 C CNN
F 1 "PS3216G" H 5175 3184 50  0000 C CNN
F 2 "Splitters:SUSUMU_PS3216GT2-R50-T1" H 5025 2400 50  0001 C CNN
F 3 "" H 5125 2500 50  0001 C CNN
F 4 "Susumu" H 5175 2850 50  0001 C CNN "MFN"
F 5 "PS3216GT2-R50-T1" H 5175 2850 50  0001 C CNN "MFP"
F 6 "408-2051-1-ND" H 5175 2850 50  0001 C CNN "S1PN"
F 7 "Digi-Key" H 5175 2850 50  0001 C CNN "S1PL"
F 8 "754-PS3216GT2-R50-T1" H 5175 2850 50  0001 C CNN "S2PN"
F 9 "Mouser" H 5175 2850 50  0001 C CNN "S2PL"
F 10 "RF POWER DIVIDER 0HZ-17.5GHZ" H 5175 2850 50  0001 C CNN "Description"
F 11 "1206 (3216 Metric)" H 5175 2850 50  0001 C CNN "Package ID"
	1    5175 2850
	1    0    0    -1  
$EndComp
$Comp
L power:GND #PWR01
U 1 1 5DDECC0A
P 6875 2825
F 0 "#PWR01" H 6875 2575 50  0001 C CNN
F 1 "GND" H 6880 2652 50  0000 C CNN
F 2 "" H 6875 2825 50  0001 C CNN
F 3 "" H 6875 2825 50  0001 C CNN
	1    6875 2825
	1    0    0    -1  
$EndComp
$Comp
L power:GND #PWR03
U 1 1 5DDECC10
P 6225 3225
F 0 "#PWR03" H 6225 2975 50  0001 C CNN
F 1 "GND" H 6230 3052 50  0000 C CNN
F 2 "" H 6225 3225 50  0001 C CNN
F 3 "" H 6225 3225 50  0001 C CNN
	1    6225 3225
	1    0    0    -1  
$EndComp
$Comp
L power:GND #PWR02
U 1 1 5DDECC16
P 4200 3025
F 0 "#PWR02" H 4200 2775 50  0001 C CNN
F 1 "GND" H 4205 2852 50  0000 C CNN
F 2 "" H 4200 3025 50  0001 C CNN
F 3 "" H 4200 3025 50  0001 C CNN
	1    4200 3025
	1    0    0    -1  
$EndComp
$Comp
L power:GND #PWR04
U 1 1 5DDECC1C
P 4975 3250
F 0 "#PWR04" H 4975 3000 50  0001 C CNN
F 1 "GND" H 4980 3077 50  0000 C CNN
F 2 "" H 4975 3250 50  0001 C CNN
F 3 "" H 4975 3250 50  0001 C CNN
	1    4975 3250
	1    0    0    -1  
$EndComp
Wire Wire Line
	5575 2650 6750 2650
Wire Wire Line
	5575 3050 6100 3050
Wire Wire Line
	4325 2850 4775 2850
$Comp
L power:GND #PWR0101
U 1 1 5DDED17B
P 1350 3600
F 0 "#PWR0101" H 1350 3350 50  0001 C CNN
F 1 "GND" H 1355 3427 50  0000 C CNN
F 2 "" H 1350 3600 50  0001 C CNN
F 3 "" H 1350 3600 50  0001 C CNN
	1    1350 3600
	1    0    0    -1  
$EndComp
$Comp
L power:PWR_FLAG #FLG0101
U 1 1 5DDED1F4
P 1350 3600
F 0 "#FLG0101" H 1350 3675 50  0001 C CNN
F 1 "PWR_FLAG" H 1350 3774 50  0000 C CNN
F 2 "" H 1350 3600 50  0001 C CNN
F 3 "~" H 1350 3600 50  0001 C CNN
	1    1350 3600
	1    0    0    -1  
$EndComp
$Comp
L project:SMA_2 J10
U 1 1 5DDEE65C
P 11525 4200
F 0 "J10" H 11628 4190 50  0000 L CNN
F 1 "PORT1" H 11628 4099 50  0000 L CNN
F 2 "MMCX_Connectors:mmcx_th" H 11700 4100 50  0001 C CNN
F 3 "" H 11525 4200 60  0000 C CNN
	1    11525 4200
	1    0    0    -1  
$EndComp
$Comp
L project:SMA_2 J11
U 1 1 5DDEE662
P 8850 4400
F 0 "J11" H 8819 4640 50  0000 C CNN
F 1 "SUM" H 8819 4549 50  0000 C CNN
F 2 "MMCX_Connectors:mmcx_th" H 9025 4300 50  0001 C CNN
F 3 "" H 8850 4400 60  0000 C CNN
	1    8850 4400
	-1   0    0    -1  
$EndComp
$Comp
L project:SMA_2 J12
U 1 1 5DDEE668
P 10875 4600
F 0 "J12" H 10978 4590 50  0000 L CNN
F 1 "PORT2" H 10978 4499 50  0000 L CNN
F 2 "MMCX_Connectors:mmcx_th" H 11050 4500 50  0001 C CNN
F 3 "" H 10875 4600 60  0000 C CNN
	1    10875 4600
	1    0    0    -1  
$EndComp
$Comp
L project:ADP-2-1W U4
U 1 1 5DDEE676
P 9825 4400
F 0 "U4" H 9825 4825 50  0000 C CNN
F 1 "PS2012G" H 9825 4734 50  0000 C CNN
F 2 "Splitters:SUSUMU_PS2012GT2-R50-T1" H 9675 3950 50  0001 C CNN
F 3 "" H 9775 4050 50  0001 C CNN
F 4 "Susumu" H 9825 4400 50  0001 C CNN "MFN"
F 5 "PS2012GT2-R50-T1" H 9825 4400 50  0001 C CNN "MFP"
F 6 "408-2050-1-ND" H 9825 4400 50  0001 C CNN "S1PN"
F 7 "Digi-Key" H 9825 4400 50  0001 C CNN "S1PL"
F 8 "754-PS2012GT2-R50-T1" H 9825 4400 50  0001 C CNN "S2PN"
F 9 "Mouser" H 9825 4400 50  0001 C CNN "S2PL"
F 10 "RF POWER DIVIDER 0HZ-17.5GHZ" H 9825 4400 50  0001 C CNN "Description"
F 11 "0805 (2012 Metric)" H 9825 4400 50  0001 C CNN "Package ID"
	1    9825 4400
	1    0    0    -1  
$EndComp
$Comp
L power:GND #PWR013
U 1 1 5DDEE67C
P 11525 4375
F 0 "#PWR013" H 11525 4125 50  0001 C CNN
F 1 "GND" H 11530 4202 50  0000 C CNN
F 2 "" H 11525 4375 50  0001 C CNN
F 3 "" H 11525 4375 50  0001 C CNN
	1    11525 4375
	1    0    0    -1  
$EndComp
$Comp
L power:GND #PWR015
U 1 1 5DDEE682
P 10875 4775
F 0 "#PWR015" H 10875 4525 50  0001 C CNN
F 1 "GND" H 10880 4602 50  0000 C CNN
F 2 "" H 10875 4775 50  0001 C CNN
F 3 "" H 10875 4775 50  0001 C CNN
	1    10875 4775
	1    0    0    -1  
$EndComp
$Comp
L power:GND #PWR014
U 1 1 5DDEE688
P 8850 4575
F 0 "#PWR014" H 8850 4325 50  0001 C CNN
F 1 "GND" H 8855 4402 50  0000 C CNN
F 2 "" H 8850 4575 50  0001 C CNN
F 3 "" H 8850 4575 50  0001 C CNN
	1    8850 4575
	1    0    0    -1  
$EndComp
$Comp
L power:GND #PWR016
U 1 1 5DDEE68E
P 9625 4800
F 0 "#PWR016" H 9625 4550 50  0001 C CNN
F 1 "GND" H 9630 4627 50  0000 C CNN
F 2 "" H 9625 4800 50  0001 C CNN
F 3 "" H 9625 4800 50  0001 C CNN
	1    9625 4800
	1    0    0    -1  
$EndComp
Wire Wire Line
	10225 4200 11400 4200
Wire Wire Line
	10225 4600 10750 4600
Wire Wire Line
	8975 4400 9425 4400
$Comp
L project:SMA_2 J7
U 1 1 5DDEE697
P 11500 2600
F 0 "J7" H 11603 2590 50  0000 L CNN
F 1 "PORT1" H 11603 2499 50  0000 L CNN
F 2 "MMCX_Connectors:mmcx_th" H 11675 2500 50  0001 C CNN
F 3 "" H 11500 2600 60  0000 C CNN
	1    11500 2600
	1    0    0    -1  
$EndComp
$Comp
L project:SMA_2 J8
U 1 1 5DDEE69D
P 8825 2800
F 0 "J8" H 8794 3040 50  0000 C CNN
F 1 "SUM" H 8794 2949 50  0000 C CNN
F 2 "MMCX_Connectors:mmcx_th" H 9000 2700 50  0001 C CNN
F 3 "" H 8825 2800 60  0000 C CNN
	1    8825 2800
	-1   0    0    -1  
$EndComp
$Comp
L project:SMA_2 J9
U 1 1 5DDEE6A3
P 10850 3000
F 0 "J9" H 10953 2990 50  0000 L CNN
F 1 "PORT2" H 10953 2899 50  0000 L CNN
F 2 "MMCX_Connectors:mmcx_th" H 11025 2900 50  0001 C CNN
F 3 "" H 10850 3000 60  0000 C CNN
	1    10850 3000
	1    0    0    -1  
$EndComp
$Comp
L project:ADP-2-1W U3
U 1 1 5DDEE6B1
P 9800 2800
F 0 "U3" H 9800 3225 50  0000 C CNN
F 1 "PS3216G" H 9800 3134 50  0000 C CNN
F 2 "Splitters:SUSUMU_PS3216GT2-R50-T1" H 9650 2350 50  0001 C CNN
F 3 "" H 9750 2450 50  0001 C CNN
F 4 "Susumu" H 9800 2800 50  0001 C CNN "MFN"
F 5 "PS3216GT2-R50-T1" H 9800 2800 50  0001 C CNN "MFP"
F 6 "408-2051-1-ND" H 9800 2800 50  0001 C CNN "S1PN"
F 7 "Digi-Key" H 9800 2800 50  0001 C CNN "S1PL"
F 8 "754-PS3216GT2-R50-T1" H 9800 2800 50  0001 C CNN "S2PN"
F 9 "Mouser" H 9800 2800 50  0001 C CNN "S2PL"
F 10 "RF POWER DIVIDER 0HZ-17.5GHZ" H 9800 2800 50  0001 C CNN "Description"
F 11 "1206 (3216 Metric)" H 9800 2800 50  0001 C CNN "Package ID"
	1    9800 2800
	1    0    0    -1  
$EndComp
$Comp
L power:GND #PWR09
U 1 1 5DDEE6B7
P 11500 2775
F 0 "#PWR09" H 11500 2525 50  0001 C CNN
F 1 "GND" H 11505 2602 50  0000 C CNN
F 2 "" H 11500 2775 50  0001 C CNN
F 3 "" H 11500 2775 50  0001 C CNN
	1    11500 2775
	1    0    0    -1  
$EndComp
$Comp
L power:GND #PWR011
U 1 1 5DDEE6BD
P 10850 3175
F 0 "#PWR011" H 10850 2925 50  0001 C CNN
F 1 "GND" H 10855 3002 50  0000 C CNN
F 2 "" H 10850 3175 50  0001 C CNN
F 3 "" H 10850 3175 50  0001 C CNN
	1    10850 3175
	1    0    0    -1  
$EndComp
$Comp
L power:GND #PWR010
U 1 1 5DDEE6C3
P 8825 2975
F 0 "#PWR010" H 8825 2725 50  0001 C CNN
F 1 "GND" H 8830 2802 50  0000 C CNN
F 2 "" H 8825 2975 50  0001 C CNN
F 3 "" H 8825 2975 50  0001 C CNN
	1    8825 2975
	1    0    0    -1  
$EndComp
$Comp
L power:GND #PWR012
U 1 1 5DDEE6C9
P 9600 3200
F 0 "#PWR012" H 9600 2950 50  0001 C CNN
F 1 "GND" H 9605 3027 50  0000 C CNN
F 2 "" H 9600 3200 50  0001 C CNN
F 3 "" H 9600 3200 50  0001 C CNN
	1    9600 3200
	1    0    0    -1  
$EndComp
Wire Wire Line
	10200 2600 11375 2600
Wire Wire Line
	10200 3000 10725 3000
Wire Wire Line
	8950 2800 9400 2800
$Comp
L project:rfi_shield_clip P1
U 1 1 5DDEF080
P 4750 1200
F 0 "P1" H 4878 1219 60  0000 L CNN
F 1 "~" H 4878 1166 60  0000 L CNN
F 2 "RF_Shielding:S1721-46R" H 4750 1200 60  0001 C CNN
F 3 "" H 4750 1200 60  0000 C CNN
	1    4750 1200
	1    0    0    -1  
$EndComp
$Comp
L project:rfi_shield_clip P2
U 1 1 5DDEF17D
P 5200 1200
F 0 "P2" H 5328 1219 60  0000 L CNN
F 1 "~" H 5328 1166 60  0000 L CNN
F 2 "RF_Shielding:S1721-46R" H 5200 1200 60  0001 C CNN
F 3 "" H 5200 1200 60  0000 C CNN
	1    5200 1200
	1    0    0    -1  
$EndComp
$Comp
L project:rfi_shield_clip P3
U 1 1 5DDEF284
P 5650 1200
F 0 "P3" H 5778 1219 60  0000 L CNN
F 1 "~" H 5778 1166 60  0000 L CNN
F 2 "RF_Shielding:S1721-46R" H 5650 1200 60  0001 C CNN
F 3 "" H 5650 1200 60  0000 C CNN
	1    5650 1200
	1    0    0    -1  
$EndComp
$Comp
L project:rfi_shield_clip P4
U 1 1 5DDEF28A
P 6100 1200
F 0 "P4" H 6228 1219 60  0000 L CNN
F 1 "~" H 6228 1166 60  0000 L CNN
F 2 "RF_Shielding:S1721-46R" H 6100 1200 60  0001 C CNN
F 3 "" H 6100 1200 60  0000 C CNN
	1    6100 1200
	1    0    0    -1  
$EndComp
$Comp
L project:rfi_shield_clip P5
U 1 1 5DDEF661
P 9375 1250
F 0 "P5" H 9503 1269 60  0000 L CNN
F 1 "~" H 9503 1216 60  0000 L CNN
F 2 "RF_Shielding:S1721-46R" H 9375 1250 60  0001 C CNN
F 3 "" H 9375 1250 60  0000 C CNN
	1    9375 1250
	1    0    0    -1  
$EndComp
$Comp
L project:rfi_shield_clip P6
U 1 1 5DDEF667
P 9825 1250
F 0 "P6" H 9953 1269 60  0000 L CNN
F 1 "~" H 9953 1216 60  0000 L CNN
F 2 "RF_Shielding:S1721-46R" H 9825 1250 60  0001 C CNN
F 3 "" H 9825 1250 60  0000 C CNN
	1    9825 1250
	1    0    0    -1  
$EndComp
$Comp
L project:rfi_shield_clip P7
U 1 1 5DDEF66D
P 10275 1250
F 0 "P7" H 10403 1269 60  0000 L CNN
F 1 "~" H 10403 1216 60  0000 L CNN
F 2 "RF_Shielding:S1721-46R" H 10275 1250 60  0001 C CNN
F 3 "" H 10275 1250 60  0000 C CNN
	1    10275 1250
	1    0    0    -1  
$EndComp
$Comp
L project:rfi_shield_clip P8
U 1 1 5DDEF673
P 10725 1250
F 0 "P8" H 10853 1269 60  0000 L CNN
F 1 "~" H 10853 1216 60  0000 L CNN
F 2 "RF_Shielding:S1721-46R" H 10725 1250 60  0001 C CNN
F 3 "" H 10725 1250 60  0000 C CNN
	1    10725 1250
	1    0    0    -1  
$EndComp
$Comp
L power:GND #PWR017
U 1 1 5DDEF7FF
P 4750 1300
F 0 "#PWR017" H 4750 1050 50  0001 C CNN
F 1 "GND" H 4755 1127 50  0000 C CNN
F 2 "" H 4750 1300 50  0001 C CNN
F 3 "" H 4750 1300 50  0001 C CNN
	1    4750 1300
	1    0    0    -1  
$EndComp
$Comp
L power:GND #PWR018
U 1 1 5DDEF882
P 5200 1300
F 0 "#PWR018" H 5200 1050 50  0001 C CNN
F 1 "GND" H 5205 1127 50  0000 C CNN
F 2 "" H 5200 1300 50  0001 C CNN
F 3 "" H 5200 1300 50  0001 C CNN
	1    5200 1300
	1    0    0    -1  
$EndComp
$Comp
L power:GND #PWR019
U 1 1 5DDEF8BD
P 5650 1300
F 0 "#PWR019" H 5650 1050 50  0001 C CNN
F 1 "GND" H 5655 1127 50  0000 C CNN
F 2 "" H 5650 1300 50  0001 C CNN
F 3 "" H 5650 1300 50  0001 C CNN
	1    5650 1300
	1    0    0    -1  
$EndComp
$Comp
L power:GND #PWR020
U 1 1 5DDEF94A
P 6100 1300
F 0 "#PWR020" H 6100 1050 50  0001 C CNN
F 1 "GND" H 6105 1127 50  0000 C CNN
F 2 "" H 6100 1300 50  0001 C CNN
F 3 "" H 6100 1300 50  0001 C CNN
	1    6100 1300
	1    0    0    -1  
$EndComp
$Comp
L power:GND #PWR021
U 1 1 5DDEF9FD
P 9375 1350
F 0 "#PWR021" H 9375 1100 50  0001 C CNN
F 1 "GND" H 9380 1177 50  0000 C CNN
F 2 "" H 9375 1350 50  0001 C CNN
F 3 "" H 9375 1350 50  0001 C CNN
	1    9375 1350
	1    0    0    -1  
$EndComp
$Comp
L power:GND #PWR022
U 1 1 5DDEFA38
P 9825 1350
F 0 "#PWR022" H 9825 1100 50  0001 C CNN
F 1 "GND" H 9830 1177 50  0000 C CNN
F 2 "" H 9825 1350 50  0001 C CNN
F 3 "" H 9825 1350 50  0001 C CNN
	1    9825 1350
	1    0    0    -1  
$EndComp
$Comp
L power:GND #PWR023
U 1 1 5DDEFA73
P 10275 1350
F 0 "#PWR023" H 10275 1100 50  0001 C CNN
F 1 "GND" H 10280 1177 50  0000 C CNN
F 2 "" H 10275 1350 50  0001 C CNN
F 3 "" H 10275 1350 50  0001 C CNN
	1    10275 1350
	1    0    0    -1  
$EndComp
$Comp
L power:GND #PWR024
U 1 1 5DDEFB9E
P 10725 1350
F 0 "#PWR024" H 10725 1100 50  0001 C CNN
F 1 "GND" H 10730 1177 50  0000 C CNN
F 2 "" H 10725 1350 50  0001 C CNN
F 3 "" H 10725 1350 50  0001 C CNN
	1    10725 1350
	1    0    0    -1  
$EndComp
$Comp
L project:rfi_shield_clip P9
U 1 1 5DDF09F2
P 4750 1825
F 0 "P9" H 4878 1844 60  0000 L CNN
F 1 "~" H 4878 1791 60  0000 L CNN
F 2 "RF_Shielding:S1721-46R" H 4750 1825 60  0001 C CNN
F 3 "" H 4750 1825 60  0000 C CNN
	1    4750 1825
	1    0    0    -1  
$EndComp
$Comp
L project:rfi_shield_clip P10
U 1 1 5DDF09F8
P 5200 1825
F 0 "P10" H 5328 1844 60  0000 L CNN
F 1 "~" H 5328 1791 60  0000 L CNN
F 2 "RF_Shielding:S1721-46R" H 5200 1825 60  0001 C CNN
F 3 "" H 5200 1825 60  0000 C CNN
	1    5200 1825
	1    0    0    -1  
$EndComp
$Comp
L project:rfi_shield_clip P11
U 1 1 5DDF09FE
P 5650 1825
F 0 "P11" H 5778 1844 60  0000 L CNN
F 1 "~" H 5778 1791 60  0000 L CNN
F 2 "RF_Shielding:S1721-46R" H 5650 1825 60  0001 C CNN
F 3 "" H 5650 1825 60  0000 C CNN
	1    5650 1825
	1    0    0    -1  
$EndComp
$Comp
L project:rfi_shield_clip P12
U 1 1 5DDF0A04
P 6100 1825
F 0 "P12" H 6228 1844 60  0000 L CNN
F 1 "~" H 6228 1791 60  0000 L CNN
F 2 "RF_Shielding:S1721-46R" H 6100 1825 60  0001 C CNN
F 3 "" H 6100 1825 60  0000 C CNN
	1    6100 1825
	1    0    0    -1  
$EndComp
$Comp
L power:GND #PWR025
U 1 1 5DDF0A0A
P 4750 1925
F 0 "#PWR025" H 4750 1675 50  0001 C CNN
F 1 "GND" H 4755 1752 50  0000 C CNN
F 2 "" H 4750 1925 50  0001 C CNN
F 3 "" H 4750 1925 50  0001 C CNN
	1    4750 1925
	1    0    0    -1  
$EndComp
$Comp
L power:GND #PWR026
U 1 1 5DDF0A10
P 5200 1925
F 0 "#PWR026" H 5200 1675 50  0001 C CNN
F 1 "GND" H 5205 1752 50  0000 C CNN
F 2 "" H 5200 1925 50  0001 C CNN
F 3 "" H 5200 1925 50  0001 C CNN
	1    5200 1925
	1    0    0    -1  
$EndComp
$Comp
L power:GND #PWR027
U 1 1 5DDF0A16
P 5650 1925
F 0 "#PWR027" H 5650 1675 50  0001 C CNN
F 1 "GND" H 5655 1752 50  0000 C CNN
F 2 "" H 5650 1925 50  0001 C CNN
F 3 "" H 5650 1925 50  0001 C CNN
	1    5650 1925
	1    0    0    -1  
$EndComp
$Comp
L power:GND #PWR028
U 1 1 5DDF0A1C
P 6100 1925
F 0 "#PWR028" H 6100 1675 50  0001 C CNN
F 1 "GND" H 6105 1752 50  0000 C CNN
F 2 "" H 6100 1925 50  0001 C CNN
F 3 "" H 6100 1925 50  0001 C CNN
	1    6100 1925
	1    0    0    -1  
$EndComp
$Comp
L project:rfi_shield_clip P13
U 1 1 5DDF0DAE
P 9375 1825
F 0 "P13" H 9503 1844 60  0000 L CNN
F 1 "~" H 9503 1791 60  0000 L CNN
F 2 "RF_Shielding:S1721-46R" H 9375 1825 60  0001 C CNN
F 3 "" H 9375 1825 60  0000 C CNN
	1    9375 1825
	1    0    0    -1  
$EndComp
$Comp
L project:rfi_shield_clip P14
U 1 1 5DDF0DB4
P 9825 1825
F 0 "P14" H 9953 1844 60  0000 L CNN
F 1 "~" H 9953 1791 60  0000 L CNN
F 2 "RF_Shielding:S1721-46R" H 9825 1825 60  0001 C CNN
F 3 "" H 9825 1825 60  0000 C CNN
	1    9825 1825
	1    0    0    -1  
$EndComp
$Comp
L project:rfi_shield_clip P15
U 1 1 5DDF0DBA
P 10275 1825
F 0 "P15" H 10403 1844 60  0000 L CNN
F 1 "~" H 10403 1791 60  0000 L CNN
F 2 "RF_Shielding:S1721-46R" H 10275 1825 60  0001 C CNN
F 3 "" H 10275 1825 60  0000 C CNN
	1    10275 1825
	1    0    0    -1  
$EndComp
$Comp
L project:rfi_shield_clip P16
U 1 1 5DDF0DC0
P 10725 1825
F 0 "P16" H 10853 1844 60  0000 L CNN
F 1 "~" H 10853 1791 60  0000 L CNN
F 2 "RF_Shielding:S1721-46R" H 10725 1825 60  0001 C CNN
F 3 "" H 10725 1825 60  0000 C CNN
	1    10725 1825
	1    0    0    -1  
$EndComp
$Comp
L power:GND #PWR029
U 1 1 5DDF0DC6
P 9375 1925
F 0 "#PWR029" H 9375 1675 50  0001 C CNN
F 1 "GND" H 9380 1752 50  0000 C CNN
F 2 "" H 9375 1925 50  0001 C CNN
F 3 "" H 9375 1925 50  0001 C CNN
	1    9375 1925
	1    0    0    -1  
$EndComp
$Comp
L power:GND #PWR030
U 1 1 5DDF0DCC
P 9825 1925
F 0 "#PWR030" H 9825 1675 50  0001 C CNN
F 1 "GND" H 9830 1752 50  0000 C CNN
F 2 "" H 9825 1925 50  0001 C CNN
F 3 "" H 9825 1925 50  0001 C CNN
	1    9825 1925
	1    0    0    -1  
$EndComp
$Comp
L power:GND #PWR031
U 1 1 5DDF0DD2
P 10275 1925
F 0 "#PWR031" H 10275 1675 50  0001 C CNN
F 1 "GND" H 10280 1752 50  0000 C CNN
F 2 "" H 10275 1925 50  0001 C CNN
F 3 "" H 10275 1925 50  0001 C CNN
	1    10275 1925
	1    0    0    -1  
$EndComp
$Comp
L power:GND #PWR032
U 1 1 5DDF0DD8
P 10725 1925
F 0 "#PWR032" H 10725 1675 50  0001 C CNN
F 1 "GND" H 10730 1752 50  0000 C CNN
F 2 "" H 10725 1925 50  0001 C CNN
F 3 "" H 10725 1925 50  0001 C CNN
	1    10725 1925
	1    0    0    -1  
$EndComp
$Comp
L device:R R1
U 1 1 5F0F9AE7
P 5350 6550
F 0 "R1" V 5143 6550 50  0000 C CNN
F 1 "49.9" V 5234 6550 50  0000 C CNN
F 2 "Resistor_SMD:R_0402_1005Metric" V 5280 6550 50  0001 C CNN
F 3 "~" H 5350 6550 50  0001 C CNN
	1    5350 6550
	0    1    1    0   
$EndComp
$Comp
L project:SMA_2 J13
U 1 1 5F0F9C41
P 4425 6850
F 0 "J13" H 4394 7090 50  0000 C CNN
F 1 "IN" H 4394 6999 50  0000 C CNN
F 2 "RF_SMA_Connectors:SMA_EDGE_4" H 4600 6750 50  0001 C CNN
F 3 "" H 4425 6850 60  0000 C CNN
	1    4425 6850
	-1   0    0    -1  
$EndComp
$Comp
L project:SMA_2 J15
U 1 1 5F0F9CF6
P 6525 6550
F 0 "J15" H 6628 6540 50  0000 L CNN
F 1 "PORT1" H 6628 6449 50  0000 L CNN
F 2 "RF_SMA_Connectors:SMA_EDGE_4" H 6700 6450 50  0001 C CNN
F 3 "" H 6525 6550 60  0000 C CNN
	1    6525 6550
	1    0    0    -1  
$EndComp
$Comp
L project:SMA_2 J14
U 1 1 5F0F9D98
P 6175 7150
F 0 "J14" H 6278 7140 50  0000 L CNN
F 1 "PORT2" H 6278 7049 50  0000 L CNN
F 2 "RF_SMA_Connectors:SMA_EDGE_4" H 6350 7050 50  0001 C CNN
F 3 "" H 6175 7150 60  0000 C CNN
	1    6175 7150
	1    0    0    -1  
$EndComp
$Comp
L device:R R2
U 1 1 5F0FA229
P 5350 7150
F 0 "R2" V 5143 7150 50  0000 C CNN
F 1 "49.9" V 5234 7150 50  0000 C CNN
F 2 "Resistor_SMD:R_0402_1005Metric" V 5280 7150 50  0001 C CNN
F 3 "~" H 5350 7150 50  0001 C CNN
	1    5350 7150
	0    1    1    0   
$EndComp
Wire Wire Line
	5200 6550 5000 6550
Wire Wire Line
	5000 6550 5000 6850
Wire Wire Line
	5000 7150 5200 7150
Wire Wire Line
	4550 6850 5000 6850
Connection ~ 5000 6850
Wire Wire Line
	5000 6850 5000 7150
Wire Wire Line
	5500 6550 6400 6550
Wire Wire Line
	5500 7150 6050 7150
$Comp
L power:GND #PWR033
U 1 1 5F0FB207
P 4425 7025
F 0 "#PWR033" H 4425 6775 50  0001 C CNN
F 1 "GND" H 4430 6852 50  0000 C CNN
F 2 "" H 4425 7025 50  0001 C CNN
F 3 "" H 4425 7025 50  0001 C CNN
	1    4425 7025
	1    0    0    -1  
$EndComp
$Comp
L power:GND #PWR035
U 1 1 5F0FB43D
P 6525 6725
F 0 "#PWR035" H 6525 6475 50  0001 C CNN
F 1 "GND" H 6530 6552 50  0000 C CNN
F 2 "" H 6525 6725 50  0001 C CNN
F 3 "" H 6525 6725 50  0001 C CNN
	1    6525 6725
	1    0    0    -1  
$EndComp
$Comp
L power:GND #PWR034
U 1 1 5F0FB526
P 6175 7325
F 0 "#PWR034" H 6175 7075 50  0001 C CNN
F 1 "GND" H 6180 7152 50  0000 C CNN
F 2 "" H 6175 7325 50  0001 C CNN
F 3 "" H 6175 7325 50  0001 C CNN
	1    6175 7325
	1    0    0    -1  
$EndComp
$Comp
L device:R R3
U 1 1 5F14B7F4
P 10150 6550
F 0 "R3" V 9943 6550 50  0000 C CNN
F 1 "49.9" V 10034 6550 50  0000 C CNN
F 2 "Resistor_SMD:R_0603_1608Metric" V 10080 6550 50  0001 C CNN
F 3 "~" H 10150 6550 50  0001 C CNN
	1    10150 6550
	0    1    1    0   
$EndComp
$Comp
L project:SMA_2 J16
U 1 1 5F14B7FE
P 9225 6850
F 0 "J16" H 9194 7090 50  0000 C CNN
F 1 "IN" H 9194 6999 50  0000 C CNN
F 2 "RF_SMA_Connectors:SMA_EDGE_4" H 9400 6750 50  0001 C CNN
F 3 "" H 9225 6850 60  0000 C CNN
	1    9225 6850
	-1   0    0    -1  
$EndComp
$Comp
L project:SMA_2 J18
U 1 1 5F14B808
P 11325 6550
F 0 "J18" H 11428 6540 50  0000 L CNN
F 1 "PORT1" H 11428 6449 50  0000 L CNN
F 2 "RF_SMA_Connectors:SMA_EDGE_4" H 11500 6450 50  0001 C CNN
F 3 "" H 11325 6550 60  0000 C CNN
	1    11325 6550
	1    0    0    -1  
$EndComp
$Comp
L project:SMA_2 J17
U 1 1 5F14B812
P 10975 7150
F 0 "J17" H 11078 7140 50  0000 L CNN
F 1 "PORT2" H 11078 7049 50  0000 L CNN
F 2 "RF_SMA_Connectors:SMA_EDGE_4" H 11150 7050 50  0001 C CNN
F 3 "" H 10975 7150 60  0000 C CNN
	1    10975 7150
	1    0    0    -1  
$EndComp
$Comp
L device:R R4
U 1 1 5F14B81C
P 10150 7150
F 0 "R4" V 9943 7150 50  0000 C CNN
F 1 "49.9" V 10034 7150 50  0000 C CNN
F 2 "Resistor_SMD:R_0603_1608Metric" V 10080 7150 50  0001 C CNN
F 3 "~" H 10150 7150 50  0001 C CNN
	1    10150 7150
	0    1    1    0   
$EndComp
Wire Wire Line
	10000 6550 9800 6550
Wire Wire Line
	9800 6550 9800 6850
Wire Wire Line
	9800 7150 10000 7150
Wire Wire Line
	9350 6850 9800 6850
Connection ~ 9800 6850
Wire Wire Line
	9800 6850 9800 7150
Wire Wire Line
	10300 6550 11200 6550
Wire Wire Line
	10300 7150 10850 7150
$Comp
L power:GND #PWR036
U 1 1 5F14B82E
P 9225 7025
F 0 "#PWR036" H 9225 6775 50  0001 C CNN
F 1 "GND" H 9230 6852 50  0000 C CNN
F 2 "" H 9225 7025 50  0001 C CNN
F 3 "" H 9225 7025 50  0001 C CNN
	1    9225 7025
	1    0    0    -1  
$EndComp
$Comp
L power:GND #PWR038
U 1 1 5F14B838
P 11325 6725
F 0 "#PWR038" H 11325 6475 50  0001 C CNN
F 1 "GND" H 11330 6552 50  0000 C CNN
F 2 "" H 11325 6725 50  0001 C CNN
F 3 "" H 11325 6725 50  0001 C CNN
	1    11325 6725
	1    0    0    -1  
$EndComp
$Comp
L power:GND #PWR037
U 1 1 5F14B842
P 10975 7325
F 0 "#PWR037" H 10975 7075 50  0001 C CNN
F 1 "GND" H 10980 7152 50  0000 C CNN
F 2 "" H 10975 7325 50  0001 C CNN
F 3 "" H 10975 7325 50  0001 C CNN
	1    10975 7325
	1    0    0    -1  
$EndComp
$Comp
L project:rfi_shield_clip P17
U 1 1 5F1F786F
P 7250 7950
F 0 "P17" H 7378 7969 60  0000 L CNN
F 1 "~" H 7378 7916 60  0000 L CNN
F 2 "RF_Shielding:S1721-46R" H 7250 7950 60  0001 C CNN
F 3 "" H 7250 7950 60  0000 C CNN
	1    7250 7950
	1    0    0    -1  
$EndComp
$Comp
L project:rfi_shield_clip P19
U 1 1 5F1F7879
P 7700 7950
F 0 "P19" H 7828 7969 60  0000 L CNN
F 1 "~" H 7828 7916 60  0000 L CNN
F 2 "RF_Shielding:S1721-46R" H 7700 7950 60  0001 C CNN
F 3 "" H 7700 7950 60  0000 C CNN
	1    7700 7950
	1    0    0    -1  
$EndComp
$Comp
L project:rfi_shield_clip P21
U 1 1 5F1F7883
P 8150 7950
F 0 "P21" H 8278 7969 60  0000 L CNN
F 1 "~" H 8278 7916 60  0000 L CNN
F 2 "RF_Shielding:S1721-46R" H 8150 7950 60  0001 C CNN
F 3 "" H 8150 7950 60  0000 C CNN
	1    8150 7950
	1    0    0    -1  
$EndComp
$Comp
L project:rfi_shield_clip P23
U 1 1 5F1F788D
P 8600 7950
F 0 "P23" H 8728 7969 60  0000 L CNN
F 1 "~" H 8728 7916 60  0000 L CNN
F 2 "RF_Shielding:S1721-46R" H 8600 7950 60  0001 C CNN
F 3 "" H 8600 7950 60  0000 C CNN
	1    8600 7950
	1    0    0    -1  
$EndComp
$Comp
L power:GND #PWR039
U 1 1 5F1F7897
P 7250 8050
F 0 "#PWR039" H 7250 7800 50  0001 C CNN
F 1 "GND" H 7255 7877 50  0000 C CNN
F 2 "" H 7250 8050 50  0001 C CNN
F 3 "" H 7250 8050 50  0001 C CNN
	1    7250 8050
	1    0    0    -1  
$EndComp
$Comp
L power:GND #PWR041
U 1 1 5F1F78A1
P 7700 8050
F 0 "#PWR041" H 7700 7800 50  0001 C CNN
F 1 "GND" H 7705 7877 50  0000 C CNN
F 2 "" H 7700 8050 50  0001 C CNN
F 3 "" H 7700 8050 50  0001 C CNN
	1    7700 8050
	1    0    0    -1  
$EndComp
$Comp
L power:GND #PWR043
U 1 1 5F1F78AB
P 8150 8050
F 0 "#PWR043" H 8150 7800 50  0001 C CNN
F 1 "GND" H 8155 7877 50  0000 C CNN
F 2 "" H 8150 8050 50  0001 C CNN
F 3 "" H 8150 8050 50  0001 C CNN
	1    8150 8050
	1    0    0    -1  
$EndComp
$Comp
L power:GND #PWR045
U 1 1 5F1F78B5
P 8600 8050
F 0 "#PWR045" H 8600 7800 50  0001 C CNN
F 1 "GND" H 8605 7877 50  0000 C CNN
F 2 "" H 8600 8050 50  0001 C CNN
F 3 "" H 8600 8050 50  0001 C CNN
	1    8600 8050
	1    0    0    -1  
$EndComp
$Comp
L project:rfi_shield_clip P18
U 1 1 5F1F78BF
P 7250 8575
F 0 "P18" H 7378 8594 60  0000 L CNN
F 1 "~" H 7378 8541 60  0000 L CNN
F 2 "RF_Shielding:S1721-46R" H 7250 8575 60  0001 C CNN
F 3 "" H 7250 8575 60  0000 C CNN
	1    7250 8575
	1    0    0    -1  
$EndComp
$Comp
L project:rfi_shield_clip P20
U 1 1 5F1F78C9
P 7700 8575
F 0 "P20" H 7828 8594 60  0000 L CNN
F 1 "~" H 7828 8541 60  0000 L CNN
F 2 "RF_Shielding:S1721-46R" H 7700 8575 60  0001 C CNN
F 3 "" H 7700 8575 60  0000 C CNN
	1    7700 8575
	1    0    0    -1  
$EndComp
$Comp
L project:rfi_shield_clip P22
U 1 1 5F1F78D3
P 8150 8575
F 0 "P22" H 8278 8594 60  0000 L CNN
F 1 "~" H 8278 8541 60  0000 L CNN
F 2 "RF_Shielding:S1721-46R" H 8150 8575 60  0001 C CNN
F 3 "" H 8150 8575 60  0000 C CNN
	1    8150 8575
	1    0    0    -1  
$EndComp
$Comp
L project:rfi_shield_clip P24
U 1 1 5F1F78DD
P 8600 8575
F 0 "P24" H 8728 8594 60  0000 L CNN
F 1 "~" H 8728 8541 60  0000 L CNN
F 2 "RF_Shielding:S1721-46R" H 8600 8575 60  0001 C CNN
F 3 "" H 8600 8575 60  0000 C CNN
	1    8600 8575
	1    0    0    -1  
$EndComp
$Comp
L power:GND #PWR040
U 1 1 5F1F78E7
P 7250 8675
F 0 "#PWR040" H 7250 8425 50  0001 C CNN
F 1 "GND" H 7255 8502 50  0000 C CNN
F 2 "" H 7250 8675 50  0001 C CNN
F 3 "" H 7250 8675 50  0001 C CNN
	1    7250 8675
	1    0    0    -1  
$EndComp
$Comp
L power:GND #PWR042
U 1 1 5F1F78F1
P 7700 8675
F 0 "#PWR042" H 7700 8425 50  0001 C CNN
F 1 "GND" H 7705 8502 50  0000 C CNN
F 2 "" H 7700 8675 50  0001 C CNN
F 3 "" H 7700 8675 50  0001 C CNN
	1    7700 8675
	1    0    0    -1  
$EndComp
$Comp
L power:GND #PWR044
U 1 1 5F1F78FB
P 8150 8675
F 0 "#PWR044" H 8150 8425 50  0001 C CNN
F 1 "GND" H 8155 8502 50  0000 C CNN
F 2 "" H 8150 8675 50  0001 C CNN
F 3 "" H 8150 8675 50  0001 C CNN
	1    8150 8675
	1    0    0    -1  
$EndComp
$Comp
L power:GND #PWR046
U 1 1 5F1F7905
P 8600 8675
F 0 "#PWR046" H 8600 8425 50  0001 C CNN
F 1 "GND" H 8605 8502 50  0000 C CNN
F 2 "" H 8600 8675 50  0001 C CNN
F 3 "" H 8600 8675 50  0001 C CNN
	1    8600 8675
	1    0    0    -1  
$EndComp
$EndSCHEMATC
