{"measured_data": {"5.0": [19.74374, 38.91905, 58.2194, 77.42822000000001, 96.57722000000001, 115.75670000000001, 134.88629999999998, 153.9464, 172.88400000000001, 191.94559999999998, 210.9776, 230.1731, 249.2318, 268.3058, 287.491, 306.2594], "10.0": [19.37592, 38.50237, 57.655879999999996, 76.65679, 95.62262000000001, 114.5617, 133.45770000000002, 152.282, 171.09750000000003, 189.98160000000001, 208.9237, 227.7122, 246.62890000000002, 265.6319, 284.5299, 303.1368], "15.0": [19.06281, 37.8727, 56.687870000000004, 75.30742, 93.98558, 112.6044, 131.2293, 149.6778, 168.245, 186.6717, 205.0002, 223.5422, 242.0584, 260.68350000000004, 279.32099999999997, 297.5342], "20.0": [18.942130000000002, 37.60907, 56.23189, 74.75253, 93.31923, 111.8033, 130.22729999999999, 148.5671, 166.93859999999998, 185.4178, 203.7003, 222.20010000000002, 240.57670000000002, 259.0427, 277.48479999999995, 295.63620000000003], "25.0": [18.44635, 36.62632, 54.81797, 72.81931, 90.81857000000001, 108.9822, 126.8407, 144.6884, 162.60479999999998, 180.5325, 198.24339999999998, 216.3669, 234.2827, 252.31930000000003, 270.363, 288.0631], "30.0": [18.35549, 36.2877, 54.30347, 72.10803, 89.97636, 107.8436, 125.64719999999998, 143.3108, 161.03990000000002, 178.7648, 196.5324, 214.40390000000002, 232.1384, 249.9254, 267.6337, 285.1746], "35.0": [18.15072, 35.882600000000004, 53.63249, 71.26741, 88.89277, 106.46419999999999, 124.1619, 141.5285, 159.1308, 176.6587, 194.0798, 211.6498, 229.173, 246.7871, 264.39439999999996, 281.673], "40.0": [17.994, 35.44997, 53.01275, 70.36366, 87.77037, 105.1315, 122.4965, 139.69029999999998, 156.9576, 174.3221, 191.64129999999997, 208.8593, 226.2038, 243.5984, 260.88939999999997, 277.941], "45.0": [17.760209999999997, 34.96744, 52.16102, 69.37649, 86.57825, 103.6503, 120.7637, 137.72029999999998, 154.7865, 171.7987, 188.8792, 205.924, 223.0442, 240.0739, 257.2313, 273.95930000000004], "50.0": [17.5334, 34.45224, 51.5397, 68.46959, 85.42673, 102.2082, 119.0622, 135.85, 152.64749999999998, 169.3482, 186.1748, 202.8462, 219.887, 236.7783, 253.5278, 269.9934], "55.0": [17.32096, 33.93357, 50.49796, 67.12290999999999, 83.68792, 100.22, 116.7541, 133.2046, 149.54319999999998, 166.0208, 182.4368, 198.947, 215.4231, 231.9447, 248.4161, 264.6408], "60.0": [16.90253, 33.012060000000005, 49.16408, 65.25066, 81.31623, 97.43647, 113.4684, 129.4122, 145.41879999999998, 161.3351, 177.39659999999998, 193.3132, 209.35119999999998, 225.41320000000002, 241.4347, 257.0378], "65.0": [16.39079, 31.749769999999998, 47.33359, 62.803250000000006, 78.36489, 93.86198, 109.3304, 124.596, 139.9695, 155.4012, 170.8045, 186.0551, 201.5506, 216.9323, 232.2553, 247.3119], "70.0": [15.66523, 30.51187, 45.378080000000004, 60.19463, 74.98898, 89.81396, 104.544, 119.2889, 133.908, 148.6645, 163.2444, 178.00830000000002, 192.7372, 207.447, 222.137, 236.65800000000002], "75.0": [15.13989, 29.214489999999998, 43.360580000000006, 57.42548, 71.68521999999999, 85.73984, 99.9542, 113.9439, 127.9032, 141.97029999999998, 155.9169, 169.9033, 184.0207, 197.93069999999997, 212.1142, 225.9846], "80.0": [14.56003, 27.92666, 41.51331, 55.0382, 68.56619, 82.08184, 95.52677, 108.9462, 122.42060000000001, 135.8365, 149.1915, 162.6557, 176.0325, 189.401, 202.9507, 216.0263], "85.0": [13.98098, 26.851219999999998, 39.853609999999996, 52.86266, 65.81890999999999, 78.80408, 91.78656000000001, 104.5642, 117.464, 130.2497, 143.1438, 155.9467, 168.80419999999998, 181.76819999999998, 194.5667, 207.07410000000002], "90.0": [13.50422, 25.84662, 38.27309, 50.71425, 63.098299999999995, 75.49941, 87.93679999999999, 100.1579, 112.3956, 124.7901, 137.0395, 149.3622, 161.64770000000001, 173.977, 186.3511, 198.2251], "95.0": [12.91479, 24.45731, 36.28014, 47.99375, 59.79319, 71.47922, 83.21889, 94.78765, 106.51639999999999, 118.0754, 129.75629999999998, 141.44209999999998, 152.98049999999998, 164.59480000000002, 176.1229, 187.5831], "100.0": [11.81138, 22.25688, 32.91196, 43.43365, 54.19762, 64.75153999999999, 75.35407, 85.86900999999999, 96.39309, 107.0408, 117.5218, 128.0272, 138.49800000000002, 148.9838, 159.5896, 169.8181]},
 "linear_fits":
 {
     "5.0": [0.29843161833486676, 0.9497827499998844, 0.00014370580095885428, 0.08893238522351844],
     "10.0": [0.2954292408072867, 0.8963354999997812, 0.0001571119166510593, 0.09722878612876244],
     "15.0": [0.2898524641528628, 1.0380145000001055, 0.00020861592564202816, 0.1291020675729918],
     "20.0": [0.288091132121609, 0.9315334999998103, 0.00016154260897361297, 0.09997071853780162],
     "25.0": [0.28062153814181334, 0.8928532499997506, 0.00016029809227031865, 0.09920057812681402],
     "30.0": [0.27788184489732204, 0.9226357499998044, 0.00014326482048778054, 0.08865951722081769],
     "35.0": [0.27439817394143207, 0.9478427499998815, 0.0001434364340431491, 0.08876577451517699],
     "40.0": [0.27072234857377697, 0.9971642499999629, 0.00013346385608484335, 0.08259419266494898],
     "45.0": [0.26687048599970004, 0.9896312385126531, 0.0001371092376262806, 0.08485017179136824],
     "50.0": [0.2629753759175101, 1.0504742500000472, 0.00016283032840138411, 0.1007676330654176],
     "55.0": [0.25759932444691014, 1.1231250000002806, 0.00013044378441738939, 0.08072521033056128],
     "60.0": [0.25024252504432054, 1.159518250000302, 0.00013696154458032144, 0.08475875749826085],
     "65.0": [0.2407359942538586, 1.2090610000004014, 0.00016017392368466806, 0.0991236670239383],
     "70.0": [0.2301683715516296, 1.2377840000004743, 0.00013547860865507794, 0.08384102514703011],
     "75.0": [0.21963268933653324, 1.2827857500005346, 0.00012985738627479732, 0.08036231115976314],
     "80.0": [0.2100551084541593, 1.2721460000005431, 0.0001288146422535466, 0.07971700355978471],
     "85.0": [0.2013353570754639, 1.3197920000006356, 0.0001558918426211747, 0.09647376099674483],
     "90.0": [0.19262088357933807, 1.3904199455549628, 0.00014261519681145072, 0.08825747230005788],
     "95.0": [0.18215177803763202, 1.4092102467238283, 0.000144879586712878, 0.08965881383367692],
     "100.0": [0.1648446272959725, 1.3531790000007144, 0.0001249673024034107, 0.07733609804799187]}}
