EESchema Schematic File Version 4
EELAYER 30 0
EELAYER END
$Descr A4 11693 8268
encoding utf-8
Sheet 2 2
Title "AD9913 DDS Output Amp"
Date "2019-01-11"
Rev "1.0"
Comp "Dyadic Pty Ltd"
Comment1 ""
Comment2 ""
Comment3 ""
Comment4 ""
$EndDescr
$Comp
L device:CP_Small C27
U 1 1 5C480D57
P 6125 1825
F 0 "C27" H 6213 1871 50  0000 L CNN
F 1 "2.2u" H 6213 1780 50  0000 L CNN
F 2 "Capacitor_SMD:C_0805_2012Metric" H 6125 1825 50  0001 C CNN
F 3 "~" H 6125 1825 50  0001 C CNN
F 4 "Kemet" H 6125 1825 50  0001 C CNN "MFN"
F 5 "C0805C225J4RECTU" H 6125 1825 50  0001 C CNN "MFP"
F 6 "80-C0805C225J4RECTU" H 6125 1825 50  0001 C CNN "S1PN"
F 7 "Mouser" H 6125 1825 50  0001 C CNN "S1PL"
F 8 "16V 2.2uF X7R 0805 5%" H 6125 1825 50  0001 C CNN "Description"
F 9 "0805 (2012 metric)" H 6125 1825 50  0001 C CNN "Package ID"
F 10 "amp" H 6125 1825 50  0001 C CNN "variant"
	1    6125 1825
	1    0    0    -1  
$EndComp
$Comp
L project:OPA847 U6
U 1 1 5C481386
P 5575 4725
AR Path="/5C481386" Ref="U6"  Part="1" 
AR Path="/5C5EFEA2/5C481386" Ref="U6"  Part="1" 
F 0 "U6" H 5700 4900 60  0000 L CNN
F 1 "OPA847" H 5600 4550 60  0000 L CNN
F 2 "Package_TO_SOT_SMD:SOT-23-6" H 5575 4725 60  0001 C CNN
F 3 "" H 6016 4619 60  0001 L CNN
F 4 "Texas Instruments" H 8075 4725 50  0001 C CNN "MFN"
F 5 "OPA847IDBVT" H 8075 4725 50  0001 C CNN "MFP"
F 6 "595-OPA847IDBVT" H 8075 4725 50  0001 C CNN "S1PN"
F 7 "Mouser" H 8075 4725 50  0001 C CNN "S1PL"
F 8 "296-15172-1-ND" H 8075 4725 50  0001 C CNN "S2PN"
F 9 "Digi-Key" H 8075 4725 50  0001 C CNN "S2PL"
F 10 "High Speed Operational Amplifiers Wdebnd Ult-Lo Noise Voltage Feedback" H 8075 4725 50  0001 C CNN "Description"
F 11 "SOT-23-6" H 8075 4725 50  0001 C CNN "Package ID"
F 12 "amp" H 5575 4725 50  0001 C CNN "variant"
	1    5575 4725
	1    0    0    -1  
$EndComp
$Comp
L device:R R23
U 1 1 5C49969E
P 4875 5125
F 0 "R23" H 4945 5171 50  0000 L CNN
F 1 "39" H 4945 5080 50  0000 L CNN
F 2 "Resistor_SMD:R_0603_1608Metric" V 4805 5125 50  0001 C CNN
F 3 "~" H 4875 5125 50  0001 C CNN
F 4 "Yageo" H 4875 5125 50  0001 C CNN "MFN"
F 5 "RC0603FR-0739RL" H 4875 5125 50  0001 C CNN "MFP"
F 6 "603-RC0603FR-0739RL" H 4875 5125 50  0001 C CNN "S1PN"
F 7 "Mouser" H 4875 5125 50  0001 C CNN "S1PL"
F 8 "311-39.0HRCT-ND" H 4875 5125 50  0001 C CNN "S2PN"
F 9 "Digi-Key" H 4875 5125 50  0001 C CNN "S2PL"
F 10 "RES SMD 39 OHM 1% 1/10W 0603" H 4875 5125 50  0001 C CNN "Description"
F 11 "0603 (1608 Metric)" H 4875 5125 50  0001 C CNN "Package ID"
F 12 "amp" H 4875 5125 50  0001 C CNN "variant"
	1    4875 5125
	1    0    0    -1  
$EndComp
$Comp
L device:R R22
U 1 1 5C49997B
P 4575 4825
F 0 "R22" V 4675 4825 50  0000 C CNN
F 1 "15" V 4775 4825 50  0000 C CNN
F 2 "Resistor_SMD:R_0603_1608Metric" V 4505 4825 50  0001 C CNN
F 3 "~" H 4575 4825 50  0001 C CNN
F 4 "Yageo" H 4575 4825 50  0001 C CNN "MFN"
F 5 "RC0603FR-0715RL" H 4575 4825 50  0001 C CNN "MFP"
F 6 "603-RC0603FR-0715RL" H 4575 4825 50  0001 C CNN "S1PN"
F 7 "Mouser" H 4575 4825 50  0001 C CNN "S1PL"
F 8 "311-15.0HRCT-ND" H 4575 4825 50  0001 C CNN "S2PN"
F 9 "Digi-Key" H 4575 4825 50  0001 C CNN "S2PL"
F 10 "RES SMD 15 OHM 1% 1/10W 0603" H 4575 4825 50  0001 C CNN "Description"
F 11 "0603 (1608 Metric)" H 4575 4825 50  0001 C CNN "Package ID"
F 12 "amp" V 4575 4825 50  0001 C CNN "variant"
	1    4575 4825
	0    1    1    0   
$EndComp
$Comp
L device:R R19
U 1 1 5C4999D9
P 5175 4075
F 0 "R19" V 4968 4075 50  0000 C CNN
F 1 "845" V 5059 4075 50  0000 C CNN
F 2 "Resistor_SMD:R_0603_1608Metric" V 5105 4075 50  0001 C CNN
F 3 "~" H 5175 4075 50  0001 C CNN
F 4 "Yageo" H 5175 4075 50  0001 C CNN "MFN"
F 5 "RC0603FR-07845RL" H 5175 4075 50  0001 C CNN "MFP"
F 6 "603-RC0603FR-07845RL" H 5175 4075 50  0001 C CNN "S1PN"
F 7 "Mouser" H 5175 4075 50  0001 C CNN "S1PL"
F 8 "311-845HRCT-ND" H 5175 4075 50  0001 C CNN "S2PN"
F 9 "Digi-Key" H 5175 4075 50  0001 C CNN "S2PL"
F 10 "845 Ohms ±1% 0.1W, 1/10W, 0603" H 5175 4075 50  0001 C CNN "Description"
F 11 "0603 (1608 Metric)" H 5175 4075 50  0001 C CNN "Package ID"
F 12 "amp" V 5175 4075 50  0001 C CNN "variant"
	1    5175 4075
	0    1    1    0   
$EndComp
$Comp
L device:L_Small FB1
U 1 1 5C499B46
P 5575 3175
F 0 "FB1" H 5622 3175 50  0000 L CNN
F 1 "~" H 5622 3130 50  0000 L CNN
F 2 "Capacitor_SMD:C_0805_2012Metric" H 5575 3175 50  0001 C CNN
F 3 "~" H 5575 3175 50  0001 C CNN
F 4 "Fair-Rite" H 5575 3175 50  0001 C CNN "MFN"
F 5 "2508056017Y2" H 5575 3175 50  0001 C CNN "MFP"
F 6 "623-2508056017Y2" H 5575 3175 50  0001 C CNN "S1PN"
F 7 "Mouser" H 5575 3175 50  0001 C CNN "S1PL"
F 8 "1838838" H 5575 3175 50  0001 C CNN "S2PN"
F 9 "Element14" H 5575 3175 50  0001 C CNN "S2PL"
F 10 "Ferrite Beads MultLyr Chip Bead 600ohm 0805 2000mA" H 5575 3175 50  0001 C CNN "Description"
F 11 "0805 (2012 Metric)" H 5575 3175 50  0001 C CNN "Package ID"
F 12 "amp" H 5575 3175 50  0001 C CNN "variant"
	1    5575 3175
	1    0    0    -1  
$EndComp
$Comp
L device:C C31
U 1 1 5C499B9D
P 5775 3625
F 0 "C31" H 5890 3671 50  0000 L CNN
F 1 "0.1u" H 5890 3580 50  0000 L CNN
F 2 "Capacitor_SMD:C_0603_1608Metric" H 5813 3475 50  0001 C CNN
F 3 "~" H 5775 3625 50  0001 C CNN
F 4 "Kemet" H 4075 2275 60  0001 C CNN "MFN"
F 5 "C0603C104J4RACTU" H 4075 2275 60  0001 C CNN "MFP"
F 6 "399-1097-1-ND" H 4075 2275 60  0001 C CNN "S1PN"
F 7 "Digi-Key" H 4075 2275 60  0001 C CNN "S1PL"
F 8 "80-C0603C104J4R" H 4075 2275 60  0001 C CNN "S2PN"
F 9 "Mouser" H 4075 2275 60  0001 C CNN "S2PL"
F 10 "~" H 4075 2275 60  0001 C CNN "Characteristics"
F 11 "CAP CER 0.1UF 16V X7R 0603" H 4075 2275 60  0001 C CNN "Description"
F 12 "0603 (1608 Metric)" H 4075 2275 60  0001 C CNN "Package ID"
F 13 "amp" H 5775 3625 50  0001 C CNN "variant"
	1    5775 3625
	1    0    0    -1  
$EndComp
Wire Wire Line
	5575 4375 5575 4275
Wire Wire Line
	5475 4375 5475 4275
Wire Wire Line
	5475 4275 5575 4275
Connection ~ 5575 4275
Wire Wire Line
	5575 4275 5575 3375
$Comp
L power:GND #PWR058
U 1 1 5C49A4C6
P 5775 3775
F 0 "#PWR058" H 5775 3525 50  0001 C CNN
F 1 "GND" H 5780 3602 50  0000 C CNN
F 2 "" H 5775 3775 50  0001 C CNN
F 3 "" H 5775 3775 50  0001 C CNN
	1    5775 3775
	1    0    0    -1  
$EndComp
Wire Wire Line
	5775 3475 5775 3375
Wire Wire Line
	5775 3375 5575 3375
Connection ~ 5575 3375
Wire Wire Line
	5575 3375 5575 3275
$Comp
L device:C C33
U 1 1 5C49AEC0
P 6525 4725
F 0 "C33" V 6273 4725 50  0000 C CNN
F 1 "0.1u" V 6364 4725 50  0000 C CNN
F 2 "Capacitor_SMD:C_0603_1608Metric" H 6563 4575 50  0001 C CNN
F 3 "~" H 6525 4725 50  0001 C CNN
F 4 "Kemet" H 4075 2275 60  0001 C CNN "MFN"
F 5 "C0603C104J4RACTU" H 4075 2275 60  0001 C CNN "MFP"
F 6 "399-1097-1-ND" H 4075 2275 60  0001 C CNN "S1PN"
F 7 "Digi-Key" H 4075 2275 60  0001 C CNN "S1PL"
F 8 "80-C0603C104J4R" H 4075 2275 60  0001 C CNN "S2PN"
F 9 "Mouser" H 4075 2275 60  0001 C CNN "S2PL"
F 10 "~" H 4075 2275 60  0001 C CNN "Characteristics"
F 11 "CAP CER 0.1UF 16V X7R 0603" H 4075 2275 60  0001 C CNN "Description"
F 12 "0603 (1608 Metric)" H 4075 2275 60  0001 C CNN "Package ID"
F 13 "amp" V 6525 4725 50  0001 C CNN "variant"
	1    6525 4725
	0    1    1    0   
$EndComp
Wire Wire Line
	5975 4725 6075 4725
Wire Wire Line
	5325 4075 6075 4075
Wire Wire Line
	6075 4075 6075 4725
Connection ~ 6075 4725
Wire Wire Line
	6075 4725 6375 4725
$Comp
L power:GND #PWR061
U 1 1 5C49B3AB
P 5475 5075
F 0 "#PWR061" H 5475 4825 50  0001 C CNN
F 1 "GND" H 5480 4902 50  0000 C CNN
F 2 "" H 5475 5075 50  0001 C CNN
F 3 "" H 5475 5075 50  0001 C CNN
	1    5475 5075
	1    0    0    -1  
$EndComp
$Comp
L device:C C35
U 1 1 5C49B877
P 4875 5525
F 0 "C35" H 4990 5571 50  0000 L CNN
F 1 "0.1u" H 4990 5480 50  0000 L CNN
F 2 "Capacitor_SMD:C_0603_1608Metric" H 4913 5375 50  0001 C CNN
F 3 "~" H 4875 5525 50  0001 C CNN
F 4 "Kemet" H 4075 2275 60  0001 C CNN "MFN"
F 5 "C0603C104J4RACTU" H 4075 2275 60  0001 C CNN "MFP"
F 6 "399-1097-1-ND" H 4075 2275 60  0001 C CNN "S1PN"
F 7 "Digi-Key" H 4075 2275 60  0001 C CNN "S1PL"
F 8 "80-C0603C104J4R" H 4075 2275 60  0001 C CNN "S2PN"
F 9 "Mouser" H 4075 2275 60  0001 C CNN "S2PL"
F 10 "~" H 4075 2275 60  0001 C CNN "Characteristics"
F 11 "CAP CER 0.1UF 16V X7R 0603" H 4075 2275 60  0001 C CNN "Description"
F 12 "0603 (1608 Metric)" H 4075 2275 60  0001 C CNN "Package ID"
F 13 "amp" H 4875 5525 50  0001 C CNN "variant"
	1    4875 5525
	1    0    0    -1  
$EndComp
$Comp
L power:GND #PWR062
U 1 1 5C49B8D0
P 4875 5675
F 0 "#PWR062" H 4875 5425 50  0001 C CNN
F 1 "GND" H 4880 5502 50  0000 C CNN
F 2 "" H 4875 5675 50  0001 C CNN
F 3 "" H 4875 5675 50  0001 C CNN
	1    4875 5675
	1    0    0    -1  
$EndComp
Wire Wire Line
	4725 4825 5175 4825
Wire Wire Line
	4875 5375 4875 5275
Wire Wire Line
	4875 4975 4875 4625
Wire Wire Line
	4875 4075 5025 4075
Wire Wire Line
	5175 4625 4875 4625
Connection ~ 4875 4625
Wire Wire Line
	4875 4625 4875 4075
$Comp
L device:C C34
U 1 1 5C49C02E
P 3975 4825
F 0 "C34" V 3723 4825 50  0000 C CNN
F 1 "0.1u" V 3814 4825 50  0000 C CNN
F 2 "Capacitor_SMD:C_0603_1608Metric" H 4013 4675 50  0001 C CNN
F 3 "~" H 3975 4825 50  0001 C CNN
F 4 "Kemet" H 4075 2275 60  0001 C CNN "MFN"
F 5 "C0603C104J4RACTU" H 4075 2275 60  0001 C CNN "MFP"
F 6 "399-1097-1-ND" H 4075 2275 60  0001 C CNN "S1PN"
F 7 "Digi-Key" H 4075 2275 60  0001 C CNN "S1PL"
F 8 "80-C0603C104J4R" H 4075 2275 60  0001 C CNN "S2PN"
F 9 "Mouser" H 4075 2275 60  0001 C CNN "S2PL"
F 10 "~" H 4075 2275 60  0001 C CNN "Characteristics"
F 11 "CAP CER 0.1UF 16V X7R 0603" H 4075 2275 60  0001 C CNN "Description"
F 12 "0603 (1608 Metric)" H 4075 2275 60  0001 C CNN "Package ID"
F 13 "amp" V 3975 4825 50  0001 C CNN "variant"
	1    3975 4825
	0    1    1    0   
$EndComp
$Comp
L device:R R20
U 1 1 5C49C0A9
P 4275 4575
F 0 "R20" H 4345 4621 50  0000 L CNN
F 1 "49.9" H 4345 4530 50  0000 L CNN
F 2 "Resistor_SMD:R_0603_1608Metric" V 4205 4575 50  0001 C CNN
F 3 "~" H 4275 4575 50  0001 C CNN
F 4 "Yageo" H 4275 4575 50  0001 C CNN "MFN"
F 5 "RC0603FR-0749R9L" H 4275 4575 50  0001 C CNN "MFP"
F 6 "603-RC0603FR-0749R9L" H 4275 4575 50  0001 C CNN "S1PN"
F 7 "Mouser" H 4275 4575 50  0001 C CNN "S1PL"
F 8 "311-49.9HRCT-ND" H 4275 4575 50  0001 C CNN "S2PN"
F 9 "Digi-Key" H 4275 4575 50  0001 C CNN "S2PL"
F 10 "RES SMD 49.9 OHM 1% 1/10W 0603" H 4275 4575 50  0001 C CNN "Description"
F 11 "0603 (1608 Metric)" H 4275 4575 50  0001 C CNN "Package ID"
F 12 "amp" H 4275 4575 50  0001 C CNN "variant"
	1    4275 4575
	1    0    0    -1  
$EndComp
$Comp
L device:R R18
U 1 1 5C49C55C
P 3925 4025
F 0 "R18" H 3995 4071 50  0000 L CNN
F 1 "2.2k" H 3995 3980 50  0000 L CNN
F 2 "Resistor_SMD:R_0603_1608Metric" V 3855 4025 50  0001 C CNN
F 3 "~" H 3925 4025 50  0001 C CNN
F 4 "Yageo" H 3925 3525 50  0001 C CNN "MFN"
F 5 "RC0603FR-072K2L" H 3925 3525 50  0001 C CNN "MFP"
F 6 "603-RC0603FR-072K2L" H 3925 3525 50  0001 C CNN "S1PN"
F 7 "Mouser" H 3925 3525 50  0001 C CNN "S1PL"
F 8 "311-2.20KHRCT-ND" H 3925 3525 50  0001 C CNN "S2PN"
F 9 "Digi-Key" H 3925 3525 50  0001 C CNN "S2PL"
F 10 "RES SMD 2.2K OHM 1% 1/10W 0603" H 3925 3525 50  0001 C CNN "Description"
F 11 "0603 (1608 Metric)" H 3925 3525 50  0001 C CNN "Package ID"
F 12 "amp" H 3925 4025 50  0001 C CNN "variant"
	1    3925 4025
	1    0    0    -1  
$EndComp
$Comp
L power:GND #PWR060
U 1 1 5C49C5B5
P 3925 4175
F 0 "#PWR060" H 3925 3925 50  0001 C CNN
F 1 "GND" H 3930 4002 50  0000 C CNN
F 2 "" H 3925 4175 50  0001 C CNN
F 3 "" H 3925 4175 50  0001 C CNN
	1    3925 4175
	1    0    0    -1  
$EndComp
$Comp
L device:R R17
U 1 1 5C49C5E4
P 3925 3525
F 0 "R17" H 3995 3571 50  0000 L CNN
F 1 "2.2k" H 3995 3480 50  0000 L CNN
F 2 "Resistor_SMD:R_0603_1608Metric" V 3855 3525 50  0001 C CNN
F 3 "~" H 3925 3525 50  0001 C CNN
F 4 "Yageo" H 3925 3525 50  0001 C CNN "MFN"
F 5 "RC0603FR-072K2L" H 3925 3525 50  0001 C CNN "MFP"
F 6 "603-RC0603FR-072K2L" H 3925 3525 50  0001 C CNN "S1PN"
F 7 "Mouser" H 3925 3525 50  0001 C CNN "S1PL"
F 8 "311-2.20KHRCT-ND" H 3925 3525 50  0001 C CNN "S2PN"
F 9 "Digi-Key" H 3925 3525 50  0001 C CNN "S2PL"
F 10 "RES SMD 2.2K OHM 1% 1/10W 0603" H 3925 3525 50  0001 C CNN "Description"
F 11 "0603 (1608 Metric)" H 3925 3525 50  0001 C CNN "Package ID"
F 12 "amp" H 3925 3525 50  0001 C CNN "variant"
	1    3925 3525
	1    0    0    -1  
$EndComp
Wire Wire Line
	3925 3375 3925 2975
Wire Wire Line
	3925 2975 4775 2975
Wire Wire Line
	5575 2975 5575 3075
Wire Wire Line
	3925 3875 3925 3775
Wire Wire Line
	4275 4425 4275 3775
Wire Wire Line
	4275 3775 3925 3775
Connection ~ 3925 3775
Wire Wire Line
	3925 3775 3925 3675
Wire Wire Line
	4125 4825 4275 4825
Wire Wire Line
	4275 4725 4275 4825
Connection ~ 4275 4825
Wire Wire Line
	4275 4825 4425 4825
Wire Wire Line
	3825 4825 3325 4825
$Comp
L device:C C32
U 1 1 5C49DF58
P 3600 4025
F 0 "C32" H 3300 4075 50  0000 L CNN
F 1 "0.1u" H 3300 3975 50  0000 L CNN
F 2 "Capacitor_SMD:C_0603_1608Metric" H 3638 3875 50  0001 C CNN
F 3 "~" H 3600 4025 50  0001 C CNN
F 4 "Kemet" H 4075 2275 60  0001 C CNN "MFN"
F 5 "C0603C104J4RACTU" H 4075 2275 60  0001 C CNN "MFP"
F 6 "399-1097-1-ND" H 4075 2275 60  0001 C CNN "S1PN"
F 7 "Digi-Key" H 4075 2275 60  0001 C CNN "S1PL"
F 8 "80-C0603C104J4R" H 4075 2275 60  0001 C CNN "S2PN"
F 9 "Mouser" H 4075 2275 60  0001 C CNN "S2PL"
F 10 "~" H 4075 2275 60  0001 C CNN "Characteristics"
F 11 "CAP CER 0.1UF 16V X7R 0603" H 4075 2275 60  0001 C CNN "Description"
F 12 "0603 (1608 Metric)" H 4075 2275 60  0001 C CNN "Package ID"
F 13 "amp" H 3600 4025 50  0001 C CNN "variant"
	1    3600 4025
	1    0    0    -1  
$EndComp
$Comp
L power:GND #PWR059
U 1 1 5C49DFBD
P 3600 4175
F 0 "#PWR059" H 3600 3925 50  0001 C CNN
F 1 "GND" H 3605 4002 50  0000 C CNN
F 2 "" H 3600 4175 50  0001 C CNN
F 3 "" H 3600 4175 50  0001 C CNN
	1    3600 4175
	1    0    0    -1  
$EndComp
Wire Wire Line
	3600 3875 3600 3775
Wire Wire Line
	3600 3775 3925 3775
$Comp
L device:R R21
U 1 1 5C49FBBF
P 6975 4725
F 0 "R21" V 6768 4725 50  0000 C CNN
F 1 "49.9" V 6859 4725 50  0000 C CNN
F 2 "Resistor_SMD:R_0603_1608Metric" V 6905 4725 50  0001 C CNN
F 3 "~" H 6975 4725 50  0001 C CNN
F 4 "Yageo" H 6975 4725 50  0001 C CNN "MFN"
F 5 "RC0603FR-0749R9L" H 6975 4725 50  0001 C CNN "MFP"
F 6 "603-RC0603FR-0749R9L" H 6975 4725 50  0001 C CNN "S1PN"
F 7 "Mouser" H 6975 4725 50  0001 C CNN "S1PL"
F 8 "311-49.9HRCT-ND" H 6975 4725 50  0001 C CNN "S2PN"
F 9 "Digi-Key" H 6975 4725 50  0001 C CNN "S2PL"
F 10 "RES SMD 49.9 OHM 1% 1/10W 0603" H 6975 4725 50  0001 C CNN "Description"
F 11 "0603 (1608 Metric)" H 6975 4725 50  0001 C CNN "Package ID"
F 12 "amp" V 6975 4725 50  0001 C CNN "variant"
	1    6975 4725
	0    1    1    0   
$EndComp
Wire Wire Line
	6675 4725 6825 4725
Wire Wire Line
	7125 4725 7375 4725
Wire Wire Line
	4775 2825 4775 2975
Connection ~ 4775 2975
Wire Wire Line
	4775 2975 5575 2975
Text HLabel 3325 4825 0    50   Input ~ 0
In
Text HLabel 7375 4725 2    50   Output ~ 0
Out
Wire Wire Line
	5700 1650 6125 1650
Wire Wire Line
	6125 1725 6125 1650
Connection ~ 6125 1650
$Comp
L power:GND #PWR026
U 1 1 5C4CD590
P 6125 1925
F 0 "#PWR026" H 6125 1675 50  0001 C CNN
F 1 "GND" H 6130 1752 50  0000 C CNN
F 2 "" H 6125 1925 50  0001 C CNN
F 3 "" H 6125 1925 50  0001 C CNN
	1    6125 1925
	1    0    0    -1  
$EndComp
$Comp
L connector:Conn_01x02_Male J7
U 1 1 5C4CDC00
P 3350 1650
F 0 "J7" H 3300 1750 50  0000 C CNN
F 1 "6-12V" H 3275 1475 50  0000 C CNN
F 2 "Connector_PinHeader_2.54mm:PinHeader_1x02_P2.54mm_Vertical" H 3350 1650 50  0001 C CNN
F 3 "~" H 3350 1650 50  0001 C CNN
F 4 "Samtec" H 3350 1650 50  0001 C CNN "MFN"
F 5 "HTSW-102-07-G-S" H 3350 1650 50  0001 C CNN "MFP"
F 6 "200-HTSW10207GS" H 3350 1650 50  0001 C CNN "S1PN"
F 7 "Mouser" H 3350 1650 50  0001 C CNN "S1PL"
F 8 "Pin Header Male Pin 0.100\\\"(2.54mm) 2 pin" H 3350 1650 50  0001 C CNN "Description"
F 9 "Through Hole,P=2.54mm" H 3350 1650 50  0001 C CNN "Package ID"
	1    3350 1650
	1    0    0    -1  
$EndComp
$Comp
L power:GND #PWR052
U 1 1 5C4CED02
P 3725 2050
F 0 "#PWR052" H 3725 1800 50  0001 C CNN
F 1 "GND" H 3730 1877 50  0000 C CNN
F 2 "" H 3725 2050 50  0001 C CNN
F 3 "" H 3725 2050 50  0001 C CNN
	1    3725 2050
	1    0    0    -1  
$EndComp
Wire Wire Line
	3550 1750 3725 1750
Wire Wire Line
	3725 1750 3725 2050
Wire Wire Line
	6575 1650 6575 1550
Wire Wire Line
	6125 1650 6575 1650
$Comp
L device:C C28
U 1 1 5C4D38F9
P 4800 1900
F 0 "C28" H 4550 1975 50  0000 L CNN
F 1 "0.1u" H 4475 1875 50  0000 L CNN
F 2 "Capacitor_SMD:C_0603_1608Metric" H 4838 1750 50  0001 C CNN
F 3 "~" H 4800 1900 50  0001 C CNN
F 4 "Kemet" H 1300 2500 60  0001 C CNN "MFN"
F 5 "C0603C104J4RACTU" H 1300 2500 60  0001 C CNN "MFP"
F 6 "399-1097-1-ND" H 1300 2500 60  0001 C CNN "S1PN"
F 7 "Digi-Key" H 1300 2500 60  0001 C CNN "S1PL"
F 8 "80-C0603C104J4R" H 1300 2500 60  0001 C CNN "S2PN"
F 9 "Mouser" H 1300 2500 60  0001 C CNN "S2PL"
F 10 "~" H 1300 2500 60  0001 C CNN "Characteristics"
F 11 "CAP CER 0.1UF 16V X7R 0603" H 1300 2500 60  0001 C CNN "Description"
F 12 "0603 (1608 Metric)" H 1300 2500 60  0001 C CNN "Package ID"
F 13 "amp" H 4800 1900 50  0001 C CNN "variant"
	1    4800 1900
	1    0    0    -1  
$EndComp
$Comp
L device:C C29
U 1 1 5C4D395D
P 5700 1900
F 0 "C29" H 5450 1975 50  0000 L CNN
F 1 "0.01u" H 5375 1875 50  0000 L CNN
F 2 "Capacitor_SMD:C_0603_1608Metric" H 5738 1750 50  0001 C CNN
F 3 "~" H 5700 1900 50  0001 C CNN
F 4 "Kemet" H 700 2500 60  0001 C CNN "MFN"
F 5 "C0603C103K5RACTU" H 700 2500 60  0001 C CNN "MFP"
F 6 "399-1091-1-ND" H 700 2500 60  0001 C CNN "S1PN"
F 7 "Digi-Key" H 700 2500 60  0001 C CNN "S1PL"
F 8 "80-C0603C103K5R" H 700 2500 60  0001 C CNN "S2PN"
F 9 "Mouser" H 700 2500 60  0001 C CNN "S2PL"
F 10 "~" H 700 2500 60  0001 C CNN "Characteristics"
F 11 "Multilayer Ceramic Capacitors MLCC - SMD/SMT 50V 0.01uF 0603 X7R 10%" H 700 2500 60  0001 C CNN "Description"
F 12 "0603 (1608 metric)" H 700 2500 60  0001 C CNN "Package ID"
F 13 "amp" H 5700 1900 50  0001 C CNN "variant"
	1    5700 1900
	1    0    0    -1  
$EndComp
$Comp
L device:R R2
U 1 1 5C4D3B15
P 5400 1650
F 0 "R2" V 5200 1650 50  0000 C CNN
F 1 "10" V 5300 1650 50  0000 C CNN
F 2 "Resistor_SMD:R_0603_1608Metric" V 5330 1650 50  0001 C CNN
F 3 "~" H 5400 1650 50  0001 C CNN
F 4 "Yageo" H 5400 1650 50  0001 C CNN "MFN"
F 5 "RC0603FR-0710RL" H 5400 1650 50  0001 C CNN "MFP"
F 6 "603-RC0603FR-0710RL" H 5400 1650 50  0001 C CNN "S1PN"
F 7 "Mouser" H 5400 1650 50  0001 C CNN "S1PL"
F 8 "311-10.0HRCT-ND" H 5400 1650 50  0001 C CNN "S2PN"
F 9 "Digi-Key" H 5400 1650 50  0001 C CNN "S2PL"
F 10 "RES SMD 10 OHM 1% 1/10W 0603" H 5400 1650 50  0001 C CNN "Description"
F 11 "0603 (1608 Metric)" H 5400 1650 50  0001 C CNN "Package ID"
F 12 "amp" V 5400 1650 50  0001 C CNN "variant"
	1    5400 1650
	0    1    1    0   
$EndComp
$Comp
L power:GND #PWR053
U 1 1 5C4D6197
P 4800 2050
F 0 "#PWR053" H 4800 1800 50  0001 C CNN
F 1 "GND" H 4805 1877 50  0000 C CNN
F 2 "" H 4800 2050 50  0001 C CNN
F 3 "" H 4800 2050 50  0001 C CNN
	1    4800 2050
	1    0    0    -1  
$EndComp
$Comp
L power:GND #PWR054
U 1 1 5C4D61CE
P 5700 2050
F 0 "#PWR054" H 5700 1800 50  0001 C CNN
F 1 "GND" H 5705 1877 50  0000 C CNN
F 2 "" H 5700 2050 50  0001 C CNN
F 3 "" H 5700 2050 50  0001 C CNN
	1    5700 2050
	1    0    0    -1  
$EndComp
Wire Wire Line
	5150 1650 5250 1650
Wire Wire Line
	5550 1650 5700 1650
Wire Wire Line
	4800 1750 4800 1650
Wire Wire Line
	4800 1650 4950 1650
Wire Wire Line
	5700 1650 5700 1750
Connection ~ 5700 1650
$Comp
L power:PWR_FLAG #FLG0101
U 1 1 5C4E4C22
P 5325 3250
F 0 "#FLG0101" H 5325 3325 50  0001 C CNN
F 1 "PWR_FLAG" H 5325 3424 50  0000 C CNN
F 2 "" H 5325 3250 50  0001 C CNN
F 3 "~" H 5325 3250 50  0001 C CNN
	1    5325 3250
	1    0    0    -1  
$EndComp
Wire Wire Line
	5325 3250 5325 3375
Wire Wire Line
	5325 3375 5575 3375
$Comp
L power:PWR_FLAG #FLG0102
U 1 1 5C4E6062
P 5700 1650
F 0 "#FLG0102" H 5700 1725 50  0001 C CNN
F 1 "PWR_FLAG" H 5700 1824 50  0000 C CNN
F 2 "" H 5700 1650 50  0001 C CNN
F 3 "~" H 5700 1650 50  0001 C CNN
	1    5700 1650
	1    0    0    -1  
$EndComp
$Comp
L device:Ferrite_Bead_Small FB2
U 1 1 5CAB0961
P 5050 1650
F 0 "FB2" V 4905 1650 50  0000 C CNN
F 1 "~" V 4904 1650 50  0000 C CNN
F 2 "Capacitor_SMD:C_0805_2012Metric" V 4980 1650 50  0001 C CNN
F 3 "~" H 5050 1650 50  0001 C CNN
F 4 "Fair-Rite" H 5050 1650 50  0001 C CNN "MFN"
F 5 "2508056017Y2" H 5050 1650 50  0001 C CNN "MFP"
F 6 "623-2508056017Y2" H 5050 1650 50  0001 C CNN "S1PN"
F 7 "Mouser" H 5050 1650 50  0001 C CNN "S1PL"
F 8 "1838838" H 5050 1650 50  0001 C CNN "S2PN"
F 9 "Element14" H 5050 1650 50  0001 C CNN "S2PL"
F 10 "Ferrite Beads MultLyr Chip Bead 600ohm 0805 2000mA" H 5050 1650 50  0001 C CNN "Description"
F 11 "0805 (2012 Metric)" H 5050 1650 50  0001 C CNN "Package ID"
F 12 "amp" V 5050 1650 50  0001 C CNN "variant"
	1    5050 1650
	0    1    1    0   
$EndComp
$Comp
L power:VCC #PWR0103
U 1 1 5EAEC1DF
P 6575 1550
F 0 "#PWR0103" H 6575 1400 50  0001 C CNN
F 1 "VCC" H 6592 1723 50  0000 C CNN
F 2 "" H 6575 1550 50  0001 C CNN
F 3 "" H 6575 1550 50  0001 C CNN
	1    6575 1550
	1    0    0    -1  
$EndComp
$Comp
L power:VCC #PWR0104
U 1 1 5EAED797
P 4775 2825
F 0 "#PWR0104" H 4775 2675 50  0001 C CNN
F 1 "VCC" H 4792 2998 50  0000 C CNN
F 2 "" H 4775 2825 50  0001 C CNN
F 3 "" H 4775 2825 50  0001 C CNN
	1    4775 2825
	1    0    0    -1  
$EndComp
$Comp
L device:D_Schottky D1
U 1 1 5EB46E97
P 4250 1650
F 0 "D1" H 4250 1434 50  0000 C CNN
F 1 "D_Schottky" H 4250 1525 50  0000 C CNN
F 2 "Diode_SMD:D_SOD-323" H 4250 1650 50  0001 C CNN
F 3 "~" H 4250 1650 50  0001 C CNN
F 4 "Onsemi" H 4250 1650 50  0001 C CNN "MFN"
F 5 "NSR0340HT1G" H 4250 1650 50  0001 C CNN "MFP"
F 6 "863-NSR0340HT1G" H 4250 1650 50  0001 C CNN "S1PN"
F 7 "Mouser" H 4250 1650 50  0001 C CNN "S1PL"
F 8 "40 V 250mA Surface Mount Schottky Barrier Rectifier" H 4250 1650 50  0001 C CNN "Description"
F 9 "SOD-323" H 4250 1650 50  0001 C CNN "Package ID"
F 10 "amp" H 4250 1650 50  0001 C CNN "variant"
	1    4250 1650
	-1   0    0    1   
$EndComp
Wire Wire Line
	3550 1650 4100 1650
Wire Wire Line
	4400 1650 4800 1650
Connection ~ 4800 1650
$EndSCHEMATC
