(module PIN_ARRAY_15X2 (layer F.Cu) (tedit 513C30E8)
  (tags CONN)
  (fp_text reference REF* (at 0 -3.81) (layer F.SilkS)
    (effects (font (size 1.016 1.016) (thickness 0.27432)))
  )
  (fp_text value PIN_ARRAY_15X2 (at 0 3.81) (layer F.SilkS)
    (effects (font (size 1.016 1.016) (thickness 0.2032)))
  )
  (fp_line (start -19.05 -2.54) (end 19.05 -2.54) (layer F.SilkS) (width 0.3048))
  (fp_line (start -19.05 2.54) (end 19.05 2.54) (layer F.SilkS) (width 0.3048))
  (fp_line (start 19.05 -2.54) (end 19.05 2.54) (layer F.SilkS) (width 0.3048))
  (fp_line (start -19.05 -2.54) (end -19.05 2.54) (layer F.SilkS) (width 0.3048))
  (pad 1 thru_hole rect (at -17.78 1.27) (size 1.524 1.524) (drill 0.8128) (layers *.Cu *.Mask F.SilkS))
  (pad 2 thru_hole circle (at -17.78 -1.27) (size 1.524 1.524) (drill 1.016) (layers *.Cu *.Mask F.SilkS))
  (pad 11 thru_hole circle (at -5.08 1.27) (size 1.524 1.524) (drill 1.016) (layers *.Cu *.Mask F.SilkS))
  (pad 4 thru_hole circle (at -15.24 -1.27) (size 1.524 1.524) (drill 1.016) (layers *.Cu *.Mask F.SilkS))
  (pad 13 thru_hole circle (at -2.54 1.27) (size 1.524 1.524) (drill 1.016) (layers *.Cu *.Mask F.SilkS))
  (pad 6 thru_hole circle (at -12.7 -1.27) (size 1.524 1.524) (drill 1.016) (layers *.Cu *.Mask F.SilkS))
  (pad 15 thru_hole circle (at 0 1.27) (size 1.524 1.524) (drill 1.016) (layers *.Cu *.Mask F.SilkS))
  (pad 8 thru_hole circle (at -10.16 -1.27) (size 1.524 1.524) (drill 1.016) (layers *.Cu *.Mask F.SilkS))
  (pad 17 thru_hole circle (at 2.54 1.27) (size 1.524 1.524) (drill 1.016) (layers *.Cu *.Mask F.SilkS))
  (pad 10 thru_hole circle (at -7.62 -1.27) (size 1.524 1.524) (drill 1.016) (layers *.Cu *.Mask F.SilkS))
  (pad 19 thru_hole circle (at 5.08 1.27) (size 1.524 1.524) (drill 1.016) (layers *.Cu *.Mask F.SilkS))
  (pad 12 thru_hole circle (at -5.08 -1.27) (size 1.524 1.524) (drill 1.016) (layers *.Cu *.Mask F.SilkS))
  (pad 21 thru_hole circle (at 7.62 1.27) (size 1.524 1.524) (drill 1.016) (layers *.Cu *.Mask F.SilkS))
  (pad 14 thru_hole circle (at -2.54 -1.27) (size 1.524 1.524) (drill 1.016) (layers *.Cu *.Mask F.SilkS))
  (pad 23 thru_hole circle (at 10.16 1.27) (size 1.524 1.524) (drill 1.016) (layers *.Cu *.Mask F.SilkS))
  (pad 16 thru_hole circle (at 0 -1.27) (size 1.524 1.524) (drill 1.016) (layers *.Cu *.Mask F.SilkS))
  (pad 25 thru_hole circle (at 12.7 1.27) (size 1.524 1.524) (drill 1.016) (layers *.Cu *.Mask F.SilkS))
  (pad 18 thru_hole circle (at 2.54 -1.27) (size 1.524 1.524) (drill 1.016) (layers *.Cu *.Mask F.SilkS))
  (pad 27 thru_hole circle (at 15.24 1.27) (size 1.524 1.524) (drill 1.016) (layers *.Cu *.Mask F.SilkS))
  (pad 20 thru_hole circle (at 5.08 -1.27) (size 1.524 1.524) (drill 1.016) (layers *.Cu *.Mask F.SilkS))
  (pad 29 thru_hole circle (at 17.78 1.27) (size 1.524 1.524) (drill 1.016) (layers *.Cu *.Mask F.SilkS))
  (pad 22 thru_hole circle (at 7.62 -1.27) (size 1.524 1.524) (drill 1.016) (layers *.Cu *.Mask F.SilkS))
  (pad 24 thru_hole circle (at 10.16 -1.27) (size 1.524 1.524) (drill 1.016) (layers *.Cu *.Mask F.SilkS))
  (pad 26 thru_hole circle (at 12.7 -1.27) (size 1.524 1.524) (drill 1.016) (layers *.Cu *.Mask F.SilkS))
  (pad 28 thru_hole circle (at 15.24 -1.27) (size 1.524 1.524) (drill 1.016) (layers *.Cu *.Mask F.SilkS))
  (pad 3 thru_hole circle (at -15.24 1.27) (size 1.524 1.524) (drill 1.016) (layers *.Cu *.Mask F.SilkS))
  (pad 5 thru_hole circle (at -12.7 1.27) (size 1.524 1.524) (drill 1.016) (layers *.Cu *.Mask F.SilkS))
  (pad 7 thru_hole circle (at -10.16 1.27) (size 1.524 1.524) (drill 1.016) (layers *.Cu *.Mask F.SilkS))
  (pad 9 thru_hole circle (at -7.62 1.27) (size 1.524 1.524) (drill 1.016) (layers *.Cu *.Mask F.SilkS))
  (pad 30 thru_hole circle (at 17.78 -1.27) (size 1.524 1.524) (drill 1.016) (layers *.Cu *.Mask F.SilkS))
  (model pin_array/pins_array_20x2.wrl
    (at (xyz 0 0 0))
    (scale (xyz 1 1 1))
    (rotate (xyz 0 0 0))
  )
)
