(module Psemi-QFN-16_EP1.75x1.75mm (layer F.Cu) (tedit 5EDD7B63)
  (descr "QFN, 16 Pin (http://www.ti.com/lit/ds/symlink/msp430g2001.pdf), generated with kicad-footprint-generator ipc_dfn_qfn_generator.py")
  (tags "QFN DFN_QFN")
  (attr smd)
  (fp_text reference U2 (at -2.4779 3.1456) (layer F.SilkS)
    (effects (font (size 0.635 0.635) (thickness 0.1016)))
  )
  (fp_text value PE42553 (at -3.5066 3.1964) (layer F.Fab)
    (effects (font (size 0.635 0.635) (thickness 0.1016)))
  )
  (fp_text user %R (at 0 0) (layer F.Fab)
    (effects (font (size 1 1) (thickness 0.15)))
  )
  (fp_line (start 2.286 -2.286) (end -2.286 -2.286) (layer F.CrtYd) (width 0.05))
  (fp_line (start 2.286 2.286) (end 2.286 -2.286) (layer F.CrtYd) (width 0.05))
  (fp_line (start -2.286 2.286) (end 2.286 2.286) (layer F.CrtYd) (width 0.05))
  (fp_line (start -2.286 -2.286) (end -2.286 2.286) (layer F.CrtYd) (width 0.05))
  (fp_line (start -2 -1) (end -1 -2) (layer F.Fab) (width 0.1))
  (fp_line (start -2 2) (end -2 -1) (layer F.Fab) (width 0.1))
  (fp_line (start 2 2) (end -2 2) (layer F.Fab) (width 0.1))
  (fp_line (start 2 -2) (end 2 2) (layer F.Fab) (width 0.1))
  (fp_line (start -1 -2) (end 2 -2) (layer F.Fab) (width 0.1))
  (fp_line (start -1.41 -2.11) (end -2.11 -2.11) (layer F.SilkS) (width 0.12))
  (fp_line (start 2.11 2.11) (end 2.11 1.41) (layer F.SilkS) (width 0.12))
  (fp_line (start 1.41 2.11) (end 2.11 2.11) (layer F.SilkS) (width 0.12))
  (fp_line (start -2.11 2.11) (end -2.11 1.41) (layer F.SilkS) (width 0.12))
  (fp_line (start -1.41 2.11) (end -2.11 2.11) (layer F.SilkS) (width 0.12))
  (fp_line (start 2.11 -2.11) (end 2.11 -1.41) (layer F.SilkS) (width 0.12))
  (fp_line (start 1.41 -2.11) (end 2.11 -2.11) (layer F.SilkS) (width 0.12))
  (pad "" smd roundrect (at 0.4375 0.4375) (size 0.65 0.65) (layers F.Paste) (roundrect_rratio 0.09300000000000001))
  (pad "" smd roundrect (at -0.4375 0.4375) (size 0.65 0.65) (layers F.Paste) (roundrect_rratio 0.09300000000000001))
  (pad "" smd roundrect (at -0.4375 -0.4375) (size 0.65 0.65) (layers F.Paste) (roundrect_rratio 0.09300000000000001))
  (pad "" smd roundrect (at 0.4375 -0.4375) (size 0.65 0.65) (layers F.Paste) (roundrect_rratio 0.09300000000000001))
  (pad 17 thru_hole circle (at -0.4375 0.4375) (size 0.5 0.5) (drill 0.3) (layers *.Cu F.Mask))
  (pad 17 thru_hole circle (at 0.4375 0.4375) (size 0.5 0.5) (drill 0.3) (layers *.Cu F.Mask))
  (pad 17 thru_hole circle (at 0.4375 -0.4375) (size 0.5 0.5) (drill 0.3) (layers *.Cu F.Mask))
  (pad 17 thru_hole circle (at -0.4375 -0.4375) (size 0.5 0.5) (drill 0.3) (layers *.Cu F.Mask))
  (pad 16 smd roundrect (at -0.75 -1.5) (size 0.3 0.75) (layers F.Cu F.Paste F.Mask) (roundrect_rratio 0.25)
    (solder_paste_margin -0.0254))
  (pad 15 smd roundrect (at -0.25 -1.5) (size 0.3 0.75) (layers F.Cu F.Paste F.Mask) (roundrect_rratio 0.25)
    (solder_paste_margin -0.0254))
  (pad 14 smd roundrect (at 0.25 -1.5) (size 0.3 0.75) (layers F.Cu F.Paste F.Mask) (roundrect_rratio 0.25)
    (solder_paste_margin -0.0254))
  (pad 13 smd roundrect (at 0.75 -1.5) (size 0.3 0.75) (layers F.Cu F.Paste F.Mask) (roundrect_rratio 0.25)
    (solder_paste_margin -0.0254))
  (pad 12 smd roundrect (at 1.5 -0.75) (size 0.75 0.3) (layers F.Cu F.Paste F.Mask) (roundrect_rratio 0.25)
    (solder_paste_margin -0.0254))
  (pad 11 smd roundrect (at 1.5 -0.25) (size 0.75 0.3) (layers F.Cu F.Paste F.Mask) (roundrect_rratio 0.25)
    (solder_paste_margin -0.0254))
  (pad 10 smd roundrect (at 1.5 0.25) (size 0.75 0.3) (layers F.Cu F.Paste F.Mask) (roundrect_rratio 0.25)
    (solder_paste_margin -0.0254))
  (pad 9 smd roundrect (at 1.5 0.75) (size 0.75 0.3) (layers F.Cu F.Paste F.Mask) (roundrect_rratio 0.25)
    (solder_paste_margin -0.0254))
  (pad 8 smd roundrect (at 0.75 1.5) (size 0.3 0.75) (layers F.Cu F.Paste F.Mask) (roundrect_rratio 0.25)
    (solder_paste_margin -0.0254))
  (pad 7 smd roundrect (at 0.25 1.5) (size 0.3 0.75) (layers F.Cu F.Paste F.Mask) (roundrect_rratio 0.25)
    (solder_paste_margin -0.0254))
  (pad 6 smd roundrect (at -0.25 1.5) (size 0.3 0.75) (layers F.Cu F.Paste F.Mask) (roundrect_rratio 0.25)
    (solder_paste_margin -0.0254))
  (pad 5 smd roundrect (at -0.75 1.5) (size 0.3 0.75) (layers F.Cu F.Paste F.Mask) (roundrect_rratio 0.25)
    (solder_paste_margin -0.0254))
  (pad 4 smd roundrect (at -1.5 0.75) (size 0.75 0.3) (layers F.Cu F.Paste F.Mask) (roundrect_rratio 0.25)
    (solder_paste_margin -0.0254))
  (pad 3 smd roundrect (at -1.5 0.25) (size 0.75 0.3) (layers F.Cu F.Paste F.Mask) (roundrect_rratio 0.25)
    (solder_paste_margin -0.0254))
  (pad 2 smd roundrect (at -1.5 -0.25) (size 0.75 0.3) (layers F.Cu F.Paste F.Mask) (roundrect_rratio 0.25)
    (solder_paste_margin -0.0254))
  (pad 1 smd roundrect (at -1.5 -0.75) (size 0.75 0.3) (layers F.Cu F.Paste F.Mask) (roundrect_rratio 0.25)
    (solder_paste_margin -0.0254))
  (pad 17 smd roundrect (at 0 0) (size 1.75 1.75) (layers F.Cu F.Mask) (roundrect_rratio 0.09300000000000001))
  (model ${KISYS3DMOD}/Package_DFN_QFN.3dshapes/Texas_S-PVQFN-N16_EP2.7x2.7mm.wrl
    (at (xyz 0 0 0))
    (scale (xyz 1 1 1))
    (rotate (xyz 0 0 0))
  )
)
