(kicad_symbol_lib (version 20211014) (generator kicad_symbol_editor)
  (symbol "C-device" (pin_numbers hide) (pin_names (offset 0.254)) (in_bom yes) (on_board yes)
    (property "Reference" "C" (id 0) (at 0.635 2.54 0)
      (effects (font (size 1.27 1.27)) (justify left))
    )
    (property "Value" "C-device" (id 1) (at 0.635 -2.54 0)
      (effects (font (size 1.27 1.27)) (justify left))
    )
    (property "Footprint" "" (id 2) (at 0.9652 -3.81 0)
      (effects (font (size 1.27 1.27)) hide)
    )
    (property "Datasheet" "" (id 3) (at 0 0 0)
      (effects (font (size 1.27 1.27)) hide)
    )
    (property "ki_fp_filters" "C_*" (id 4) (at 0 0 0)
      (effects (font (size 1.27 1.27)) hide)
    )
    (symbol "C-device_0_1"
      (polyline
        (pts
          (xy -2.032 -0.762)
          (xy 2.032 -0.762)
        )
        (stroke (width 0.508) (type default) (color 0 0 0 0))
        (fill (type none))
      )
      (polyline
        (pts
          (xy -2.032 0.762)
          (xy 2.032 0.762)
        )
        (stroke (width 0.508) (type default) (color 0 0 0 0))
        (fill (type none))
      )
    )
    (symbol "C-device_1_1"
      (pin passive line (at 0 3.81 270) (length 2.794)
        (name "~" (effects (font (size 1.27 1.27))))
        (number "1" (effects (font (size 1.27 1.27))))
      )
      (pin passive line (at 0 -3.81 90) (length 2.794)
        (name "~" (effects (font (size 1.27 1.27))))
        (number "2" (effects (font (size 1.27 1.27))))
      )
    )
  )
  (symbol "C_Small-device" (pin_numbers hide) (pin_names (offset 0.254) hide) (in_bom yes) (on_board yes)
    (property "Reference" "C" (id 0) (at 0.254 1.778 0)
      (effects (font (size 1.27 1.27)) (justify left))
    )
    (property "Value" "C_Small-device" (id 1) (at 0.254 -2.032 0)
      (effects (font (size 1.27 1.27)) (justify left))
    )
    (property "Footprint" "" (id 2) (at 0 0 0)
      (effects (font (size 1.27 1.27)) hide)
    )
    (property "Datasheet" "" (id 3) (at 0 0 0)
      (effects (font (size 1.27 1.27)) hide)
    )
    (property "ki_fp_filters" "C_*" (id 4) (at 0 0 0)
      (effects (font (size 1.27 1.27)) hide)
    )
    (symbol "C_Small-device_0_1"
      (polyline
        (pts
          (xy -1.524 -0.508)
          (xy 1.524 -0.508)
        )
        (stroke (width 0.3302) (type default) (color 0 0 0 0))
        (fill (type none))
      )
      (polyline
        (pts
          (xy -1.524 0.508)
          (xy 1.524 0.508)
        )
        (stroke (width 0.3048) (type default) (color 0 0 0 0))
        (fill (type none))
      )
    )
    (symbol "C_Small-device_1_1"
      (pin passive line (at 0 2.54 270) (length 2.032)
        (name "~" (effects (font (size 1.27 1.27))))
        (number "1" (effects (font (size 1.27 1.27))))
      )
      (pin passive line (at 0 -2.54 90) (length 2.032)
        (name "~" (effects (font (size 1.27 1.27))))
        (number "2" (effects (font (size 1.27 1.27))))
      )
    )
  )
  (symbol "Conn_01x02_Male-connector" (pin_names (offset 1.016) hide) (in_bom yes) (on_board yes)
    (property "Reference" "J" (id 0) (at 0 2.54 0)
      (effects (font (size 1.27 1.27)))
    )
    (property "Value" "Conn_01x02_Male-connector" (id 1) (at 0 -5.08 0)
      (effects (font (size 1.27 1.27)))
    )
    (property "Footprint" "" (id 2) (at 0 0 0)
      (effects (font (size 1.27 1.27)) hide)
    )
    (property "Datasheet" "" (id 3) (at 0 0 0)
      (effects (font (size 1.27 1.27)) hide)
    )
    (property "ki_fp_filters" "Connector*:*_1x??_*" (id 4) (at 0 0 0)
      (effects (font (size 1.27 1.27)) hide)
    )
    (symbol "Conn_01x02_Male-connector_1_1"
      (polyline
        (pts
          (xy 1.27 -2.54)
          (xy 0.8636 -2.54)
        )
        (stroke (width 0.1524) (type default) (color 0 0 0 0))
        (fill (type none))
      )
      (polyline
        (pts
          (xy 1.27 0)
          (xy 0.8636 0)
        )
        (stroke (width 0.1524) (type default) (color 0 0 0 0))
        (fill (type none))
      )
      (rectangle (start 0.8636 -2.413) (end 0 -2.667)
        (stroke (width 0.1524) (type default) (color 0 0 0 0))
        (fill (type outline))
      )
      (rectangle (start 0.8636 0.127) (end 0 -0.127)
        (stroke (width 0.1524) (type default) (color 0 0 0 0))
        (fill (type outline))
      )
      (pin passive line (at 5.08 0 180) (length 3.81)
        (name "Pin_1" (effects (font (size 1.27 1.27))))
        (number "1" (effects (font (size 1.27 1.27))))
      )
      (pin passive line (at 5.08 -2.54 180) (length 3.81)
        (name "Pin_2" (effects (font (size 1.27 1.27))))
        (number "2" (effects (font (size 1.27 1.27))))
      )
    )
  )
  (symbol "Conn_01x06_Male-connector" (pin_names (offset 1.016) hide) (in_bom yes) (on_board yes)
    (property "Reference" "J" (id 0) (at 0 7.62 0)
      (effects (font (size 1.27 1.27)))
    )
    (property "Value" "Conn_01x06_Male-connector" (id 1) (at 0 -10.16 0)
      (effects (font (size 1.27 1.27)))
    )
    (property "Footprint" "" (id 2) (at 0 0 0)
      (effects (font (size 1.27 1.27)) hide)
    )
    (property "Datasheet" "" (id 3) (at 0 0 0)
      (effects (font (size 1.27 1.27)) hide)
    )
    (property "ki_fp_filters" "Connector*:*_1x??_*" (id 4) (at 0 0 0)
      (effects (font (size 1.27 1.27)) hide)
    )
    (symbol "Conn_01x06_Male-connector_1_1"
      (polyline
        (pts
          (xy 1.27 -7.62)
          (xy 0.8636 -7.62)
        )
        (stroke (width 0.1524) (type default) (color 0 0 0 0))
        (fill (type none))
      )
      (polyline
        (pts
          (xy 1.27 -5.08)
          (xy 0.8636 -5.08)
        )
        (stroke (width 0.1524) (type default) (color 0 0 0 0))
        (fill (type none))
      )
      (polyline
        (pts
          (xy 1.27 -2.54)
          (xy 0.8636 -2.54)
        )
        (stroke (width 0.1524) (type default) (color 0 0 0 0))
        (fill (type none))
      )
      (polyline
        (pts
          (xy 1.27 0)
          (xy 0.8636 0)
        )
        (stroke (width 0.1524) (type default) (color 0 0 0 0))
        (fill (type none))
      )
      (polyline
        (pts
          (xy 1.27 2.54)
          (xy 0.8636 2.54)
        )
        (stroke (width 0.1524) (type default) (color 0 0 0 0))
        (fill (type none))
      )
      (polyline
        (pts
          (xy 1.27 5.08)
          (xy 0.8636 5.08)
        )
        (stroke (width 0.1524) (type default) (color 0 0 0 0))
        (fill (type none))
      )
      (rectangle (start 0.8636 -7.493) (end 0 -7.747)
        (stroke (width 0.1524) (type default) (color 0 0 0 0))
        (fill (type outline))
      )
      (rectangle (start 0.8636 -4.953) (end 0 -5.207)
        (stroke (width 0.1524) (type default) (color 0 0 0 0))
        (fill (type outline))
      )
      (rectangle (start 0.8636 -2.413) (end 0 -2.667)
        (stroke (width 0.1524) (type default) (color 0 0 0 0))
        (fill (type outline))
      )
      (rectangle (start 0.8636 0.127) (end 0 -0.127)
        (stroke (width 0.1524) (type default) (color 0 0 0 0))
        (fill (type outline))
      )
      (rectangle (start 0.8636 2.667) (end 0 2.413)
        (stroke (width 0.1524) (type default) (color 0 0 0 0))
        (fill (type outline))
      )
      (rectangle (start 0.8636 5.207) (end 0 4.953)
        (stroke (width 0.1524) (type default) (color 0 0 0 0))
        (fill (type outline))
      )
      (pin passive line (at 5.08 5.08 180) (length 3.81)
        (name "Pin_1" (effects (font (size 1.27 1.27))))
        (number "1" (effects (font (size 1.27 1.27))))
      )
      (pin passive line (at 5.08 2.54 180) (length 3.81)
        (name "Pin_2" (effects (font (size 1.27 1.27))))
        (number "2" (effects (font (size 1.27 1.27))))
      )
      (pin passive line (at 5.08 0 180) (length 3.81)
        (name "Pin_3" (effects (font (size 1.27 1.27))))
        (number "3" (effects (font (size 1.27 1.27))))
      )
      (pin passive line (at 5.08 -2.54 180) (length 3.81)
        (name "Pin_4" (effects (font (size 1.27 1.27))))
        (number "4" (effects (font (size 1.27 1.27))))
      )
      (pin passive line (at 5.08 -5.08 180) (length 3.81)
        (name "Pin_5" (effects (font (size 1.27 1.27))))
        (number "5" (effects (font (size 1.27 1.27))))
      )
      (pin passive line (at 5.08 -7.62 180) (length 3.81)
        (name "Pin_6" (effects (font (size 1.27 1.27))))
        (number "6" (effects (font (size 1.27 1.27))))
      )
    )
  )
  (symbol "D_Zener_Small_ALT-device" (pin_numbers hide) (pin_names (offset 0.254) hide) (in_bom yes) (on_board yes)
    (property "Reference" "D" (id 0) (at 0 2.286 0)
      (effects (font (size 1.27 1.27)))
    )
    (property "Value" "D_Zener_Small_ALT-device" (id 1) (at 0 -2.286 0)
      (effects (font (size 1.27 1.27)))
    )
    (property "Footprint" "" (id 2) (at 0 0 90)
      (effects (font (size 1.27 1.27)) hide)
    )
    (property "Datasheet" "" (id 3) (at 0 0 90)
      (effects (font (size 1.27 1.27)) hide)
    )
    (property "ki_fp_filters" "TO-???* *_Diode_* *SingleDiode* D_*" (id 4) (at 0 0 0)
      (effects (font (size 1.27 1.27)) hide)
    )
    (symbol "D_Zener_Small_ALT-device_0_1"
      (polyline
        (pts
          (xy 0.762 0)
          (xy -0.762 0)
        )
        (stroke (width 0) (type default) (color 0 0 0 0))
        (fill (type none))
      )
      (polyline
        (pts
          (xy -0.254 1.016)
          (xy -0.762 1.016)
          (xy -0.762 -1.016)
        )
        (stroke (width 0.254) (type default) (color 0 0 0 0))
        (fill (type none))
      )
      (polyline
        (pts
          (xy 0.762 1.016)
          (xy -0.762 0)
          (xy 0.762 -1.016)
          (xy 0.762 1.016)
        )
        (stroke (width 0.254) (type default) (color 0 0 0 0))
        (fill (type outline))
      )
    )
    (symbol "D_Zener_Small_ALT-device_1_1"
      (pin passive line (at -2.54 0 0) (length 1.778)
        (name "K" (effects (font (size 1.27 1.27))))
        (number "1" (effects (font (size 1.27 1.27))))
      )
      (pin passive line (at 2.54 0 180) (length 1.778)
        (name "A" (effects (font (size 1.27 1.27))))
        (number "2" (effects (font (size 1.27 1.27))))
      )
    )
  )
  (symbol "Logo_Open_Hardware_Small-graphics" (pin_names (offset 1.016)) (in_bom yes) (on_board yes)
    (property "Reference" "#LOGO" (id 0) (at 0 6.985 0)
      (effects (font (size 1.27 1.27)) hide)
    )
    (property "Value" "Logo_Open_Hardware_Small-graphics" (id 1) (at 0 -5.715 0)
      (effects (font (size 1.27 1.27)) hide)
    )
    (property "Footprint" "" (id 2) (at 0 0 0)
      (effects (font (size 1.27 1.27)) hide)
    )
    (property "Datasheet" "" (id 3) (at 0 0 0)
      (effects (font (size 1.27 1.27)) hide)
    )
    (symbol "Logo_Open_Hardware_Small-graphics_0_1"
      (polyline
        (pts
          (xy 3.3528 -4.3434)
          (xy 3.302 -4.318)
          (xy 3.175 -4.2418)
          (xy 2.9972 -4.1148)
          (xy 2.7686 -3.9624)
          (xy 2.54 -3.81)
          (xy 2.3622 -3.7084)
          (xy 2.2352 -3.6068)
          (xy 2.1844 -3.5814)
          (xy 2.159 -3.6068)
          (xy 2.0574 -3.6576)
          (xy 1.905 -3.7338)
          (xy 1.8034 -3.7846)
          (xy 1.6764 -3.8354)
          (xy 1.6002 -3.8354)
          (xy 1.6002 -3.8354)
          (xy 1.5494 -3.7338)
          (xy 1.4732 -3.5306)
          (xy 1.3462 -3.302)
          (xy 1.2446 -3.0226)
          (xy 1.1176 -2.7178)
          (xy 0.9652 -2.413)
          (xy 0.8636 -2.1082)
          (xy 0.7366 -1.8288)
          (xy 0.6604 -1.6256)
          (xy 0.6096 -1.4732)
          (xy 0.5842 -1.397)
          (xy 0.5842 -1.397)
          (xy 0.6604 -1.3208)
          (xy 0.7874 -1.2446)
          (xy 1.0414 -1.016)
          (xy 1.2954 -0.6858)
          (xy 1.4478 -0.3302)
          (xy 1.524 0.0762)
          (xy 1.4732 0.4572)
          (xy 1.3208 0.8128)
          (xy 1.0668 1.143)
          (xy 0.762 1.3716)
          (xy 0.4064 1.524)
          (xy 0 1.5748)
          (xy -0.381 1.5494)
          (xy -0.7366 1.397)
          (xy -1.0668 1.143)
          (xy -1.2192 0.9906)
          (xy -1.397 0.6604)
          (xy -1.524 0.3048)
          (xy -1.524 0.2286)
          (xy -1.4986 -0.1778)
          (xy -1.397 -0.5334)
          (xy -1.1938 -0.8636)
          (xy -0.9144 -1.143)
          (xy -0.8636 -1.1684)
          (xy -0.7366 -1.27)
          (xy -0.635 -1.3462)
          (xy -0.5842 -1.397)
          (xy -1.0668 -2.5908)
          (xy -1.143 -2.794)
          (xy -1.2954 -3.1242)
          (xy -1.397 -3.4036)
          (xy -1.4986 -3.6322)
          (xy -1.5748 -3.7846)
          (xy -1.6002 -3.8354)
          (xy -1.6002 -3.8354)
          (xy -1.651 -3.8354)
          (xy -1.7272 -3.81)
          (xy -1.905 -3.7338)
          (xy -2.0066 -3.683)
          (xy -2.1336 -3.6068)
          (xy -2.2098 -3.5814)
          (xy -2.2606 -3.6068)
          (xy -2.3622 -3.683)
          (xy -2.54 -3.81)
          (xy -2.7686 -3.9624)
          (xy -2.9718 -4.0894)
          (xy -3.1496 -4.2164)
          (xy -3.302 -4.318)
          (xy -3.3528 -4.3434)
          (xy -3.3782 -4.3434)
          (xy -3.429 -4.318)
          (xy -3.5306 -4.2164)
          (xy -3.7084 -4.064)
          (xy -3.937 -3.8354)
          (xy -3.9624 -3.81)
          (xy -4.1656 -3.6068)
          (xy -4.318 -3.4544)
          (xy -4.4196 -3.3274)
          (xy -4.445 -3.2766)
          (xy -4.445 -3.2766)
          (xy -4.4196 -3.2258)
          (xy -4.318 -3.0734)
          (xy -4.2164 -2.8956)
          (xy -4.064 -2.667)
          (xy -3.6576 -2.0828)
          (xy -3.8862 -1.5494)
          (xy -3.937 -1.3716)
          (xy -4.0386 -1.1684)
          (xy -4.0894 -1.0414)
          (xy -4.1148 -0.9652)
          (xy -4.191 -0.9398)
          (xy -4.318 -0.9144)
          (xy -4.5466 -0.8636)
          (xy -4.8006 -0.8128)
          (xy -5.0546 -0.7874)
          (xy -5.2578 -0.7366)
          (xy -5.4356 -0.7112)
          (xy -5.5118 -0.6858)
          (xy -5.5118 -0.6858)
          (xy -5.5372 -0.635)
          (xy -5.5372 -0.5588)
          (xy -5.5372 -0.4318)
          (xy -5.5626 -0.2286)
          (xy -5.5626 0.0762)
          (xy -5.5626 0.127)
          (xy -5.5372 0.4064)
          (xy -5.5372 0.635)
          (xy -5.5372 0.762)
          (xy -5.5372 0.8382)
          (xy -5.5372 0.8382)
          (xy -5.461 0.8382)
          (xy -5.3086 0.889)
          (xy -5.08 0.9144)
          (xy -4.826 0.9652)
          (xy -4.8006 0.9906)
          (xy -4.5466 1.0414)
          (xy -4.318 1.0668)
          (xy -4.1656 1.1176)
          (xy -4.0894 1.143)
          (xy -4.0894 1.143)
          (xy -4.0386 1.2446)
          (xy -3.9624 1.4224)
          (xy -3.8608 1.6256)
          (xy -3.7846 1.8288)
          (xy -3.7084 2.0066)
          (xy -3.6576 2.159)
          (xy -3.6322 2.2098)
          (xy -3.6322 2.2098)
          (xy -3.683 2.286)
          (xy -3.7592 2.413)
          (xy -3.8862 2.5908)
          (xy -4.064 2.8194)
          (xy -4.064 2.8448)
          (xy -4.2164 3.0734)
          (xy -4.3434 3.2512)
          (xy -4.4196 3.3782)
          (xy -4.445 3.4544)
          (xy -4.445 3.4544)
          (xy -4.3942 3.5052)
          (xy -4.2926 3.6322)
          (xy -4.1148 3.81)
          (xy -3.937 4.0132)
          (xy -3.8608 4.064)
          (xy -3.6576 4.2926)
          (xy -3.5052 4.4196)
          (xy -3.4036 4.4958)
          (xy -3.3528 4.5212)
          (xy -3.3528 4.5212)
          (xy -3.302 4.4704)
          (xy -3.1496 4.3688)
          (xy -2.9718 4.2418)
          (xy -2.7432 4.0894)
          (xy -2.7178 4.0894)
          (xy -2.4892 3.937)
          (xy -2.3114 3.81)
          (xy -2.1844 3.7084)
          (xy -2.1336 3.683)
          (xy -2.1082 3.683)
          (xy -2.032 3.7084)
          (xy -1.8542 3.7592)
          (xy -1.6764 3.8354)
          (xy -1.4732 3.937)
          (xy -1.27 4.0132)
          (xy -1.143 4.064)
          (xy -1.0668 4.1148)
          (xy -1.0668 4.1148)
          (xy -1.0414 4.191)
          (xy -1.016 4.3434)
          (xy -0.9652 4.572)
          (xy -0.9144 4.8514)
          (xy -0.889 4.9022)
          (xy -0.8382 5.1562)
          (xy -0.8128 5.3848)
          (xy -0.7874 5.5372)
          (xy -0.762 5.588)
          (xy -0.7112 5.6134)
          (xy -0.5842 5.6134)
          (xy -0.4064 5.6134)
          (xy -0.1524 5.6134)
          (xy 0.0762 5.6134)
          (xy 0.3302 5.6134)
          (xy 0.5334 5.6134)
          (xy 0.6858 5.588)
          (xy 0.7366 5.588)
          (xy 0.7366 5.588)
          (xy 0.762 5.5118)
          (xy 0.8128 5.334)
          (xy 0.8382 5.1054)
          (xy 0.9144 4.826)
          (xy 0.9144 4.7752)
          (xy 0.9652 4.5212)
          (xy 1.016 4.2926)
          (xy 1.0414 4.1402)
          (xy 1.0668 4.0894)
          (xy 1.0668 4.0894)
          (xy 1.1938 4.0386)
          (xy 1.3716 3.9624)
          (xy 1.5748 3.8608)
          (xy 2.0828 3.6576)
          (xy 2.7178 4.0894)
          (xy 2.7686 4.1402)
          (xy 2.9972 4.2926)
          (xy 3.175 4.4196)
          (xy 3.302 4.4958)
          (xy 3.3782 4.5212)
          (xy 3.3782 4.5212)
          (xy 3.429 4.4704)
          (xy 3.556 4.3434)
          (xy 3.7338 4.191)
          (xy 3.9116 3.9878)
          (xy 4.064 3.8354)
          (xy 4.2418 3.6576)
          (xy 4.3434 3.556)
          (xy 4.4196 3.4798)
          (xy 4.4196 3.429)
          (xy 4.4196 3.4036)
          (xy 4.3942 3.3274)
          (xy 4.2926 3.2004)
          (xy 4.1656 2.9972)
          (xy 4.0132 2.794)
          (xy 3.8862 2.5908)
          (xy 3.7592 2.3876)
          (xy 3.6576 2.2352)
          (xy 3.6322 2.159)
          (xy 3.6322 2.1336)
          (xy 3.683 2.0066)
          (xy 3.7592 1.8288)
          (xy 3.8608 1.6002)
          (xy 4.064 1.1176)
          (xy 4.3942 1.0414)
          (xy 4.5974 1.016)
          (xy 4.8768 0.9652)
          (xy 5.1308 0.9144)
          (xy 5.5372 0.8382)
          (xy 5.5626 -0.6604)
          (xy 5.4864 -0.6858)
          (xy 5.4356 -0.6858)
          (xy 5.2832 -0.7366)
          (xy 5.0546 -0.762)
          (xy 4.8006 -0.8128)
          (xy 4.5974 -0.8636)
          (xy 4.3688 -0.9144)
          (xy 4.2164 -0.9398)
          (xy 4.1402 -0.9398)
          (xy 4.1148 -0.9652)
          (xy 4.064 -1.0668)
          (xy 3.9878 -1.2446)
          (xy 3.9116 -1.4478)
          (xy 3.81 -1.651)
          (xy 3.7338 -1.8542)
          (xy 3.683 -2.0066)
          (xy 3.6576 -2.0828)
          (xy 3.683 -2.1336)
          (xy 3.7846 -2.2606)
          (xy 3.8862 -2.4638)
          (xy 4.0386 -2.667)
          (xy 4.191 -2.8956)
          (xy 4.318 -3.0734)
          (xy 4.3942 -3.2004)
          (xy 4.445 -3.2766)
          (xy 4.4196 -3.3274)
          (xy 4.3434 -3.429)
          (xy 4.1656 -3.5814)
          (xy 3.937 -3.8354)
          (xy 3.8862 -3.8608)
          (xy 3.683 -4.064)
          (xy 3.5306 -4.2164)
          (xy 3.4036 -4.318)
          (xy 3.3528 -4.3434)
        )
        (stroke (width 0) (type default) (color 0 0 0 0))
        (fill (type outline))
      )
    )
  )
  (symbol "R-device" (pin_numbers hide) (pin_names (offset 0)) (in_bom yes) (on_board yes)
    (property "Reference" "R" (id 0) (at 2.032 0 90)
      (effects (font (size 1.27 1.27)))
    )
    (property "Value" "R-device" (id 1) (at 0 0 90)
      (effects (font (size 1.27 1.27)))
    )
    (property "Footprint" "" (id 2) (at -1.778 0 90)
      (effects (font (size 1.27 1.27)) hide)
    )
    (property "Datasheet" "" (id 3) (at 0 0 0)
      (effects (font (size 1.27 1.27)) hide)
    )
    (property "ki_fp_filters" "R_*" (id 4) (at 0 0 0)
      (effects (font (size 1.27 1.27)) hide)
    )
    (symbol "R-device_0_1"
      (rectangle (start -1.016 -2.54) (end 1.016 2.54)
        (stroke (width 0.254) (type default) (color 0 0 0 0))
        (fill (type none))
      )
    )
    (symbol "R-device_1_1"
      (pin passive line (at 0 3.81 270) (length 1.27)
        (name "~" (effects (font (size 1.27 1.27))))
        (number "1" (effects (font (size 1.27 1.27))))
      )
      (pin passive line (at 0 -3.81 90) (length 1.27)
        (name "~" (effects (font (size 1.27 1.27))))
        (number "2" (effects (font (size 1.27 1.27))))
      )
    )
  )
  (symbol "SW_DIP_x08-switches" (pin_names (offset 0) hide) (in_bom yes) (on_board yes)
    (property "Reference" "SW" (id 0) (at 0 13.97 0)
      (effects (font (size 1.27 1.27)))
    )
    (property "Value" "SW_DIP_x08-switches" (id 1) (at 0 -11.43 0)
      (effects (font (size 1.27 1.27)))
    )
    (property "Footprint" "" (id 2) (at 0 0 0)
      (effects (font (size 1.27 1.27)) hide)
    )
    (property "Datasheet" "" (id 3) (at 0 0 0)
      (effects (font (size 1.27 1.27)) hide)
    )
    (property "ki_fp_filters" "SW?DIP?x8*" (id 4) (at 0 0 0)
      (effects (font (size 1.27 1.27)) hide)
    )
    (symbol "SW_DIP_x08-switches_0_0"
      (circle (center -2.032 -7.62) (radius 0.508)
        (stroke (width 0) (type default) (color 0 0 0 0))
        (fill (type none))
      )
      (circle (center -2.032 -5.08) (radius 0.508)
        (stroke (width 0) (type default) (color 0 0 0 0))
        (fill (type none))
      )
      (circle (center -2.032 -2.54) (radius 0.508)
        (stroke (width 0) (type default) (color 0 0 0 0))
        (fill (type none))
      )
      (circle (center -2.032 0) (radius 0.508)
        (stroke (width 0) (type default) (color 0 0 0 0))
        (fill (type none))
      )
      (circle (center -2.032 2.54) (radius 0.508)
        (stroke (width 0) (type default) (color 0 0 0 0))
        (fill (type none))
      )
      (circle (center -2.032 5.08) (radius 0.508)
        (stroke (width 0) (type default) (color 0 0 0 0))
        (fill (type none))
      )
      (circle (center -2.032 7.62) (radius 0.508)
        (stroke (width 0) (type default) (color 0 0 0 0))
        (fill (type none))
      )
      (circle (center -2.032 10.16) (radius 0.508)
        (stroke (width 0) (type default) (color 0 0 0 0))
        (fill (type none))
      )
      (polyline
        (pts
          (xy -1.524 -7.4676)
          (xy 2.3622 -6.4262)
        )
        (stroke (width 0) (type default) (color 0 0 0 0))
        (fill (type none))
      )
      (polyline
        (pts
          (xy -1.524 -4.9276)
          (xy 2.3622 -3.8862)
        )
        (stroke (width 0) (type default) (color 0 0 0 0))
        (fill (type none))
      )
      (polyline
        (pts
          (xy -1.524 -2.3876)
          (xy 2.3622 -1.3462)
        )
        (stroke (width 0) (type default) (color 0 0 0 0))
        (fill (type none))
      )
      (polyline
        (pts
          (xy -1.524 0.127)
          (xy 2.3622 1.1684)
        )
        (stroke (width 0) (type default) (color 0 0 0 0))
        (fill (type none))
      )
      (polyline
        (pts
          (xy -1.524 2.667)
          (xy 2.3622 3.7084)
        )
        (stroke (width 0) (type default) (color 0 0 0 0))
        (fill (type none))
      )
      (polyline
        (pts
          (xy -1.524 5.207)
          (xy 2.3622 6.2484)
        )
        (stroke (width 0) (type default) (color 0 0 0 0))
        (fill (type none))
      )
      (polyline
        (pts
          (xy -1.524 7.747)
          (xy 2.3622 8.7884)
        )
        (stroke (width 0) (type default) (color 0 0 0 0))
        (fill (type none))
      )
      (polyline
        (pts
          (xy -1.524 10.287)
          (xy 2.3622 11.3284)
        )
        (stroke (width 0) (type default) (color 0 0 0 0))
        (fill (type none))
      )
      (circle (center 2.032 -7.62) (radius 0.508)
        (stroke (width 0) (type default) (color 0 0 0 0))
        (fill (type none))
      )
      (circle (center 2.032 -5.08) (radius 0.508)
        (stroke (width 0) (type default) (color 0 0 0 0))
        (fill (type none))
      )
      (circle (center 2.032 -2.54) (radius 0.508)
        (stroke (width 0) (type default) (color 0 0 0 0))
        (fill (type none))
      )
      (circle (center 2.032 0) (radius 0.508)
        (stroke (width 0) (type default) (color 0 0 0 0))
        (fill (type none))
      )
      (circle (center 2.032 2.54) (radius 0.508)
        (stroke (width 0) (type default) (color 0 0 0 0))
        (fill (type none))
      )
      (circle (center 2.032 5.08) (radius 0.508)
        (stroke (width 0) (type default) (color 0 0 0 0))
        (fill (type none))
      )
      (circle (center 2.032 7.62) (radius 0.508)
        (stroke (width 0) (type default) (color 0 0 0 0))
        (fill (type none))
      )
      (circle (center 2.032 10.16) (radius 0.508)
        (stroke (width 0) (type default) (color 0 0 0 0))
        (fill (type none))
      )
    )
    (symbol "SW_DIP_x08-switches_0_1"
      (rectangle (start -3.81 12.7) (end 3.81 -10.16)
        (stroke (width 0.254) (type default) (color 0 0 0 0))
        (fill (type background))
      )
    )
    (symbol "SW_DIP_x08-switches_1_1"
      (pin passive line (at -7.62 10.16 0) (length 5.08)
        (name "~" (effects (font (size 1.27 1.27))))
        (number "1" (effects (font (size 1.27 1.27))))
      )
      (pin passive line (at 7.62 -5.08 180) (length 5.08)
        (name "~" (effects (font (size 1.27 1.27))))
        (number "10" (effects (font (size 1.27 1.27))))
      )
      (pin passive line (at 7.62 -2.54 180) (length 5.08)
        (name "~" (effects (font (size 1.27 1.27))))
        (number "11" (effects (font (size 1.27 1.27))))
      )
      (pin passive line (at 7.62 0 180) (length 5.08)
        (name "~" (effects (font (size 1.27 1.27))))
        (number "12" (effects (font (size 1.27 1.27))))
      )
      (pin passive line (at 7.62 2.54 180) (length 5.08)
        (name "~" (effects (font (size 1.27 1.27))))
        (number "13" (effects (font (size 1.27 1.27))))
      )
      (pin passive line (at 7.62 5.08 180) (length 5.08)
        (name "~" (effects (font (size 1.27 1.27))))
        (number "14" (effects (font (size 1.27 1.27))))
      )
      (pin passive line (at 7.62 7.62 180) (length 5.08)
        (name "~" (effects (font (size 1.27 1.27))))
        (number "15" (effects (font (size 1.27 1.27))))
      )
      (pin passive line (at 7.62 10.16 180) (length 5.08)
        (name "~" (effects (font (size 1.27 1.27))))
        (number "16" (effects (font (size 1.27 1.27))))
      )
      (pin passive line (at -7.62 7.62 0) (length 5.08)
        (name "~" (effects (font (size 1.27 1.27))))
        (number "2" (effects (font (size 1.27 1.27))))
      )
      (pin passive line (at -7.62 5.08 0) (length 5.08)
        (name "~" (effects (font (size 1.27 1.27))))
        (number "3" (effects (font (size 1.27 1.27))))
      )
      (pin passive line (at -7.62 2.54 0) (length 5.08)
        (name "~" (effects (font (size 1.27 1.27))))
        (number "4" (effects (font (size 1.27 1.27))))
      )
      (pin passive line (at -7.62 0 0) (length 5.08)
        (name "~" (effects (font (size 1.27 1.27))))
        (number "5" (effects (font (size 1.27 1.27))))
      )
      (pin passive line (at -7.62 -2.54 0) (length 5.08)
        (name "~" (effects (font (size 1.27 1.27))))
        (number "6" (effects (font (size 1.27 1.27))))
      )
      (pin passive line (at -7.62 -5.08 0) (length 5.08)
        (name "~" (effects (font (size 1.27 1.27))))
        (number "7" (effects (font (size 1.27 1.27))))
      )
      (pin passive line (at -7.62 -7.62 0) (length 5.08)
        (name "~" (effects (font (size 1.27 1.27))))
        (number "8" (effects (font (size 1.27 1.27))))
      )
      (pin passive line (at 7.62 -7.62 180) (length 5.08)
        (name "~" (effects (font (size 1.27 1.27))))
        (number "9" (effects (font (size 1.27 1.27))))
      )
    )
  )
)
