(module QFN-16-1EP_4x4mm_P0.65mm_EP2.1x2.1mm (layer F.Cu) (tedit 5C940321)
  (descr "QFN, 16 Pin (http://www.thatcorp.com/datashts/THAT_1580_Datasheet.pdf), generated with kicad-footprint-generator ipc_dfn_qfn_generator.py")
  (tags "QFN DFN_QFN")
  (attr smd)
  (fp_text reference IC1 (at -2.962 -3.5118) (layer F.SilkS)
    (effects (font (size 0.762 0.762) (thickness 0.127)))
  )
  (fp_text value LTC5510 (at 0 3.32) (layer F.Fab)
    (effects (font (size 1 1) (thickness 0.15)))
  )
  (fp_line (start 1.385 -2.11) (end 2.11 -2.11) (layer F.SilkS) (width 0.12))
  (fp_line (start 2.11 -2.11) (end 2.11 -1.385) (layer F.SilkS) (width 0.12))
  (fp_line (start -1.385 2.11) (end -2.11 2.11) (layer F.SilkS) (width 0.12))
  (fp_line (start -2.11 2.11) (end -2.11 1.385) (layer F.SilkS) (width 0.12))
  (fp_line (start 1.385 2.11) (end 2.11 2.11) (layer F.SilkS) (width 0.12))
  (fp_line (start 2.11 2.11) (end 2.11 1.385) (layer F.SilkS) (width 0.12))
  (fp_line (start -1.385 -2.11) (end -2.11 -2.11) (layer F.SilkS) (width 0.12))
  (fp_line (start -1 -2) (end 2 -2) (layer F.Fab) (width 0.1))
  (fp_line (start 2 -2) (end 2 2) (layer F.Fab) (width 0.1))
  (fp_line (start 2 2) (end -2 2) (layer F.Fab) (width 0.1))
  (fp_line (start -2 2) (end -2 -1) (layer F.Fab) (width 0.1))
  (fp_line (start -2 -1) (end -1 -2) (layer F.Fab) (width 0.1))
  (fp_line (start -2.62 -2.62) (end -2.62 2.62) (layer F.CrtYd) (width 0.05))
  (fp_line (start -2.62 2.62) (end 2.62 2.62) (layer F.CrtYd) (width 0.05))
  (fp_line (start 2.62 2.62) (end 2.62 -2.62) (layer F.CrtYd) (width 0.05))
  (fp_line (start 2.62 -2.62) (end -2.62 -2.62) (layer F.CrtYd) (width 0.05))
  (fp_text user %R (at 0 0) (layer F.Fab)
    (effects (font (size 1 1) (thickness 0.15)))
  )
  (pad "" smd roundrect (at -0.525 -0.525) (size 0.85 0.85) (layers F.Paste) (roundrect_rratio 0.25))
  (pad "" smd roundrect (at -0.525 0.525) (size 0.85 0.85) (layers F.Paste) (roundrect_rratio 0.25))
  (pad "" smd roundrect (at 0.525 -0.525) (size 0.85 0.85) (layers F.Paste) (roundrect_rratio 0.25))
  (pad "" smd roundrect (at 0.525 0.525) (size 0.85 0.85) (layers F.Paste) (roundrect_rratio 0.25))
  (pad 1 smd roundrect (at -1.95 -0.975) (size 0.85 0.3) (layers F.Cu F.Paste F.Mask) (roundrect_rratio 0.25)
    (solder_paste_margin -0.0254))
  (pad 2 smd roundrect (at -1.95 -0.325) (size 0.85 0.3) (layers F.Cu F.Paste F.Mask) (roundrect_rratio 0.25)
    (solder_paste_margin -0.0254))
  (pad 3 smd roundrect (at -1.95 0.325) (size 0.85 0.3) (layers F.Cu F.Paste F.Mask) (roundrect_rratio 0.25)
    (solder_paste_margin -0.0254))
  (pad 4 smd roundrect (at -1.95 0.975) (size 0.85 0.3) (layers F.Cu F.Paste F.Mask) (roundrect_rratio 0.25)
    (solder_paste_margin -0.0254))
  (pad 5 smd roundrect (at -0.975 1.95) (size 0.3 0.85) (layers F.Cu F.Paste F.Mask) (roundrect_rratio 0.25)
    (solder_paste_margin -0.0254))
  (pad 6 smd roundrect (at -0.325 1.95) (size 0.3 0.85) (layers F.Cu F.Paste F.Mask) (roundrect_rratio 0.25)
    (solder_paste_margin -0.0254))
  (pad 7 smd roundrect (at 0.325 1.95) (size 0.3 0.85) (layers F.Cu F.Paste F.Mask) (roundrect_rratio 0.25)
    (solder_paste_margin -0.0254))
  (pad 8 smd roundrect (at 0.975 1.95) (size 0.3 0.85) (layers F.Cu F.Paste F.Mask) (roundrect_rratio 0.25)
    (solder_paste_margin -0.0254))
  (pad 9 smd roundrect (at 1.95 0.975) (size 0.85 0.3) (layers F.Cu F.Paste F.Mask) (roundrect_rratio 0.25)
    (solder_paste_margin -0.0254))
  (pad 10 smd roundrect (at 1.95 0.325) (size 0.85 0.3) (layers F.Cu F.Paste F.Mask) (roundrect_rratio 0.25)
    (solder_paste_margin -0.0254))
  (pad 11 smd roundrect (at 1.95 -0.325) (size 0.85 0.3) (layers F.Cu F.Paste F.Mask) (roundrect_rratio 0.25)
    (solder_paste_margin -0.0254))
  (pad 12 smd roundrect (at 1.95 -0.975) (size 0.85 0.3) (layers F.Cu F.Paste F.Mask) (roundrect_rratio 0.25)
    (solder_paste_margin -0.0254))
  (pad 13 smd roundrect (at 0.975 -1.95) (size 0.3 0.85) (layers F.Cu F.Paste F.Mask) (roundrect_rratio 0.25)
    (solder_paste_margin -0.0254))
  (pad 14 smd roundrect (at 0.325 -1.95) (size 0.3 0.85) (layers F.Cu F.Paste F.Mask) (roundrect_rratio 0.25)
    (solder_paste_margin -0.0254))
  (pad 15 smd roundrect (at -0.325 -1.95) (size 0.3 0.85) (layers F.Cu F.Paste F.Mask) (roundrect_rratio 0.25)
    (solder_paste_margin -0.0254))
  (pad 16 smd roundrect (at -0.975 -1.95) (size 0.3 0.85) (layers F.Cu F.Paste F.Mask) (roundrect_rratio 0.25)
    (solder_paste_margin -0.0254))
  (pad 17 thru_hole rect (at -0.525 -0.525) (size 1.05 1.05) (drill 0.38) (layers *.Cu F.Paste F.Mask))
  (pad 17 thru_hole rect (at 0.525 -0.525) (size 1.05 1.05) (drill 0.38) (layers *.Cu F.Paste F.Mask))
  (pad 17 thru_hole rect (at 0.525 0.525) (size 1.05 1.05) (drill 0.38) (layers *.Cu F.Paste F.Mask))
  (pad 17 thru_hole rect (at -0.52578 0.525) (size 1.05 1.05) (drill 0.38) (layers *.Cu F.Paste F.Mask))
  (model ${KISYS3DMOD}/Package_DFN_QFN.3dshapes/QFN-16-1EP_4x4mm_P0.65mm_EP2.5x2.5mm.wrl
    (at (xyz 0 0 0))
    (scale (xyz 1 1 1))
    (rotate (xyz 0 0 0))
  )
)
