EESchema Schematic File Version 4
EELAYER 30 0
EELAYER END
$Descr A3 16535 11693
encoding utf-8
Sheet 1 1
Title "Clock Generator II"
Date "2020-05-27"
Rev "3.0"
Comp "Dyadic Pty Ltd"
Comment1 "2020"
Comment2 ""
Comment3 ""
Comment4 ""
$EndDescr
$Comp
L project:AD9552 U1
U 1 1 540EB38E
P 7950 3950
F 0 "U1" H 8830 4920 60  0000 C CNN
F 1 "AD9552" H 7060 4930 60  0000 C CNN
F 2 "Analog_Devices:QFN-32-1EP_5x5mm_Pitch0.5mm" H 7950 3950 60  0001 C CNN
F 3 "http://www.analog.com/media/en/technical-documentation/data-sheets/AD9552.pdf" H 7950 3950 60  0001 C CNN
F 4 "Analog Devices" H 7950 3950 60  0001 C CNN "MFN"
F 5 "AD9552BCPZ " H 7950 3950 60  0001 C CNN "MFP"
F 6 "AD9552BCPZ-ND" H 7950 3950 60  0001 C CNN "S1PN"
F 7 "Digi-Key" H 7950 3950 60  0001 C CNN "S1PL"
F 8 "584-AD9552BCPZ " H 7950 3950 60  0001 C CNN "S2PN"
F 9 "Mouser" H 7950 3950 60  0001 C CNN "S2PL"
F 10 "3.3V, -40C to 85C" H 7950 3950 60  0001 C CNN "Characteristics"
F 11 " IC PLL CLOCK GEN LP 32LFCSP" H 7950 3950 60  0001 C CNN "Description"
F 12 "32-WFQFN Exposed Pad, CSP " H 7950 3950 60  0001 C CNN "Package ID"
F 13 "~" H 7950 3950 60  0001 C CNN "Source"
F 14 "N" H 7950 3950 60  0001 C CNN "Critical"
F 15 "~" H 7950 3950 60  0001 C CNN "Notes"
F 16 "1:$6.81; 10:$6.78; 100:$6.65" H 7950 3950 50  0001 C CNN "kicost:Chip_One_Stop:pricing"
	1    7950 3950
	1    0    0    -1  
$EndComp
$Comp
L device:C C7
U 1 1 5434F8C7
P 9450 5000
F 0 "C7" H 9480 5090 40  0000 L CNN
F 1 "0.47u" H 9480 4910 40  0000 L CNN
F 2 "Capacitor_SMD:C_0402_1005Metric" H 9488 4850 30  0001 C CNN
F 3 "https://media.digikey.com/pdf/Data%20Sheets/Murata%20PDFs/GRM%20Series%20Data.pdf" H 9450 5000 60  0001 C CNN
F 4 "Murata Electronics North America" H 9450 5000 60  0001 C CNN "MFN"
F 5 "GRM155R61A474KE15J" H 9450 5000 60  0001 C CNN "MFP"
F 6 "490-6305-1-ND " H 9450 5000 60  0001 C CNN "S1PN"
F 7 "Digi-Key" H 9450 5000 60  0001 C CNN "S1PL"
F 8 "GRM155R61A474KE15J" H 9450 5000 60  0001 C CNN "S2PN"
F 9 "Arrow" H 9450 5000 60  0001 C CNN "S2PL"
F 10 "~" H 9450 5000 60  0001 C CNN "Characteristics"
F 11 "0.47µF 10V Ceramic Capacitor X5R" H 9450 5000 60  0001 C CNN "Description"
F 12 "0402 (1005 Metric) " H 9450 5000 60  0001 C CNN "Package ID"
F 13 "~" H 9450 5000 60  0001 C CNN "Source"
F 14 "N" H 9450 5000 60  0001 C CNN "Critical"
F 15 "~" H 9450 5000 60  0001 C CNN "Notes"
	1    9450 5000
	1    0    0    -1  
$EndComp
$Comp
L device:C C6
U 1 1 5434F9E6
P 8350 5450
F 0 "C6" H 8380 5540 40  0000 L CNN
F 1 "12n" H 8380 5360 40  0000 L CNN
F 2 "Capacitor_SMD:C_0402_1005Metric" H 8388 5300 30  0001 C CNN
F 3 "https://media.digikey.com/pdf/Data%20Sheets/Murata%20PDFs/GRM%20Series%20Data.pdf" H 8350 5450 60  0001 C CNN
F 4 "Murata Electronics North America" H 8350 5450 60  0001 C CNN "MFN"
F 5 "GRM155R71H122KA01J" H 8350 5450 60  0001 C CNN "MFP"
F 6 "490-6352-1-ND" H 8350 5450 60  0001 C CNN "S1PN"
F 7 "Digi-Key" H 8350 5450 60  0001 C CNN "S1PL"
F 8 "GRM155R71H122KA01J" H 8350 5450 60  0001 C CNN "S2PN"
F 9 "Arrow" H 8350 5450 60  0001 C CNN "S2PL"
F 10 "~" H 8350 5450 60  0001 C CNN "Characteristics"
F 11 "1200pF 50V Ceramic Capacitor X7R" H 8350 5450 60  0001 C CNN "Description"
F 12 "0402 (1005 Metric)" H 8350 5450 60  0001 C CNN "Package ID"
F 13 "~" H 8350 5450 60  0001 C CNN "Source"
F 14 "N" H 8350 5450 60  0001 C CNN "Critical"
F 15 "~" H 8350 5450 60  0001 C CNN "Notes"
	1    8350 5450
	1    0    0    -1  
$EndComp
Text GLabel 10200 3350 1    60   Input ~ 0
A_3.3V
Text GLabel 9700 3350 1    60   Input ~ 0
A_3.3V
Text GLabel 6025 4250 0    60   Input ~ 0
A_3.3V
$Comp
L power:GND #PWR01
U 1 1 54350BD7
P 9450 5150
F 0 "#PWR01" H 9450 5150 30  0001 C CNN
F 1 "GND" H 9450 5080 30  0001 C CNN
F 2 "" H 9450 5150 60  0000 C CNN
F 3 "" H 9450 5150 60  0000 C CNN
	1    9450 5150
	1    0    0    -1  
$EndComp
$Comp
L power:GND #PWR02
U 1 1 54350BEE
P 9700 4850
F 0 "#PWR02" H 9700 4850 30  0001 C CNN
F 1 "GND" H 9700 4780 30  0001 C CNN
F 2 "" H 9700 4850 60  0000 C CNN
F 3 "" H 9700 4850 60  0000 C CNN
	1    9700 4850
	1    0    0    -1  
$EndComp
$Comp
L power:GND #PWR03
U 1 1 54350BF4
P 9950 5000
F 0 "#PWR03" H 9950 5000 30  0001 C CNN
F 1 "GND" H 9950 4930 30  0001 C CNN
F 2 "" H 9950 5000 60  0000 C CNN
F 3 "" H 9950 5000 60  0000 C CNN
	1    9950 5000
	1    0    0    -1  
$EndComp
$Comp
L power:GND #PWR04
U 1 1 54350BFA
P 10200 4700
F 0 "#PWR04" H 10200 4700 30  0001 C CNN
F 1 "GND" H 10200 4630 30  0001 C CNN
F 2 "" H 10200 4700 60  0000 C CNN
F 3 "" H 10200 4700 60  0000 C CNN
	1    10200 4700
	1    0    0    -1  
$EndComp
Text GLabel 7650 1450 0    60   Input ~ 0
A_3.3V
$Comp
L device:C C5
U 1 1 54350FB4
P 7850 1800
F 0 "C5" H 7850 1900 40  0000 L CNN
F 1 "0.1u" H 7856 1715 40  0000 L CNN
F 2 "Capacitor_SMD:C_0402_1005Metric" H 7888 1650 30  0001 C CNN
F 3 "" H 7850 1800 60  0000 C CNN
F 4 "Murata Electronics North America" H 7850 1800 60  0001 C CNN "MFN"
F 5 "GRM155R61A104KA01D" H 7850 1800 60  0001 C CNN "MFP"
F 6 "490-1318-1-ND " H 7850 1800 60  0001 C CNN "S1PN"
F 7 "Digi-Key" H 7850 1800 60  0001 C CNN "S1PL"
F 8 "GRM155R71A104KA01D" H 7850 1800 60  0001 C CNN "S2PN"
F 9 "Arrow" H 7850 1800 60  0001 C CNN "S2PL"
F 10 "10V X7R 10%" H 7850 1800 60  0001 C CNN "Characteristics"
F 11 "0.10µF 10V Ceramic Capacitor X5R 0402" H 7850 1800 60  0001 C CNN "Description"
F 12 "0402 (1005 Metric) " H 7850 1800 60  0001 C CNN "Package ID"
F 13 "~" H 7850 1800 60  0001 C CNN "Source"
F 14 "N" H 7850 1800 60  0001 C CNN "Critical"
F 15 "~" H 7850 1800 60  0001 C CNN "Notes"
	1    7850 1800
	1    0    0    -1  
$EndComp
$Comp
L power:GND #PWR05
U 1 1 54350FEF
P 7850 1950
F 0 "#PWR05" H 7850 1950 30  0001 C CNN
F 1 "GND" H 7850 1880 30  0001 C CNN
F 2 "" H 7850 1950 60  0000 C CNN
F 3 "" H 7850 1950 60  0000 C CNN
	1    7850 1950
	1    0    0    -1  
$EndComp
$Comp
L power:GND #PWR07
U 1 1 5435C13B
P 6425 5000
F 0 "#PWR07" H 6425 5000 30  0001 C CNN
F 1 "GND" H 6425 4930 30  0001 C CNN
F 2 "" H 6425 5000 60  0000 C CNN
F 3 "" H 6425 5000 60  0000 C CNN
	1    6425 5000
	1    0    0    -1  
$EndComp
$Comp
L power:GND #PWR08
U 1 1 5435C1B2
P 6175 4750
F 0 "#PWR08" H 6175 4750 30  0001 C CNN
F 1 "GND" H 6175 4680 30  0001 C CNN
F 2 "" H 6175 4750 60  0000 C CNN
F 3 "" H 6175 4750 60  0000 C CNN
	1    6175 4750
	1    0    0    -1  
$EndComp
$Comp
L power:+5V #PWR09
U 1 1 551BC94C
P 11975 8025
F 0 "#PWR09" H 11975 7875 50  0001 C CNN
F 1 "+5V" H 11975 8175 50  0000 C CNN
F 2 "" H 11975 8025 60  0000 C CNN
F 3 "" H 11975 8025 60  0000 C CNN
	1    11975 8025
	-1   0    0    -1  
$EndComp
$Comp
L power:GND #PWR010
U 1 1 551BCA0D
P 10300 8925
F 0 "#PWR010" H 10300 8675 50  0001 C CNN
F 1 "GND" H 10300 8775 50  0000 C CNN
F 2 "" H 10300 8925 60  0000 C CNN
F 3 "" H 10300 8925 60  0000 C CNN
	1    10300 8925
	-1   0    0    -1  
$EndComp
$Comp
L power:PWR_FLAG #FLG011
U 1 1 551BCB9E
P 11600 8025
F 0 "#FLG011" H 11600 8120 50  0001 C CNN
F 1 "PWR_FLAG" H 11600 8205 50  0000 C CNN
F 2 "" H 11600 8025 60  0000 C CNN
F 3 "" H 11600 8025 60  0000 C CNN
	1    11600 8025
	-1   0    0    -1  
$EndComp
$Comp
L power:PWR_FLAG #FLG012
U 1 1 551BCC00
P 10300 8675
F 0 "#FLG012" H 10300 8770 50  0001 C CNN
F 1 "PWR_FLAG" V 10200 8925 50  0000 C CNN
F 2 "" H 10300 8675 60  0000 C CNN
F 3 "" H 10300 8675 60  0000 C CNN
	1    10300 8675
	0    1    -1   0   
$EndComp
Text GLabel 5200 8275 2    60   Input ~ 0
LOCKED
Text GLabel 9250 4050 2    60   Input ~ 0
LOCKED
$Comp
L power:GND #PWR013
U 1 1 551C1443
P 9175 3425
F 0 "#PWR013" H 9175 3175 50  0001 C CNN
F 1 "GND" H 9175 3275 50  0000 C CNN
F 2 "" H 9175 3425 60  0000 C CNN
F 3 "" H 9175 3425 60  0000 C CNN
	1    9175 3425
	-1   0    0    1   
$EndComp
$Comp
L power:GND #PWR014
U 1 1 551C1A16
P 8350 2700
F 0 "#PWR014" H 8350 2450 50  0001 C CNN
F 1 "GND" H 8350 2550 50  0000 C CNN
F 2 "" H 8350 2700 60  0000 C CNN
F 3 "" H 8350 2700 60  0000 C CNN
	1    8350 2700
	-1   0    0    1   
$EndComp
$Comp
L power:GND #PWR015
U 1 1 551D1F2D
P 8750 2700
F 0 "#PWR015" H 8750 2450 50  0001 C CNN
F 1 "GND" H 8750 2550 50  0000 C CNN
F 2 "" H 8750 2700 60  0000 C CNN
F 3 "" H 8750 2700 60  0000 C CNN
	1    8750 2700
	-1   0    0    1   
$EndComp
NoConn ~ 2950 5600
Text GLabel 2675 5400 0    60   Input ~ 0
A_3.3V
$Comp
L power:GND #PWR016
U 1 1 551FAA5A
P 4225 5700
F 0 "#PWR016" H 4225 5700 30  0001 C CNN
F 1 "GND" H 4225 5630 30  0001 C CNN
F 2 "" H 4225 5700 60  0000 C CNN
F 3 "" H 4225 5700 60  0000 C CNN
	1    4225 5700
	1    0    0    -1  
$EndComp
Text GLabel 14075 8025 2    60   Input ~ 0
A_3.3V
$Comp
L device:C C21
U 1 1 55209769
P 12325 8275
F 0 "C21" H 12350 8375 50  0000 L CNN
F 1 "1uF" H 12350 8175 50  0000 L CNN
F 2 "Capacitor_SMD:C_0805_2012Metric" H 12363 8125 30  0001 C CNN
F 3 "https://media.digikey.com/pdf/Data%20Sheets/Murata%20PDFs/GRM%20Series%20Data.pdf" H 12325 8275 60  0001 C CNN
F 4 "Yageo" H 13975 8275 50  0001 C CNN "MFN"
F 5 "CC0805KKX7R8BB105 " H 13975 8275 50  0001 C CNN "MFP"
F 6 "311-1456-1-ND" H 13975 8275 50  0001 C CNN "S1PN"
F 7 "Digi-Key" H 13975 8275 50  0001 C CNN "S1PL"
F 8 "603-CC805KKX7R8BB105" H 13975 8275 50  0001 C CNN "S2PN"
F 9 "Mouser" H 13975 8275 50  0001 C CNN "S2PL"
F 10 "~" H 13975 8275 60  0001 C CNN "Characteristics"
F 11 "Ceramic Capacitors MLCC - SMD/SMT 1.0uF 25V X7R 10% " H 13975 8275 50  0001 C CNN "Description"
F 12 "0805 (2012 metric)" H 13975 8275 50  0001 C CNN "Package ID"
	1    12325 8275
	1    0    0    -1  
$EndComp
$Comp
L project:OSC X1
U 1 1 56A5E385
P 3550 5500
F 0 "X1" H 3550 5750 70  0000 C CNN
F 1 "ECS_TXO_3225" H 3550 5225 50  0000 C CNN
F 2 "Oscillators_SMD:osc-3.2x2.5" H 3550 5500 60  0001 C CNN
F 3 "http://www.ecsxtal.com/store/pdf/ECS-TXO-5032.pdf" H 3550 5500 60  0001 C CNN
F 4 "ECS Inc" H 3550 5500 60  0001 C CNN "MFN"
F 5 "ECS-TXO-3225-200-TR " H 3550 5500 60  0001 C CNN "MFP"
F 6 "XC2061CT-ND" H 3550 5500 60  0001 C CNN "S1PN"
F 7 "Digi-Key" H 3550 5500 60  0001 C CNN "S1PL"
F 8 "520-TXO-3225-20.0T" H 3550 5500 60  0001 C CNN "S2PN"
F 9 "Mouser" H 3550 5500 60  0001 C CNN "S2PL"
F 10 "20MHz TCXO HCMOS Oscillator 3.3V 4-SMD" H 3550 5500 60  0001 C CNN "Description"
F 11 "4-SMD, 0.126\" L x 0.098\" W (3.20mm x 2.50mm)  " H 3550 5500 60  0001 C CNN "Package ID"
F 12 "~" H 3550 5500 60  0001 C CNN "Source"
F 13 "N" H 3550 5500 60  0001 C CNN "Critical"
F 14 "-135dBc @ 1kHz" H 3550 5500 60  0001 C CNN "Notes"
	1    3550 5500
	1    0    0    -1  
$EndComp
Text Notes 3050 5950 0    60   ~ 0
(-135dBc @ 1kHz)
$Comp
L device:R R8
U 1 1 56A84E94
P 12125 2275
F 0 "R8" V 12225 2275 40  0000 C CNN
F 1 "0" V 12132 2276 40  0000 C CNN
F 2 "Resistor_SMD:R_0402_1005Metric" V 12055 2275 30  0001 C CNN
F 3 "http://industrial.panasonic.com/ww/products/resistors/chip-resistors/chip-resistors/thick-film-chip-resistors/ERJ2GE0R00X" H 12125 2275 30  0001 C CNN
F 4 "Panasonic Electronic Components" H 12125 2275 60  0001 C CNN "MFN"
F 5 "ERJ-2GE0R00X" H 12125 2275 60  0001 C CNN "MFP"
F 6 "P0.0JCT-ND" H 12125 2275 60  0001 C CNN "S1PN"
F 7 "Digi-Key" H 12125 2275 60  0001 C CNN "S1PL"
F 8 "ERJ-2GE0R00X" H 12125 2275 60  0001 C CNN "S2PN"
F 9 "Arrow" H 12125 2275 60  0001 C CNN "S2PL"
F 10 "~" H 12125 2275 60  0001 C CNN "Characteristics"
F 11 "RES SMD 0.0OHM JUMPER 1/10W" H 12125 2275 60  0001 C CNN "Description"
F 12 "0402 (1005 Metric) " H 12125 2275 60  0001 C CNN "Package ID"
F 13 "~" H 12125 2275 60  0001 C CNN "Source"
F 14 "N" H 12125 2275 60  0001 C CNN "Critical"
F 15 "~" H 12125 2275 60  0001 C CNN "Notes"
	1    12125 2275
	0    1    1    0   
$EndComp
$Comp
L device:C C13
U 1 1 56AC41EA
P 11100 8275
F 0 "C13" H 11100 8375 40  0000 L CNN
F 1 "0.01u" H 11106 8190 40  0000 L CNN
F 2 "Capacitor_SMD:C_0603_1608Metric" H 11138 8125 30  0001 C CNN
F 3 "http://www.kemet.com/docfinder?Partnumber=C0603C103K5RACTU" H 11100 8275 60  0001 C CNN
F 4 "Kemet" H 11100 8275 60  0001 C CNN "MFN"
F 5 "C0603C103K5RACTU" H 11100 8275 60  0001 C CNN "MFP"
F 6 "399-1091-1-ND " H 11100 8275 60  0001 C CNN "S1PN"
F 7 "Digi-Key" H 11100 8275 60  0001 C CNN "S1PL"
F 8 "C0603C103K5RACTU" H 11100 8275 60  0001 C CNN "S2PN"
F 9 "Arrow" H 11100 8275 60  0001 C CNN "S2PL"
F 10 "~" H 11100 8275 60  0001 C CNN "Characteristics"
F 11 "10000pF 50V Ceramic Capacitor X7R" H 11100 8275 60  0001 C CNN "Description"
F 12 "0603 (1608 Metric) " H 11100 8275 60  0001 C CNN "Package ID"
F 13 "~" H 11100 8275 60  0001 C CNN "Source"
F 14 "N" H 11100 8275 60  0001 C CNN "Critical"
F 15 "~" H 11100 8275 60  0001 C CNN "Notes"
	1    11100 8275
	1    0    0    -1  
$EndComp
$Comp
L device:C C14
U 1 1 56AC4277
P 11600 8275
F 0 "C14" H 11600 8375 40  0000 L CNN
F 1 "0.1u" H 11606 8190 40  0000 L CNN
F 2 "Capacitor_SMD:C_0603_1608Metric" H 11638 8125 30  0001 C CNN
F 3 "http://www.kemet.com/docfinder?Partnumber=C0603C104K5RACTU" H 11600 8275 60  0001 C CNN
F 4 "Kemet" H 11600 8275 60  0001 C CNN "MFN"
F 5 "C0603C104K5RACTU" H 11600 8275 60  0001 C CNN "MFP"
F 6 "399-5089-1-ND " H 11600 8275 60  0001 C CNN "S1PN"
F 7 "Digi-Key" H 11600 8275 60  0001 C CNN "S1PL"
F 8 "C0603C104K5RACTU" H 11600 8275 60  0001 C CNN "S2PN"
F 9 "Arrow" H 11600 8275 60  0001 C CNN "S2PL"
F 10 "~" H 11600 8275 60  0001 C CNN "Characteristics"
F 11 "0.10µF 50V Ceramic Capacitor X7R " H 11600 8275 60  0001 C CNN "Description"
F 12 "0603 (1608 Metric) " H 11600 8275 60  0001 C CNN "Package ID"
F 13 "~" H 11600 8275 60  0001 C CNN "Source"
F 14 "N" H 11600 8275 60  0001 C CNN "Critical"
F 15 "~" H 11600 8275 60  0001 C CNN "Notes"
	1    11600 8275
	1    0    0    -1  
$EndComp
$Comp
L device:R R11
U 1 1 56AC4326
P 11350 8025
F 0 "R11" V 11275 8000 40  0000 C CNN
F 1 "2.2" V 11357 8026 40  0000 C CNN
F 2 "Resistor_SMD:R_0805_2012Metric" V 11280 8025 30  0001 C CNN
F 3 "" H 11350 8025 30  0001 C CNN
F 4 "Yageo" H 11350 8025 60  0001 C CNN "MFN"
F 5 "RC0805FR-072R2L" H 11350 8025 60  0001 C CNN "MFP"
F 6 "311-2.20CRCT-ND" H 11350 8025 60  0001 C CNN "S1PN"
F 7 "Digi-Key" H 11350 8025 60  0001 C CNN "S1PL"
F 8 "603-RC0805FR-072R2L" H 11350 8025 60  0001 C CNN "S2PN"
F 9 "Mouser" H 11350 8025 60  0001 C CNN "S2PL"
F 10 "~" H 11350 8025 60  0001 C CNN "Characteristics"
F 11 "2.2 Ohms ±1% 0.125W, 1/8W Chip Resistor" H 11350 8025 60  0001 C CNN "Description"
F 12 "0805 (2012 Metric) " H 11350 8025 60  0001 C CNN "Package ID"
F 13 "~" H 11350 8025 60  0001 C CNN "Source"
F 14 "N" H 11350 8025 60  0001 C CNN "Critical"
F 15 "~" H 11350 8025 60  0001 C CNN "Notes"
	1    11350 8025
	0    1    1    0   
$EndComp
$Comp
L power:GND #PWR029
U 1 1 56AC4B9B
P 11100 8475
F 0 "#PWR029" H 11100 8225 50  0001 C CNN
F 1 "GND" H 11100 8325 50  0000 C CNN
F 2 "" H 11100 8475 60  0000 C CNN
F 3 "" H 11100 8475 60  0000 C CNN
	1    11100 8475
	-1   0    0    -1  
$EndComp
$Comp
L power:GND #PWR030
U 1 1 56AC4C15
P 11600 8475
F 0 "#PWR030" H 11600 8225 50  0001 C CNN
F 1 "GND" H 11600 8325 50  0000 C CNN
F 2 "" H 11600 8475 60  0000 C CNN
F 3 "" H 11600 8475 60  0000 C CNN
	1    11600 8475
	-1   0    0    -1  
$EndComp
$Comp
L device:C C15
U 1 1 57B78E40
P 11500 1725
F 0 "C15" V 11450 1775 40  0000 L CNN
F 1 "0.1u" V 11550 1775 40  0000 L CNN
F 2 "Capacitor_SMD:C_0402_1005Metric" H 11538 1575 30  0001 C CNN
F 3 "" H 11500 1725 60  0000 C CNN
F 4 "Murata Electronics North America" H 11500 1725 60  0001 C CNN "MFN"
F 5 "GRM155R61A104KA01D" H 11500 1725 60  0001 C CNN "MFP"
F 6 "490-1318-1-ND " H 11500 1725 60  0001 C CNN "S1PN"
F 7 "Digi-Key" H 11500 1725 60  0001 C CNN "S1PL"
F 8 "GRM155R71A104KA01D" H 11500 1725 60  0001 C CNN "S2PN"
F 9 "Arrow" H 11500 1725 60  0001 C CNN "S2PL"
F 10 "10V X7R 10%" H 11500 1725 60  0001 C CNN "Characteristics"
F 11 "0.10µF 10V Ceramic Capacitor X5R 0402" H 11500 1725 60  0001 C CNN "Description"
F 12 "0402 (1005 Metric) " H 11500 1725 60  0001 C CNN "Package ID"
F 13 "~" H 11500 1725 60  0001 C CNN "Source"
F 14 "N" H 11500 1725 60  0001 C CNN "Critical"
F 15 "~" H 11500 1725 60  0001 C CNN "Notes"
	1    11500 1725
	0    1    1    0   
$EndComp
$Comp
L device:C C16
U 1 1 57B7959A
P 11500 2275
F 0 "C16" V 11450 2325 40  0000 L CNN
F 1 "0.1u" V 11550 2325 40  0000 L CNN
F 2 "Capacitor_SMD:C_0402_1005Metric" H 11538 2125 30  0001 C CNN
F 3 "" H 11500 2275 60  0000 C CNN
F 4 "Murata Electronics North America" H 11500 2275 60  0001 C CNN "MFN"
F 5 "GRM155R61A104KA01D" H 11500 2275 60  0001 C CNN "MFP"
F 6 "490-1318-1-ND " H 11500 2275 60  0001 C CNN "S1PN"
F 7 "Digi-Key" H 11500 2275 60  0001 C CNN "S1PL"
F 8 "GRM155R71A104KA01D" H 11500 2275 60  0001 C CNN "S2PN"
F 9 "Arrow" H 11500 2275 60  0001 C CNN "S2PL"
F 10 "10V X7R 10%" H 11500 2275 60  0001 C CNN "Characteristics"
F 11 "0.10µF 10V Ceramic Capacitor X5R 0402" H 11500 2275 60  0001 C CNN "Description"
F 12 "0402 (1005 Metric) " H 11500 2275 60  0001 C CNN "Package ID"
F 13 "~" H 11500 2275 60  0001 C CNN "Source"
F 14 "N" H 11500 2275 60  0001 C CNN "Critical"
F 15 "~" H 11500 2275 60  0001 C CNN "Notes"
	1    11500 2275
	0    1    1    0   
$EndComp
$Comp
L device:C C8
U 1 1 57B79C46
P 9700 4700
F 0 "C8" H 9725 4800 40  0000 L CNN
F 1 "0.1u" H 9725 4600 40  0000 L CNN
F 2 "Capacitor_SMD:C_0402_1005Metric" H 9738 4550 30  0001 C CNN
F 3 "" H 9700 4700 60  0000 C CNN
F 4 "Murata Electronics North America" H 9700 4700 60  0001 C CNN "MFN"
F 5 "GRM155R61A104KA01D" H 9700 4700 60  0001 C CNN "MFP"
F 6 "490-1318-1-ND " H 9700 4700 60  0001 C CNN "S1PN"
F 7 "Digi-Key" H 9700 4700 60  0001 C CNN "S1PL"
F 8 "GRM155R71A104KA01D" H 9700 4700 60  0001 C CNN "S2PN"
F 9 "Arrow" H 9700 4700 60  0001 C CNN "S2PL"
F 10 "10V X7R 10%" H 9700 4700 60  0001 C CNN "Characteristics"
F 11 "0.10µF 10V Ceramic Capacitor X5R 0402" H 9700 4700 60  0001 C CNN "Description"
F 12 "0402 (1005 Metric) " H 9700 4700 60  0001 C CNN "Package ID"
F 13 "~" H 9700 4700 60  0001 C CNN "Source"
F 14 "N" H 9700 4700 60  0001 C CNN "Critical"
F 15 "~" H 9700 4700 60  0001 C CNN "Notes"
	1    9700 4700
	1    0    0    -1  
$EndComp
$Comp
L device:C C10
U 1 1 57B7A0D1
P 10200 4550
F 0 "C10" H 10225 4650 40  0000 L CNN
F 1 "0.1u" H 10225 4450 40  0000 L CNN
F 2 "Capacitor_SMD:C_0402_1005Metric" H 10238 4400 30  0001 C CNN
F 3 "" H 10200 4550 60  0000 C CNN
F 4 "Murata Electronics North America" H 10200 4550 60  0001 C CNN "MFN"
F 5 "GRM155R61A104KA01D" H 10200 4550 60  0001 C CNN "MFP"
F 6 "490-1318-1-ND " H 10200 4550 60  0001 C CNN "S1PN"
F 7 "Digi-Key" H 10200 4550 60  0001 C CNN "S1PL"
F 8 "GRM155R71A104KA01D" H 10200 4550 60  0001 C CNN "S2PN"
F 9 "Arrow" H 10200 4550 60  0001 C CNN "S2PL"
F 10 "10V X7R 10%" H 10200 4550 60  0001 C CNN "Characteristics"
F 11 "0.10µF 10V Ceramic Capacitor X5R 0402" H 10200 4550 60  0001 C CNN "Description"
F 12 "0402 (1005 Metric) " H 10200 4550 60  0001 C CNN "Package ID"
F 13 "~" H 10200 4550 60  0001 C CNN "Source"
F 14 "N" H 10200 4550 60  0001 C CNN "Critical"
F 15 "~" H 10200 4550 60  0001 C CNN "Notes"
	1    10200 4550
	1    0    0    -1  
$EndComp
$Comp
L device:C C2
U 1 1 57B7A4D7
P 6175 4600
F 0 "C2" H 6200 4700 40  0000 L CNN
F 1 "0.1u" H 6200 4500 40  0000 L CNN
F 2 "Capacitor_SMD:C_0402_1005Metric" H 6213 4450 30  0001 C CNN
F 3 "" H 6175 4600 60  0000 C CNN
F 4 "Murata Electronics North America" H 6175 4600 60  0001 C CNN "MFN"
F 5 "GRM155R61A104KA01D" H 6175 4600 60  0001 C CNN "MFP"
F 6 "490-1318-1-ND " H 6175 4600 60  0001 C CNN "S1PN"
F 7 "Digi-Key" H 6175 4600 60  0001 C CNN "S1PL"
F 8 "GRM155R71A104KA01D" H 6175 4600 60  0001 C CNN "S2PN"
F 9 "Arrow" H 6175 4600 60  0001 C CNN "S2PL"
F 10 "10V X7R 10%" H 6175 4600 60  0001 C CNN "Characteristics"
F 11 "0.10µF 10V Ceramic Capacitor X5R 0402" H 6175 4600 60  0001 C CNN "Description"
F 12 "0402 (1005 Metric) " H 6175 4600 60  0001 C CNN "Package ID"
F 13 "~" H 6175 4600 60  0001 C CNN "Source"
F 14 "N" H 6175 4600 60  0001 C CNN "Critical"
F 15 "~" H 6175 4600 60  0001 C CNN "Notes"
	1    6175 4600
	1    0    0    -1  
$EndComp
$Comp
L device:C C3
U 1 1 57B7B7F6
P 6425 4850
F 0 "C3" H 6455 4940 40  0000 L CNN
F 1 "0.47u" H 6455 4760 40  0000 L CNN
F 2 "Capacitor_SMD:C_0402_1005Metric" H 6463 4700 30  0001 C CNN
F 3 "https://media.digikey.com/pdf/Data%20Sheets/Murata%20PDFs/GRM%20Series%20Data.pdf" H 6425 4850 60  0001 C CNN
F 4 "Murata Electronics North America" H 6425 4850 60  0001 C CNN "MFN"
F 5 "GRM155R61A474KE15J" H 6425 4850 60  0001 C CNN "MFP"
F 6 "490-6305-1-ND " H 6425 4850 60  0001 C CNN "S1PN"
F 7 "Digi-Key" H 6425 4850 60  0001 C CNN "S1PL"
F 8 "GRM155R61A474KE15J" H 6425 4850 60  0001 C CNN "S2PN"
F 9 "Arrow" H 6425 4850 60  0001 C CNN "S2PL"
F 10 "~" H 6425 4850 60  0001 C CNN "Characteristics"
F 11 "0.47µF 10V Ceramic Capacitor X5R" H 6425 4850 60  0001 C CNN "Description"
F 12 "0402 (1005 Metric) " H 6425 4850 60  0001 C CNN "Package ID"
F 13 "~" H 6425 4850 60  0001 C CNN "Source"
F 14 "N" H 6425 4850 60  0001 C CNN "Critical"
F 15 "~" H 6425 4850 60  0001 C CNN "Notes"
	1    6425 4850
	1    0    0    -1  
$EndComp
$Comp
L device:C C9
U 1 1 57B7B8AA
P 9950 4850
F 0 "C9" H 9980 4940 40  0000 L CNN
F 1 "0.47u" H 9980 4760 40  0000 L CNN
F 2 "Capacitor_SMD:C_0402_1005Metric" H 9988 4700 30  0001 C CNN
F 3 "https://media.digikey.com/pdf/Data%20Sheets/Murata%20PDFs/GRM%20Series%20Data.pdf" H 9950 4850 60  0001 C CNN
F 4 "Murata Electronics North America" H 9950 4850 60  0001 C CNN "MFN"
F 5 "GRM155R61A474KE15J" H 9950 4850 60  0001 C CNN "MFP"
F 6 "490-6305-1-ND " H 9950 4850 60  0001 C CNN "S1PN"
F 7 "Digi-Key" H 9950 4850 60  0001 C CNN "S1PL"
F 8 "GRM155R61A474KE15J" H 9950 4850 60  0001 C CNN "S2PN"
F 9 "Arrow" H 9950 4850 60  0001 C CNN "S2PL"
F 10 "~" H 9950 4850 60  0001 C CNN "Characteristics"
F 11 "0.47µF 10V Ceramic Capacitor X5R" H 9950 4850 60  0001 C CNN "Description"
F 12 "0402 (1005 Metric) " H 9950 4850 60  0001 C CNN "Package ID"
F 13 "~" H 9950 4850 60  0001 C CNN "Source"
F 14 "N" H 9950 4850 60  0001 C CNN "Critical"
F 15 "~" H 9950 4850 60  0001 C CNN "Notes"
	1    9950 4850
	1    0    0    -1  
$EndComp
$Comp
L device:R R7
U 1 1 57B7F23F
P 12125 1725
F 0 "R7" V 12050 1725 40  0000 C CNN
F 1 "0" V 12132 1726 40  0000 C CNN
F 2 "Resistor_SMD:R_0402_1005Metric" V 12055 1725 30  0001 C CNN
F 3 "http://industrial.panasonic.com/ww/products/resistors/chip-resistors/chip-resistors/thick-film-chip-resistors/ERJ2GE0R00X" H 12125 1725 30  0001 C CNN
F 4 "Panasonic Electronic Components" H 12125 1725 60  0001 C CNN "MFN"
F 5 "ERJ-2GE0R00X" H 12125 1725 60  0001 C CNN "MFP"
F 6 "P0.0JCT-ND" H 12125 1725 60  0001 C CNN "S1PN"
F 7 "Digi-Key" H 12125 1725 60  0001 C CNN "S1PL"
F 8 "ERJ-2GE0R00X" H 12125 1725 60  0001 C CNN "S2PN"
F 9 "Arrow" H 12125 1725 60  0001 C CNN "S2PL"
F 10 "~" H 12125 1725 60  0001 C CNN "Characteristics"
F 11 "RES SMD 0.0OHM JUMPER 1/10W" H 12125 1725 60  0001 C CNN "Description"
F 12 "0402 (1005 Metric) " H 12125 1725 60  0001 C CNN "Package ID"
F 13 "~" H 12125 1725 60  0001 C CNN "Source"
F 14 "N" H 12125 1725 60  0001 C CNN "Critical"
F 15 "~" H 12125 1725 60  0001 C CNN "Notes"
	1    12125 1725
	0    1    1    0   
$EndComp
$Comp
L device:R R27
U 1 1 57DF34AC
P 12125 4075
F 0 "R27" V 12225 4075 40  0000 C CNN
F 1 "0" V 12132 4076 40  0000 C CNN
F 2 "Resistor_SMD:R_0402_1005Metric" V 12055 4075 30  0001 C CNN
F 3 "http://industrial.panasonic.com/ww/products/resistors/chip-resistors/chip-resistors/thick-film-chip-resistors/ERJ2GE0R00X" H 12125 4075 30  0001 C CNN
F 4 "Panasonic Electronic Components" H 12125 4075 60  0001 C CNN "MFN"
F 5 "ERJ-2GE0R00X" H 12125 4075 60  0001 C CNN "MFP"
F 6 "P0.0JCT-ND" H 12125 4075 60  0001 C CNN "S1PN"
F 7 "Digi-Key" H 12125 4075 60  0001 C CNN "S1PL"
F 8 "ERJ-2GE0R00X" H 12125 4075 60  0001 C CNN "S2PN"
F 9 "Arrow" H 12125 4075 60  0001 C CNN "S2PL"
F 10 "~" H 12125 4075 60  0001 C CNN "Characteristics"
F 11 "RES SMD 0.0OHM JUMPER 1/10W" H 12125 4075 60  0001 C CNN "Description"
F 12 "0402 (1005 Metric) " H 12125 4075 60  0001 C CNN "Package ID"
F 13 "~" H 12125 4075 60  0001 C CNN "Source"
F 14 "N" H 12125 4075 60  0001 C CNN "Critical"
F 15 "~" H 12125 4075 60  0001 C CNN "Notes"
	1    12125 4075
	0    1    1    0   
$EndComp
$Comp
L device:C C19
U 1 1 57DF3545
P 11500 3525
F 0 "C19" V 11450 3575 40  0000 L CNN
F 1 "0.1u" V 11550 3575 40  0000 L CNN
F 2 "Capacitor_SMD:C_0402_1005Metric" H 11538 3375 30  0001 C CNN
F 3 "" H 11500 3525 60  0000 C CNN
F 4 "Murata Electronics North America" H 11500 3525 60  0001 C CNN "MFN"
F 5 "GRM155R61A104KA01D" H 11500 3525 60  0001 C CNN "MFP"
F 6 "490-1318-1-ND " H 11500 3525 60  0001 C CNN "S1PN"
F 7 "Digi-Key" H 11500 3525 60  0001 C CNN "S1PL"
F 8 "GRM155R71A104KA01D" H 11500 3525 60  0001 C CNN "S2PN"
F 9 "Arrow" H 11500 3525 60  0001 C CNN "S2PL"
F 10 "10V X7R 10%" H 11500 3525 60  0001 C CNN "Characteristics"
F 11 "0.10µF 10V Ceramic Capacitor X5R 0402" H 11500 3525 60  0001 C CNN "Description"
F 12 "0402 (1005 Metric) " H 11500 3525 60  0001 C CNN "Package ID"
F 13 "~" H 11500 3525 60  0001 C CNN "Source"
F 14 "N" H 11500 3525 60  0001 C CNN "Critical"
F 15 "~" H 11500 3525 60  0001 C CNN "Notes"
	1    11500 3525
	0    1    1    0   
$EndComp
$Comp
L device:C C20
U 1 1 57DF3557
P 11500 4075
F 0 "C20" V 11450 4125 40  0000 L CNN
F 1 "0.1u" V 11550 4125 40  0000 L CNN
F 2 "Capacitor_SMD:C_0402_1005Metric" H 11538 3925 30  0001 C CNN
F 3 "" H 11500 4075 60  0000 C CNN
F 4 "Murata Electronics North America" H 11500 4075 60  0001 C CNN "MFN"
F 5 "GRM155R61A104KA01D" H 11500 4075 60  0001 C CNN "MFP"
F 6 "490-1318-1-ND " H 11500 4075 60  0001 C CNN "S1PN"
F 7 "Digi-Key" H 11500 4075 60  0001 C CNN "S1PL"
F 8 "GRM155R71A104KA01D" H 11500 4075 60  0001 C CNN "S2PN"
F 9 "Arrow" H 11500 4075 60  0001 C CNN "S2PL"
F 10 "10V X7R 10%" H 11500 4075 60  0001 C CNN "Characteristics"
F 11 "0.10µF 10V Ceramic Capacitor X5R 0402" H 11500 4075 60  0001 C CNN "Description"
F 12 "0402 (1005 Metric) " H 11500 4075 60  0001 C CNN "Package ID"
F 13 "~" H 11500 4075 60  0001 C CNN "Source"
F 14 "N" H 11500 4075 60  0001 C CNN "Critical"
F 15 "~" H 11500 4075 60  0001 C CNN "Notes"
	1    11500 4075
	0    1    1    0   
$EndComp
$Comp
L device:R R26
U 1 1 57DF3569
P 12125 3525
F 0 "R26" V 12050 3525 40  0000 C CNN
F 1 "0" V 12132 3526 40  0000 C CNN
F 2 "Resistor_SMD:R_0402_1005Metric" V 12055 3525 30  0001 C CNN
F 3 "http://industrial.panasonic.com/ww/products/resistors/chip-resistors/chip-resistors/thick-film-chip-resistors/ERJ2GE0R00X" H 12125 3525 30  0001 C CNN
F 4 "Panasonic Electronic Components" H 12125 3525 60  0001 C CNN "MFN"
F 5 "ERJ-2GE0R00X" H 12125 3525 60  0001 C CNN "MFP"
F 6 "P0.0JCT-ND" H 12125 3525 60  0001 C CNN "S1PN"
F 7 "Digi-Key" H 12125 3525 60  0001 C CNN "S1PL"
F 8 "ERJ-2GE0R00X" H 12125 3525 60  0001 C CNN "S2PN"
F 9 "Arrow" H 12125 3525 60  0001 C CNN "S2PL"
F 10 "~" H 12125 3525 60  0001 C CNN "Characteristics"
F 11 "RES SMD 0.0OHM JUMPER 1/10W" H 12125 3525 60  0001 C CNN "Description"
F 12 "0402 (1005 Metric) " H 12125 3525 60  0001 C CNN "Package ID"
F 13 "~" H 12125 3525 60  0001 C CNN "Source"
F 14 "N" H 12125 3525 60  0001 C CNN "Critical"
F 15 "~" H 12125 3525 60  0001 C CNN "Notes"
	1    12125 3525
	0    1    1    0   
$EndComp
$Comp
L project:Crystal_SMD X2
U 1 1 57DFA8EF
P 7500 5475
F 0 "X2" V 7500 5625 50  0000 C CNN
F 1 "DNF" V 7500 5325 50  0000 C CNN
F 2 "Oscillators_SMD:osc-3.2x2.5" H 7500 5475 60  0001 C CNN
F 3 "" H 7500 5475 60  0000 C CNN
F 4 "NDK America, Inc." H 7500 5475 60  0001 C CNN "MFN"
F 5 "NX3225SA-26.000000MHZ-G2" H 7500 5475 60  0001 C CNN "MFP"
F 6 "644-1109-1-ND" H 7500 5475 60  0001 C CNN "S1PN"
F 7 "Digi-Key" H 7500 5475 60  0001 C CNN "S1PL"
F 8 "344-NX3225SA26MHZG2" H 7500 5475 60  0001 C CNN "S2PN"
F 9 "Mouser" H 7500 5475 60  0001 C CNN "S2PL"
F 10 "~" H 7500 5475 60  0001 C CNN "Characteristics"
F 11 "26MHz ±10ppm Crystal 10pF 50 Ohms 4-SMD" H 7500 5475 60  0001 C CNN "Description"
F 12 "4-SMD (3.20mm x 2.50mm)" H 7500 5475 60  0001 C CNN "Package ID"
F 13 "~" H 7500 5475 60  0001 C CNN "Source"
F 14 "N" H 7500 5475 60  0001 C CNN "Critical"
F 15 "~" H 7500 5475 60  0001 C CNN "Notes"
F 16 "1" V 7500 5475 50  0001 C CNN "DNP"
	1    7500 5475
	0    -1   -1   0   
$EndComp
$Comp
L device:R R28
U 1 1 57E1A089
P 4575 5400
F 0 "R28" V 4675 5400 40  0000 C CNN
F 1 "0" V 4575 5400 40  0000 C CNN
F 2 "Resistor_SMD:R_0402_1005Metric" V 4505 5400 30  0001 C CNN
F 3 "http://rohmfs.rohm.com/en/products/databook/datasheet/passive/resistor/chip_resistor/mcr_g.pdf" H 4575 5400 30  0001 C CNN
F 4 "Panasonic Electronic Components" H 4575 5400 60  0001 C CNN "MFN"
F 5 "ERJ-2GE0R00X" H 4575 5400 60  0001 C CNN "MFP"
F 6 "P0.0JCT-ND " H 4575 5400 60  0001 C CNN "S1PN"
F 7 "Digi-Key" H 4575 5400 60  0001 C CNN "S1PL"
F 8 "ERJ-2GE0R00X" H 4575 5400 60  0001 C CNN "S2PN"
F 9 "Arrow" H 4575 5400 60  0001 C CNN "S2PL"
F 10 "~" H 4575 5400 60  0001 C CNN "Characteristics"
F 11 "RES SMD 0.0OHM JUMPER 1/10W" H 4575 5400 60  0001 C CNN "Description"
F 12 "0402 (1005 Metric) " H 4575 5400 60  0001 C CNN "Package ID"
F 13 "~" H 4575 5400 60  0001 C CNN "Source"
F 14 "N" H 4575 5400 60  0001 C CNN "Critical"
F 15 "~" H 4575 5400 60  0001 C CNN "Notes"
	1    4575 5400
	0    -1   -1   0   
$EndComp
$Comp
L device:R R12
U 1 1 57E1AAA1
P 4575 7475
F 0 "R12" V 4675 7475 40  0000 C CNN
F 1 "0" V 4575 7475 40  0000 C CNN
F 2 "Resistor_SMD:R_0402_1005Metric" V 4505 7475 30  0001 C CNN
F 3 "http://rohmfs.rohm.com/en/products/databook/datasheet/passive/resistor/chip_resistor/mcr_g.pdf" H 4575 7475 30  0001 C CNN
F 4 "Panasonic Electronic Components" H 4575 7475 60  0001 C CNN "MFN"
F 5 "ERJ-2GE0R00X" H 4575 7475 60  0001 C CNN "MFP"
F 6 "P0.0JCT-ND " H 4575 7475 60  0001 C CNN "S1PN"
F 7 "Digi-Key" H 4575 7475 60  0001 C CNN "S1PL"
F 8 "ERJ-2GE0R00X" H 4575 7475 60  0001 C CNN "S2PN"
F 9 "Arrow" H 4575 7475 60  0001 C CNN "S2PL"
F 10 "~" H 4575 7475 60  0001 C CNN "Characteristics"
F 11 "RES SMD 0.0OHM JUMPER 1/10W" H 4575 7475 60  0001 C CNN "Description"
F 12 "0402 (1005 Metric) " H 4575 7475 60  0001 C CNN "Package ID"
F 13 "~" H 4575 7475 60  0001 C CNN "Source"
F 14 "N" H 4575 7475 60  0001 C CNN "Critical"
F 15 "~" H 4575 7475 60  0001 C CNN "Notes"
	1    4575 7475
	0    -1   -1   0   
$EndComp
$Comp
L device:R R24
U 1 1 57E3405D
P 11150 2000
F 0 "R24" H 11025 1950 40  0000 C CNN
F 1 "DNF" H 11025 2025 40  0000 C CNN
F 2 "Resistor_SMD:R_0402_1005Metric" V 11080 2000 30  0001 C CNN
F 3 "http://industrial.panasonic.com/www-cgi/jvcr13pz.cgi?E+PZ+3+AOA0002+ERJ2RKF1000X+7+WW" H 11150 2000 30  0001 C CNN
F 4 "Panasonic Electronic Components" H 11150 2000 60  0001 C CNN "MFN"
F 5 "ERJ-2RKF1000X " H 11150 2000 60  0001 C CNN "MFP"
F 6 "P100LCT-ND" H 11150 2000 60  0001 C CNN "S1PN"
F 7 "Digi-Key" H 11150 2000 60  0001 C CNN "S1PL"
F 8 "ERJ-2RKF1000X" H 11150 2000 60  0001 C CNN "S2PN"
F 9 "Arrow" H 11150 2000 60  0001 C CNN "S2PL"
F 10 "~" H 11150 2000 60  0001 C CNN "Characteristics"
F 11 "RES SMD 100 OHM 1% 1/10W" H 11150 2000 60  0001 C CNN "Description"
F 12 "0402 (1005 Metric) " H 11150 2000 60  0001 C CNN "Package ID"
F 13 "~" H 11150 2000 60  0001 C CNN "Source"
F 14 "N" H 11150 2000 60  0001 C CNN "Critical"
F 15 "~" H 11150 2000 60  0001 C CNN "Notes"
F 16 "1" H 11150 2000 50  0001 C CNN "DNP"
	1    11150 2000
	-1   0    0    1   
$EndComp
$Comp
L device:R R25
U 1 1 57E34DCB
P 11150 3800
F 0 "R25" H 11025 3750 40  0000 C CNN
F 1 "DNF" H 11025 3825 40  0000 C CNN
F 2 "Resistor_SMD:R_0402_1005Metric" V 11080 3800 30  0001 C CNN
F 3 "http://industrial.panasonic.com/www-cgi/jvcr13pz.cgi?E+PZ+3+AOA0002+ERJ2RKF1000X+7+WW" H 11150 3800 30  0001 C CNN
F 4 "Panasonic Electronic Components" H 11150 3800 60  0001 C CNN "MFN"
F 5 "ERJ-2RKF1000X " H 11150 3800 60  0001 C CNN "MFP"
F 6 "P100LCT-ND" H 11150 3800 60  0001 C CNN "S1PN"
F 7 "Digi-Key" H 11150 3800 60  0001 C CNN "S1PL"
F 8 "ERJ-2RKF1000X" H 11150 3800 60  0001 C CNN "S2PN"
F 9 "Arrow" H 11150 3800 60  0001 C CNN "S2PL"
F 10 "~" H 11150 3800 60  0001 C CNN "Characteristics"
F 11 "RES SMD 100 OHM 1% 1/10W" H 11150 3800 60  0001 C CNN "Description"
F 12 "0402 (1005 Metric) " H 11150 3800 60  0001 C CNN "Package ID"
F 13 "~" H 11150 3800 60  0001 C CNN "Source"
F 14 "N" H 11150 3800 60  0001 C CNN "Critical"
F 15 "~" H 11150 3800 60  0001 C CNN "Notes"
F 16 "1" H 11150 3800 50  0001 C CNN "DNP"
	1    11150 3800
	-1   0    0    1   
$EndComp
$Comp
L device:R R29
U 1 1 57E92023
P 5250 4750
F 0 "R29" H 5125 4700 40  0000 C CNN
F 1 "10K" H 5125 4800 40  0000 C CNN
F 2 "Resistor_SMD:R_0603_1608Metric" V 5180 4750 30  0001 C CNN
F 3 "" H 5250 4750 30  0001 C CNN
F 4 "Yageo" H 5250 4750 60  0001 C CNN "MFN"
F 5 "RC0603FR-0710KL" H 5250 4750 60  0001 C CNN "MFP"
F 6 "603-RC0603FR-0710KL" H 5250 4750 60  0001 C CNN "S1PN"
F 7 "Mouser" H 5250 4750 60  0001 C CNN "S1PL"
F 8 "~" H 5250 4750 60  0001 C CNN "Characteristics"
F 9 "10 kOhms 100mW 0603 1% " H 5250 4750 60  0001 C CNN "Description"
F 10 "0603 (1608 Metric) " H 5250 4750 60  0001 C CNN "Package ID"
F 11 "~" H 5250 4750 60  0001 C CNN "Source"
F 12 "N" H 5250 4750 60  0001 C CNN "Critical"
F 13 "~" H 5250 4750 60  0001 C CNN "Notes"
	1    5250 4750
	-1   0    0    1   
$EndComp
$Comp
L device:C C26
U 1 1 57E92238
P 5600 4750
F 0 "C26" H 5625 4850 40  0000 L CNN
F 1 "0.1u" H 5625 4650 40  0000 L CNN
F 2 "Capacitor_SMD:C_0603_1608Metric" H 5638 4600 30  0001 C CNN
F 3 "" H 5600 4750 60  0000 C CNN
F 4 "Murata Electronics North America" H 5600 4750 60  0001 C CNN "MFN"
F 5 "GRM155R61A104KA01D" H 5600 4750 60  0001 C CNN "MFP"
F 6 "490-1318-1-ND " H 5600 4750 60  0001 C CNN "S1PN"
F 7 "Digi-Key" H 5600 4750 60  0001 C CNN "S1PL"
F 8 "GRM155R71A104KA01D" H 5600 4750 60  0001 C CNN "S2PN"
F 9 "Arrow" H 5600 4750 60  0001 C CNN "S2PL"
F 10 "10V X7R 10%" H 5600 4750 60  0001 C CNN "Characteristics"
F 11 "0.10µF 10V Ceramic Capacitor X5R 0402" H 5600 4750 60  0001 C CNN "Description"
F 12 "0402 (1005 Metric) " H 5600 4750 60  0001 C CNN "Package ID"
F 13 "~" H 5600 4750 60  0001 C CNN "Source"
F 14 "N" H 5600 4750 60  0001 C CNN "Critical"
F 15 "~" H 5600 4750 60  0001 C CNN "Notes"
	1    5600 4750
	1    0    0    -1  
$EndComp
$Comp
L power:GND #PWR044
U 1 1 57E923E0
P 5600 4900
F 0 "#PWR044" H 5600 4900 30  0001 C CNN
F 1 "GND" H 5600 4830 30  0001 C CNN
F 2 "" H 5600 4900 60  0000 C CNN
F 3 "" H 5600 4900 60  0000 C CNN
	1    5600 4900
	1    0    0    -1  
$EndComp
Text Notes 9675 8075 0    60   ~ 0
5V
Text Notes 9675 8175 0    60   ~ 0
Gnd
Text Notes 2625 8300 0    60   ~ 0
Locked
Text Notes 2625 8200 0    60   ~ 0
SDIO
Text Notes 2625 8100 0    60   ~ 0
SCLK
Text Notes 2625 8000 0    60   ~ 0
~CS~
Text Notes 2625 7900 0    60   ~ 0
Reset
$Comp
L device:C_Small C28
U 1 1 57ECA52C
P 7150 5275
F 0 "C28" V 7100 5325 50  0000 L CNN
F 1 "DNF" V 7225 5100 50  0000 L CNN
F 2 "Capacitor_SMD:C_0402_1005Metric" H 7150 5275 60  0001 C CNN
F 3 "" H 7150 5275 60  0000 C CNN
F 4 "Murata" H 7150 5275 50  0001 C CNN "MFN"
F 5 "GCM1555C1H100FA16D" H 7150 5275 50  0001 C CNN "MFP"
F 6 "81-GCM1555C1H100FA6D" H 7150 5275 50  0001 C CNN "S1PN"
F 7 "Mouser" H 7150 5275 50  0001 C CNN "S1PL"
F 8 "490-14348-1-ND" H 7150 5275 50  0001 C CNN "S2PN"
F 9 "Digi-Key" H 7150 5275 50  0001 C CNN "S2PL"
F 10 "10pF ±1% 50V Ceramic Capacitor C0G, NP0" H 7150 5275 50  0001 C CNN "Description"
F 11 "0402 (1005 Metric)" H 7150 5275 50  0001 C CNN "Package ID"
F 12 "1" V 7150 5275 50  0001 C CNN "DNP"
	1    7150 5275
	0    1    1    0   
$EndComp
$Comp
L device:C_Small C29
U 1 1 57ECA62C
P 7150 5675
F 0 "C29" V 7225 5725 50  0000 L CNN
F 1 "DNF" V 7075 5500 50  0000 L CNN
F 2 "Capacitor_SMD:C_0402_1005Metric" H 7150 5675 60  0001 C CNN
F 3 "" H 7150 5675 60  0000 C CNN
F 4 "Murata" H 7150 5275 50  0001 C CNN "MFN"
F 5 "GCM1555C1H100FA16D" H 7150 5275 50  0001 C CNN "MFP"
F 6 "81-GCM1555C1H100FA6D" H 7150 5275 50  0001 C CNN "S1PN"
F 7 "Mouser" H 7150 5275 50  0001 C CNN "S1PL"
F 8 "490-14348-1-ND" H 7150 5275 50  0001 C CNN "S2PN"
F 9 "Digi-Key" H 7150 5275 50  0001 C CNN "S2PL"
F 10 "10pF ±1% 50V Ceramic Capacitor C0G, NP0" H 7150 5275 50  0001 C CNN "Description"
F 11 "0402 (1005 Metric)" H 7150 5275 50  0001 C CNN "Package ID"
F 12 "1" V 7150 5675 50  0001 C CNN "DNP"
	1    7150 5675
	0    1    1    0   
$EndComp
$Comp
L power:GND #PWR047
U 1 1 57ECB470
P 6850 5700
F 0 "#PWR047" H 6850 5700 30  0001 C CNN
F 1 "GND" H 6850 5630 30  0001 C CNN
F 2 "" H 6850 5700 60  0000 C CNN
F 3 "" H 6850 5700 60  0000 C CNN
	1    6850 5700
	1    0    0    -1  
$EndComp
$Comp
L device:C C27
U 1 1 57ECB8B1
P 2750 5625
F 0 "C27" H 2775 5725 40  0000 L CNN
F 1 "0.1u" H 2775 5525 40  0000 L CNN
F 2 "Capacitor_SMD:C_0402_1005Metric" H 2788 5475 30  0001 C CNN
F 3 "" H 2750 5625 60  0000 C CNN
F 4 "Murata Electronics North America" H 2750 5625 60  0001 C CNN "MFN"
F 5 "GRM155R61A104KA01D" H 2750 5625 60  0001 C CNN "MFP"
F 6 "490-1318-1-ND " H 2750 5625 60  0001 C CNN "S1PN"
F 7 "Digi-Key" H 2750 5625 60  0001 C CNN "S1PL"
F 8 "GRM155R71A104KA01D" H 2750 5625 60  0001 C CNN "S2PN"
F 9 "Arrow" H 2750 5625 60  0001 C CNN "S2PL"
F 10 "10V X7R 10%" H 2750 5625 60  0001 C CNN "Characteristics"
F 11 "0.10µF 10V Ceramic Capacitor X5R 0402" H 2750 5625 60  0001 C CNN "Description"
F 12 "0402 (1005 Metric) " H 2750 5625 60  0001 C CNN "Package ID"
F 13 "~" H 2750 5625 60  0001 C CNN "Source"
F 14 "N" H 2750 5625 60  0001 C CNN "Critical"
F 15 "~" H 2750 5625 60  0001 C CNN "Notes"
	1    2750 5625
	1    0    0    -1  
$EndComp
$Comp
L power:GND #PWR048
U 1 1 57ECB9D3
P 2750 5775
F 0 "#PWR048" H 2750 5775 30  0001 C CNN
F 1 "GND" H 2750 5705 30  0001 C CNN
F 2 "" H 2750 5775 60  0000 C CNN
F 3 "" H 2750 5775 60  0000 C CNN
	1    2750 5775
	1    0    0    -1  
$EndComp
NoConn ~ 7425 5375
NoConn ~ 7425 5575
Wire Wire Line
	9050 4150 9950 4150
Wire Wire Line
	9950 4150 9950 4700
Wire Wire Line
	9050 4350 9200 4350
Wire Wire Line
	9450 4350 9450 4850
Wire Wire Line
	8350 5050 8350 5300
Wire Wire Line
	8350 5600 8350 5800
Wire Wire Line
	8350 5800 9200 5800
Wire Wire Line
	9200 5800 9200 4350
Connection ~ 9200 4350
Wire Wire Line
	9050 4250 9700 4250
Wire Wire Line
	9050 3950 10200 3950
Wire Wire Line
	10200 3350 10200 3950
Connection ~ 10200 3950
Wire Wire Line
	9700 3350 9700 4250
Connection ~ 9700 4250
Wire Wire Line
	8050 1450 8050 2950
Wire Wire Line
	7650 1450 7850 1450
Wire Wire Line
	8150 2950 8150 1950
Wire Wire Line
	8250 2950 8250 2050
Wire Wire Line
	7850 1650 7850 1450
Connection ~ 7850 1450
Wire Wire Line
	6850 4350 6425 4350
Wire Wire Line
	6425 4350 6425 4700
Wire Wire Line
	8050 8075 8050 5050
Wire Wire Line
	8150 8175 8150 5050
Wire Wire Line
	8250 6025 8250 5050
Wire Wire Line
	9050 4050 9250 4050
Wire Wire Line
	9050 3650 9175 3650
Wire Wire Line
	9175 3650 9175 3425
Wire Wire Line
	8350 2950 8350 2700
Wire Wire Line
	8750 2950 8750 2700
Wire Wire Line
	2675 5400 2750 5400
Wire Wire Line
	4150 5400 4425 5400
Wire Wire Line
	4150 5600 4225 5600
Wire Wire Line
	4225 5600 4225 5700
Wire Wire Line
	11200 8025 11100 8025
Wire Wire Line
	11500 8025 11600 8025
Wire Wire Line
	11600 8025 11600 8125
Connection ~ 11600 8025
Wire Wire Line
	11100 8475 11100 8425
Wire Wire Line
	11600 8475 11600 8425
Wire Wire Line
	6175 4250 6850 4250
Wire Wire Line
	7650 5275 7650 5050
Wire Wire Line
	7250 5275 7500 5275
Wire Wire Line
	7500 5275 7500 5375
Wire Wire Line
	7750 5675 7750 5050
Wire Wire Line
	7250 5675 7500 5675
Wire Wire Line
	7500 5575 7500 5675
Wire Wire Line
	5250 4450 5600 4450
Wire Wire Line
	5600 4450 5600 4600
Connection ~ 7500 5275
Connection ~ 7500 5675
Wire Wire Line
	7050 5275 6850 5275
Wire Wire Line
	6850 5275 6850 5675
Wire Wire Line
	6850 5675 7050 5675
Connection ~ 6850 5675
Wire Wire Line
	2750 5475 2750 5400
Connection ~ 2750 5400
Text Label 8575 2050 0    60   ~ 0
OUT1-
Text Label 8575 1950 0    60   ~ 0
OUT1+
Text Label 9325 3750 0    60   ~ 0
OUT2+
Text Label 9325 3850 0    60   ~ 0
OUT2-
Wire Wire Line
	9200 4350 9450 4350
Wire Wire Line
	10200 3950 10200 4400
Wire Wire Line
	9700 4250 9700 4550
Wire Wire Line
	7850 1450 8050 1450
Wire Wire Line
	6175 4250 6175 4450
Wire Wire Line
	11100 8025 11100 8125
Wire Wire Line
	5250 4450 5250 4600
Wire Wire Line
	7500 5275 7650 5275
Wire Wire Line
	7500 5675 7750 5675
Wire Wire Line
	6850 5675 6850 5700
Wire Wire Line
	2750 5400 2950 5400
Wire Wire Line
	5250 4150 5250 4450
Wire Wire Line
	5250 4150 6850 4150
Connection ~ 5250 4450
$Comp
L project:LP5907MFX U2
U 1 1 5C46B08A
P 13275 8175
F 0 "U2" H 13275 8612 60  0000 C CNN
F 1 "LP5907MFX" H 13275 8506 60  0000 C CNN
F 2 "Package_TO_SOT_SMD:SOT-23-5" H 13275 8175 60  0001 C CNN
F 3 "" H 13275 8175 60  0000 C CNN
F 4 "Texas Instruments" H 13275 8175 50  0001 C CNN "MFN"
F 5 "LP5907MFX-3.3/NOPB" H 13275 8175 50  0001 C CNN "MFP"
F 6 "595-LP5907MFX-3.3NPB" H 13275 8175 50  0001 C CNN "S1PN"
F 7 "Mouser" H 13275 8175 50  0001 C CNN "S1PL"
F 8 "LP5907MFX-3.3/NOPB" H 13275 8175 50  0001 C CNN "S2PN"
F 9 "Arrow" H 13275 8175 50  0001 C CNN "S2PL"
F 10 "LDO Regulator Pos 3.3V 0.25A 5-Pin SOT-23" H 13275 8175 50  0001 C CNN "Description"
F 11 "SOT-23-5" H 13275 8175 50  0001 C CNN "Package ID"
	1    13275 8175
	1    0    0    -1  
$EndComp
$Comp
L device:C C1
U 1 1 5C47B512
P 13975 8275
F 0 "C1" H 14000 8375 50  0000 L CNN
F 1 "1uF" H 14000 8175 50  0000 L CNN
F 2 "Capacitor_SMD:C_0805_2012Metric" H 14013 8125 30  0001 C CNN
F 3 "https://media.digikey.com/pdf/Data%20Sheets/Murata%20PDFs/GRM%20Series%20Data.pdf" H 13975 8275 60  0001 C CNN
F 4 "Yageo" H 13975 8275 50  0001 C CNN "MFN"
F 5 "CC0805KKX7R8BB105 " H 13975 8275 50  0001 C CNN "MFP"
F 6 "311-1456-1-ND" H 13975 8275 50  0001 C CNN "S1PN"
F 7 "Digi-Key" H 13975 8275 50  0001 C CNN "S1PL"
F 8 "603-CC805KKX7R8BB105" H 13975 8275 50  0001 C CNN "S2PN"
F 9 "Mouser" H 13975 8275 50  0001 C CNN "S2PL"
F 10 "~" H 13975 8275 60  0001 C CNN "Characteristics"
F 11 "Ceramic Capacitors MLCC - SMD/SMT 1.0uF 25V X7R 10% " H 13975 8275 50  0001 C CNN "Description"
F 12 "0805 (2012 metric)" H 13975 8275 50  0001 C CNN "Package ID"
F 13 "~" H 13975 8275 60  0001 C CNN "Source"
F 14 "N" H 13975 8275 60  0001 C CNN "Critical"
	1    13975 8275
	1    0    0    -1  
$EndComp
$Comp
L device:D_Zener_Small_ALT D1
U 1 1 5C47BB30
P 11975 8525
F 0 "D1" V 11929 8593 50  0000 L CNN
F 1 "5.6V" V 12020 8593 50  0000 L CNN
F 2 "Diode_SMD:D_SOD-123" V 11975 8525 50  0001 C CNN
F 3 "~" V 11975 8525 50  0001 C CNN
F 4 "Nexperia" H 11975 8525 50  0001 C CNN "MFN"
F 5 "BZX585-C5V6,135" H 11975 8525 50  0001 C CNN "MFP"
F 6 "771-BZX585-C5V6135" H 11975 8525 50  0001 C CNN "S1PN"
F 7 "Mouser" H 11975 8525 50  0001 C CNN "S1PL"
F 8 "Zener Diode 5.6V 300mW" H 11975 8525 50  0001 C CNN "Description"
F 9 "SOD-523-2" H 11975 8525 50  0001 C CNN "Package ID"
	1    11975 8525
	0    1    1    0   
$EndComp
Wire Wire Line
	12675 8175 12575 8175
Wire Wire Line
	12575 8175 12575 8025
Connection ~ 12575 8025
Wire Wire Line
	12575 8025 12675 8025
Wire Wire Line
	12325 8125 12325 8025
Connection ~ 12325 8025
Wire Wire Line
	12325 8025 12575 8025
Wire Wire Line
	11975 8125 11975 8025
Connection ~ 11975 8025
Wire Wire Line
	11975 8025 12325 8025
Wire Wire Line
	13875 8025 13975 8025
Wire Wire Line
	13975 8125 13975 8025
Connection ~ 13975 8025
Wire Wire Line
	13975 8025 14075 8025
$Comp
L power:GND #PWR023
U 1 1 5C4E089C
P 13275 8625
F 0 "#PWR023" H 13275 8625 30  0001 C CNN
F 1 "GND" H 13275 8555 30  0001 C CNN
F 2 "" H 13275 8625 60  0000 C CNN
F 3 "" H 13275 8625 60  0000 C CNN
	1    13275 8625
	1    0    0    -1  
$EndComp
$Comp
L power:GND #PWR024
U 1 1 5C4E092F
P 13975 8625
F 0 "#PWR024" H 13975 8625 30  0001 C CNN
F 1 "GND" H 13975 8555 30  0001 C CNN
F 2 "" H 13975 8625 60  0000 C CNN
F 3 "" H 13975 8625 60  0000 C CNN
	1    13975 8625
	1    0    0    -1  
$EndComp
$Comp
L power:GND #PWR020
U 1 1 5C4E09C2
P 12325 8625
F 0 "#PWR020" H 12325 8625 30  0001 C CNN
F 1 "GND" H 12325 8555 30  0001 C CNN
F 2 "" H 12325 8625 60  0000 C CNN
F 3 "" H 12325 8625 60  0000 C CNN
	1    12325 8625
	1    0    0    -1  
$EndComp
$Comp
L power:GND #PWR019
U 1 1 5C4E0A55
P 11975 8625
F 0 "#PWR019" H 11975 8625 30  0001 C CNN
F 1 "GND" H 11975 8555 30  0001 C CNN
F 2 "" H 11975 8625 60  0000 C CNN
F 3 "" H 11975 8625 60  0000 C CNN
	1    11975 8625
	1    0    0    -1  
$EndComp
Wire Wire Line
	12325 8425 12325 8625
Wire Wire Line
	13975 8425 13975 8625
$Comp
L device:R R5
U 1 1 5C5417C1
P 11975 8275
F 0 "R5" H 12100 8225 40  0000 C CNN
F 1 "220" H 12100 8300 40  0000 C CNN
F 2 "Resistor_SMD:R_0603_1608Metric" V 11905 8275 30  0001 C CNN
F 3 "http://industrial.panasonic.com/www-cgi/jvcr13pz.cgi?E+PZ+3+AOA0002+ERJ2RKF1000X+7+WW" H 11975 8275 30  0001 C CNN
F 4 "Panasonic Electronic Components" H 11975 8275 60  0001 C CNN "MFN"
F 5 "ERJ-3EKF2200V" H 11975 8275 60  0001 C CNN "MFP"
F 6 "P220HCT-ND" H 11975 8275 60  0001 C CNN "S1PN"
F 7 "Digi-Key" H 11975 8275 60  0001 C CNN "S1PL"
F 8 "C403073" H 11975 8275 60  0001 C CNN "S2PN"
F 9 "LCSC" H 11975 8275 60  0001 C CNN "S2PL"
F 10 "~" H 11975 8275 60  0001 C CNN "Characteristics"
F 11 "220 Ohms ±1% 0.1W, 1/10W" H 11975 8275 60  0001 C CNN "Description"
F 12 "0603 (1608 Metric) " H 11975 8275 60  0001 C CNN "Package ID"
F 13 "~" H 11975 8275 60  0001 C CNN "Source"
F 14 "N" H 11975 8275 60  0001 C CNN "Critical"
F 15 "~" H 11975 8275 60  0001 C CNN "Notes"
	1    11975 8275
	-1   0    0    1   
$EndComp
Wire Wire Line
	11600 8025 11975 8025
Text Notes 10300 3725 0    50   ~ 0
100 ohm\ndiff. match
$Comp
L device:R R3
U 1 1 5CC20C47
P 11800 3675
F 0 "R3" H 11675 3650 40  0000 C CNN
F 1 "DNF" H 11675 3725 40  0000 C CNN
F 2 "Resistor_SMD:R_0402_1005Metric" V 11730 3675 30  0001 C CNN
F 3 "http://industrial.panasonic.com/ww/products/resistors/chip-resistors/chip-resistors/thick-film-chip-resistors/ERJ2GE0R00X" H 11800 3675 30  0001 C CNN
F 4 "Panasonic Electronic Components" H 11800 3675 60  0001 C CNN "MFN"
F 5 "ERJ-2GE0R00X" H 11800 3675 60  0001 C CNN "MFP"
F 6 "P0.0JCT-ND" H 11800 3675 60  0001 C CNN "S1PN"
F 7 "Digi-Key" H 11800 3675 60  0001 C CNN "S1PL"
F 8 "ERJ-2GE0R00X" H 11800 3675 60  0001 C CNN "S2PN"
F 9 "Arrow" H 11800 3675 60  0001 C CNN "S2PL"
F 10 "~" H 11800 3675 60  0001 C CNN "Characteristics"
F 11 "RES SMD 0.0OHM JUMPER 1/10W" H 11800 3675 60  0001 C CNN "Description"
F 12 "0402 (1005 Metric) " H 11800 3675 60  0001 C CNN "Package ID"
F 13 "~" H 11800 3675 60  0001 C CNN "Source"
F 14 "N" H 11800 3675 60  0001 C CNN "Critical"
F 15 "~" H 11800 3675 60  0001 C CNN "Notes"
F 16 "1" H 11800 3675 50  0001 C CNN "DNP"
	1    11800 3675
	-1   0    0    1   
$EndComp
$Comp
L device:R R4
U 1 1 5CC20D54
P 11800 4225
F 0 "R4" H 11675 4200 40  0000 C CNN
F 1 "DNF" H 11675 4275 40  0000 C CNN
F 2 "Resistor_SMD:R_0402_1005Metric" V 11730 4225 30  0001 C CNN
F 3 "http://industrial.panasonic.com/ww/products/resistors/chip-resistors/chip-resistors/thick-film-chip-resistors/ERJ2GE0R00X" H 11800 4225 30  0001 C CNN
F 4 "Panasonic Electronic Components" H 11800 4225 60  0001 C CNN "MFN"
F 5 "ERJ-2GE0R00X" H 11800 4225 60  0001 C CNN "MFP"
F 6 "P0.0JCT-ND" H 11800 4225 60  0001 C CNN "S1PN"
F 7 "Digi-Key" H 11800 4225 60  0001 C CNN "S1PL"
F 8 "ERJ-2GE0R00X" H 11800 4225 60  0001 C CNN "S2PN"
F 9 "Arrow" H 11800 4225 60  0001 C CNN "S2PL"
F 10 "~" H 11800 4225 60  0001 C CNN "Characteristics"
F 11 "RES SMD 0.0OHM JUMPER 1/10W" H 11800 4225 60  0001 C CNN "Description"
F 12 "0402 (1005 Metric) " H 11800 4225 60  0001 C CNN "Package ID"
F 13 "~" H 11800 4225 60  0001 C CNN "Source"
F 14 "N" H 11800 4225 60  0001 C CNN "Critical"
F 15 "~" H 11800 4225 60  0001 C CNN "Notes"
F 16 "1" H 11800 4225 50  0001 C CNN "DNP"
	1    11800 4225
	-1   0    0    1   
$EndComp
$Comp
L power:GND #PWR017
U 1 1 5CCA1372
P 11800 3825
F 0 "#PWR017" H 11800 3825 30  0001 C CNN
F 1 "GND" H 11800 3755 30  0001 C CNN
F 2 "" H 11800 3825 60  0000 C CNN
F 3 "" H 11800 3825 60  0000 C CNN
	1    11800 3825
	1    0    0    -1  
$EndComp
$Comp
L power:GND #PWR018
U 1 1 5CCA180F
P 11800 4375
F 0 "#PWR018" H 11800 4375 30  0001 C CNN
F 1 "GND" H 11800 4305 30  0001 C CNN
F 2 "" H 11800 4375 60  0000 C CNN
F 3 "" H 11800 4375 60  0000 C CNN
	1    11800 4375
	1    0    0    -1  
$EndComp
Wire Wire Line
	9050 3850 10950 3850
Text Notes 9625 1900 0    50   ~ 0
100 ohm\ndiff. match
Wire Wire Line
	9050 3750 10950 3750
Wire Wire Line
	8150 1950 10950 1950
Wire Wire Line
	8250 2050 10950 2050
$Comp
L device:R R2
U 1 1 5CF25338
P 11800 2425
F 0 "R2" H 11675 2400 40  0000 C CNN
F 1 "DNF" H 11675 2475 40  0000 C CNN
F 2 "Resistor_SMD:R_0402_1005Metric" V 11730 2425 30  0001 C CNN
F 3 "http://industrial.panasonic.com/ww/products/resistors/chip-resistors/chip-resistors/thick-film-chip-resistors/ERJ2GE0R00X" H 11800 2425 30  0001 C CNN
F 4 "Panasonic Electronic Components" H 11800 2425 60  0001 C CNN "MFN"
F 5 "ERJ-2GE0R00X" H 11800 2425 60  0001 C CNN "MFP"
F 6 "P0.0JCT-ND" H 11800 2425 60  0001 C CNN "S1PN"
F 7 "Digi-Key" H 11800 2425 60  0001 C CNN "S1PL"
F 8 "ERJ-2GE0R00X" H 11800 2425 60  0001 C CNN "S2PN"
F 9 "Arrow" H 11800 2425 60  0001 C CNN "S2PL"
F 10 "~" H 11800 2425 60  0001 C CNN "Characteristics"
F 11 "RES SMD 0.0OHM JUMPER 1/10W" H 11800 2425 60  0001 C CNN "Description"
F 12 "0402 (1005 Metric) " H 11800 2425 60  0001 C CNN "Package ID"
F 13 "~" H 11800 2425 60  0001 C CNN "Source"
F 14 "N" H 11800 2425 60  0001 C CNN "Critical"
F 15 "~" H 11800 2425 60  0001 C CNN "Notes"
F 16 "1" H 11800 2425 50  0001 C CNN "DNP"
	1    11800 2425
	-1   0    0    1   
$EndComp
$Comp
L power:GND #PWR012
U 1 1 5CF2533E
P 11800 2575
F 0 "#PWR012" H 11800 2575 30  0001 C CNN
F 1 "GND" H 11800 2505 30  0001 C CNN
F 2 "" H 11800 2575 60  0000 C CNN
F 3 "" H 11800 2575 60  0000 C CNN
	1    11800 2575
	1    0    0    -1  
$EndComp
$Comp
L device:R R1
U 1 1 5CF3460D
P 11800 1875
F 0 "R1" H 11675 1850 40  0000 C CNN
F 1 "DNF" H 11675 1925 40  0000 C CNN
F 2 "Resistor_SMD:R_0402_1005Metric" V 11730 1875 30  0001 C CNN
F 3 "http://industrial.panasonic.com/ww/products/resistors/chip-resistors/chip-resistors/thick-film-chip-resistors/ERJ2GE0R00X" H 11800 1875 30  0001 C CNN
F 4 "Panasonic Electronic Components" H 11800 1875 60  0001 C CNN "MFN"
F 5 "ERJ-2GE0R00X" H 11800 1875 60  0001 C CNN "MFP"
F 6 "P0.0JCT-ND" H 11800 1875 60  0001 C CNN "S1PN"
F 7 "Digi-Key" H 11800 1875 60  0001 C CNN "S1PL"
F 8 "ERJ-2GE0R00X" H 11800 1875 60  0001 C CNN "S2PN"
F 9 "Arrow" H 11800 1875 60  0001 C CNN "S2PL"
F 10 "~" H 11800 1875 60  0001 C CNN "Characteristics"
F 11 "RES SMD 0.0OHM JUMPER 1/10W" H 11800 1875 60  0001 C CNN "Description"
F 12 "0402 (1005 Metric) " H 11800 1875 60  0001 C CNN "Package ID"
F 13 "~" H 11800 1875 60  0001 C CNN "Source"
F 14 "N" H 11800 1875 60  0001 C CNN "Critical"
F 15 "~" H 11800 1875 60  0001 C CNN "Notes"
F 16 "1" H 11800 1875 50  0001 C CNN "DNP"
	1    11800 1875
	-1   0    0    1   
$EndComp
$Comp
L power:GND #PWR011
U 1 1 5CF34613
P 11800 2025
F 0 "#PWR011" H 11800 2025 30  0001 C CNN
F 1 "GND" H 11800 1955 30  0001 C CNN
F 2 "" H 11800 2025 60  0000 C CNN
F 3 "" H 11800 2025 60  0000 C CNN
	1    11800 2025
	1    0    0    -1  
$EndComp
$Comp
L power:GND #PWR028
U 1 1 5CFAF6BB
P 4175 7650
F 0 "#PWR028" H 4175 7650 30  0001 C CNN
F 1 "GND" H 4175 7580 30  0001 C CNN
F 2 "" H 4175 7650 60  0000 C CNN
F 3 "" H 4175 7650 60  0000 C CNN
	1    4175 7650
	-1   0    0    -1  
$EndComp
$Comp
L project:SMA_2 J2
U 1 1 5CFAFFA1
P 12800 1725
F 0 "J2" H 12902 1715 50  0000 L CNN
F 1 "Out1" H 12902 1624 50  0000 L CNN
F 2 "MMCX_Connectors:mmcx_th" H 12975 1625 50  0001 C CNN
F 3 "" H 12800 1725 60  0000 C CNN
F 4 "Amphenol" H 12800 1725 50  0001 C CNN "MFN"
F 5 "262104" H 12800 1725 50  0001 C CNN "MFP"
F 6 "M01-SJPT4-11BS00" H 12800 1725 50  0001 C CNN "S1PN"
F 7 "Superbat" H 12800 1725 50  0001 C CNN "S1PL"
F 8 "262104" H 12800 1725 50  0001 C CNN "S2PN"
F 9 "Arrow" H 12800 1725 50  0001 C CNN "S2PL"
F 10 "MMCX Connector Jack, Female Socket 50Ohm Through Hole Solder" H 12800 1725 50  0001 C CNN "Description"
	1    12800 1725
	1    0    0    -1  
$EndComp
$Comp
L power:GND #PWR06
U 1 1 5CFCC149
P 12800 1900
F 0 "#PWR06" H 12800 1900 30  0001 C CNN
F 1 "GND" H 12800 1830 30  0001 C CNN
F 2 "" H 12800 1900 60  0000 C CNN
F 3 "" H 12800 1900 60  0000 C CNN
	1    12800 1900
	1    0    0    -1  
$EndComp
$Comp
L power:GND #PWR025
U 1 1 5D011A1C
P 12800 2450
F 0 "#PWR025" H 12800 2450 30  0001 C CNN
F 1 "GND" H 12800 2380 30  0001 C CNN
F 2 "" H 12800 2450 60  0000 C CNN
F 3 "" H 12800 2450 60  0000 C CNN
	1    12800 2450
	1    0    0    -1  
$EndComp
$Comp
L power:GND #PWR027
U 1 1 5D07C7A5
P 12800 4250
F 0 "#PWR027" H 12800 4250 30  0001 C CNN
F 1 "GND" H 12800 4180 30  0001 C CNN
F 2 "" H 12800 4250 60  0000 C CNN
F 3 "" H 12800 4250 60  0000 C CNN
	1    12800 4250
	1    0    0    -1  
$EndComp
$Comp
L power:GND #PWR0101
U 1 1 5D12FCD0
P 12800 3700
F 0 "#PWR0101" H 12800 3700 30  0001 C CNN
F 1 "GND" H 12800 3630 30  0001 C CNN
F 2 "" H 12800 3700 60  0000 C CNN
F 3 "" H 12800 3700 60  0000 C CNN
	1    12800 3700
	1    0    0    -1  
$EndComp
Wire Wire Line
	11800 1725 11975 1725
Wire Wire Line
	11975 3525 11800 3525
Wire Wire Line
	11800 2275 11975 2275
Wire Wire Line
	11800 4075 11975 4075
Wire Wire Line
	7950 7975 7950 5050
$Comp
L switches:SW_DIP_x08 SW1
U 1 1 5D3AC5AF
P 5525 2625
F 0 "SW1" H 5525 2150 50  0000 C CNN
F 1 "~" H 5550 3200 50  0000 C CNN
F 2 "Switches:CVS-08B" H 5525 2625 50  0001 C CNN
F 3 "" H 5525 2625 50  0001 C CNN
F 4 "NIDEC Copal Electronics" H 5525 2625 50  0001 C CNN "MFN"
F 5 "CVS-08TB" H 5525 2625 50  0001 C CNN "MFP"
F 6 "CVS-08TB" H 5525 2625 50  0001 C CNN "S1PN"
F 7 "Arrow" H 5525 2625 50  0001 C CNN "S1PL"
F 8 "563-1042-1-ND" H 5525 2625 50  0001 C CNN "S2PN"
F 9 "Digi-Key" H 5525 2625 50  0001 C CNN "S2PL"
F 10 "Dip Switch SPST 8 Position Surface Mount Slide (Standard) Actuator 100mA 6VDC" H 5525 2625 50  0001 C CNN "Description"
	1    5525 2625
	1    0    0    -1  
$EndComp
Wire Wire Line
	6025 4250 6175 4250
Connection ~ 6175 4250
Wire Wire Line
	7650 2950 7650 2525
Wire Wire Line
	7650 2525 5825 2525
Wire Wire Line
	7750 2950 7750 2425
Wire Wire Line
	7750 2425 5825 2425
Wire Wire Line
	5825 2325 7850 2325
Wire Wire Line
	7850 2325 7850 2950
Wire Wire Line
	7950 2950 7950 2225
Wire Wire Line
	7950 2225 5825 2225
Wire Wire Line
	6850 4050 5800 4050
Wire Wire Line
	6850 3950 5800 3950
Wire Wire Line
	6850 3850 5800 3850
Wire Wire Line
	6850 3750 6275 3750
Wire Wire Line
	6275 3750 6275 2725
Wire Wire Line
	6275 2725 5825 2725
Wire Wire Line
	6850 3650 6375 3650
Wire Wire Line
	6375 3650 6375 2625
Wire Wire Line
	6375 2625 5825 2625
Wire Wire Line
	5225 2225 5075 2225
Wire Wire Line
	5075 2225 5075 2325
$Comp
L power:GND #PWR0102
U 1 1 5D461A02
P 5075 3125
F 0 "#PWR0102" H 5075 2875 50  0001 C CNN
F 1 "GND" H 5075 2975 50  0000 C CNN
F 2 "" H 5075 3125 60  0000 C CNN
F 3 "" H 5075 3125 60  0000 C CNN
	1    5075 3125
	1    0    0    -1  
$EndComp
Wire Wire Line
	5225 2325 5075 2325
Connection ~ 5075 2325
Wire Wire Line
	5075 2325 5075 2425
Wire Wire Line
	5225 2425 5075 2425
Connection ~ 5075 2425
Wire Wire Line
	5075 2425 5075 2525
Wire Wire Line
	5225 2525 5075 2525
Connection ~ 5075 2525
Wire Wire Line
	5075 2525 5075 2625
Wire Wire Line
	5225 2625 5075 2625
Connection ~ 5075 2625
Wire Wire Line
	5075 2625 5075 2725
Wire Wire Line
	5225 2725 5075 2725
Connection ~ 5075 2725
Wire Wire Line
	5075 2725 5075 2825
Wire Wire Line
	5225 2825 5075 2825
Connection ~ 5075 2825
Wire Wire Line
	5075 2825 5075 2925
Wire Wire Line
	5225 2925 5075 2925
Connection ~ 5075 2925
$Comp
L connector:Conn_01x02_Male P1
U 1 1 5D4CFB78
P 9900 8025
F 0 "P1" H 10006 8203 50  0000 C CNN
F 1 "Pwr" H 10000 8125 50  0000 C CNN
F 2 "Connector_PinHeader_2.54mm:PinHeader_1x02_P2.54mm_Vertical" H 9900 8025 50  0001 C CNN
F 3 "~" H 9900 8025 50  0001 C CNN
F 4 "Samtec" H 9900 8025 50  0001 C CNN "MFN"
F 5 "HTSW-102-07-G-S" H 9900 8025 50  0001 C CNN "MFP"
F 6 "200-HTSW10207GS" H 9900 8025 50  0001 C CNN "S1PN"
F 7 "Mouser" H 9900 8025 50  0001 C CNN "S1PL"
F 8 "Pin Header Male Pin 0.100\\\"(2.54mm) 2 pin" H 9900 8025 50  0001 C CNN "Description"
F 9 "Through Hole,P=2.54mm" H 9900 8025 50  0001 C CNN "Package ID"
	1    9900 8025
	1    0    0    -1  
$EndComp
$Comp
L connector:Conn_01x02_Male P2
U 1 1 5D4CFC4A
P 9900 8575
F 0 "P2" H 10006 8753 50  0000 C CNN
F 1 "DNF" H 10006 8662 50  0000 C CNN
F 2 "Connectors:SMD_pin_array_1x2" H 9900 8575 50  0001 C CNN
F 3 "~" H 9900 8575 50  0001 C CNN
F 4 "1" H 9900 8575 50  0001 C CNN "DNP"
	1    9900 8575
	1    0    0    -1  
$EndComp
Wire Wire Line
	10100 8025 10200 8025
Connection ~ 11100 8025
Wire Wire Line
	10100 8125 10300 8125
Wire Wire Line
	10300 8125 10300 8675
Wire Wire Line
	10100 8675 10300 8675
Connection ~ 10300 8675
Wire Wire Line
	10300 8675 10300 8925
Wire Wire Line
	10100 8575 10200 8575
Wire Wire Line
	10200 8575 10200 8025
Connection ~ 10200 8025
Wire Wire Line
	10200 8025 11100 8025
$Comp
L project:rfi_shield_clip P5
U 1 1 5C3F1A2F
P 12900 5750
F 0 "P5" H 13028 5769 60  0000 L CNN
F 1 "~" H 13028 5716 60  0000 L CNN
F 2 "RF_Shielding:S1721-46R" H 12900 5750 60  0001 C CNN
F 3 "" H 12900 5750 60  0000 C CNN
F 4 "Harwin Inc." H 8175 1925 50  0001 C CNN "MFN"
F 5 "S1721-46R" H 8175 1925 50  0001 C CNN "MFP"
F 6 "952-1476-1-ND" H 8175 1925 50  0001 C CNN "S1PN"
F 7 "Digi-Key" H 8175 1925 50  0001 C CNN "S1PL"
F 8 "855-S1721-46R" H 8175 1925 50  0001 C CNN "S2PN"
F 9 "Mouser" H 8175 1925 50  0001 C CNN "S2PL"
F 10 "RFI SHIELD CLIP MINI TIN SMD" H 8175 1925 50  0001 C CNN "Description"
	1    12900 5750
	1    0    0    -1  
$EndComp
$Comp
L project:rfi_shield_clip P9
U 1 1 5C3F1CC1
P 12900 6250
F 0 "P9" H 13028 6269 60  0000 L CNN
F 1 "~" H 13028 6216 60  0000 L CNN
F 2 "RF_Shielding:S1721-46R" H 12900 6250 60  0001 C CNN
F 3 "" H 12900 6250 60  0000 C CNN
F 4 "Harwin Inc." H 8175 1450 50  0001 C CNN "MFN"
F 5 "S1721-46R" H 8175 1450 50  0001 C CNN "MFP"
F 6 "952-1476-1-ND" H 8175 1450 50  0001 C CNN "S1PN"
F 7 "Digi-Key" H 8175 1450 50  0001 C CNN "S1PL"
F 8 "855-S1721-46R" H 8175 1450 50  0001 C CNN "S2PN"
F 9 "Mouser" H 8175 1450 50  0001 C CNN "S2PL"
F 10 "RFI SHIELD CLIP MINI TIN SMD" H 8175 1450 50  0001 C CNN "Description"
	1    12900 6250
	1    0    0    -1  
$EndComp
$Comp
L project:rfi_shield_clip P8
U 1 1 5C3F20E1
P 13875 5750
F 0 "P8" H 14003 5769 60  0000 L CNN
F 1 "~" H 14003 5716 60  0000 L CNN
F 2 "RF_Shielding:S1721-46R" H 13875 5750 60  0001 C CNN
F 3 "" H 13875 5750 60  0000 C CNN
F 4 "Harwin Inc." H 8175 1450 50  0001 C CNN "MFN"
F 5 "S1721-46R" H 8175 1450 50  0001 C CNN "MFP"
F 6 "952-1476-1-ND" H 8175 1450 50  0001 C CNN "S1PN"
F 7 "Digi-Key" H 8175 1450 50  0001 C CNN "S1PL"
F 8 "855-S1721-46R" H 8175 1450 50  0001 C CNN "S2PN"
F 9 "Mouser" H 8175 1450 50  0001 C CNN "S2PL"
F 10 "RFI SHIELD CLIP MINI TIN SMD" H 8175 1450 50  0001 C CNN "Description"
	1    13875 5750
	1    0    0    -1  
$EndComp
$Comp
L project:rfi_shield_clip P12
U 1 1 5C3F221F
P 13875 6250
F 0 "P12" H 14003 6269 60  0000 L CNN
F 1 "~" H 14003 6216 60  0000 L CNN
F 2 "RF_Shielding:S1721-46R" H 13875 6250 60  0001 C CNN
F 3 "" H 13875 6250 60  0000 C CNN
F 4 "Harwin Inc." H 8175 950 50  0001 C CNN "MFN"
F 5 "S1721-46R" H 8175 950 50  0001 C CNN "MFP"
F 6 "952-1476-1-ND" H 8175 950 50  0001 C CNN "S1PN"
F 7 "Digi-Key" H 8175 950 50  0001 C CNN "S1PL"
F 8 "855-S1721-46R" H 8175 950 50  0001 C CNN "S2PN"
F 9 "Mouser" H 8175 950 50  0001 C CNN "S2PL"
F 10 "RFI SHIELD CLIP MINI TIN SMD" H 8175 950 50  0001 C CNN "Description"
	1    13875 6250
	1    0    0    -1  
$EndComp
$Comp
L power:GND #PWR021
U 1 1 5C3F2B57
P 12900 5850
F 0 "#PWR021" H 12900 5600 50  0001 C CNN
F 1 "GND" H 12900 5700 50  0000 C CNN
F 2 "" H 12900 5850 60  0000 C CNN
F 3 "" H 12900 5850 60  0000 C CNN
	1    12900 5850
	1    0    0    -1  
$EndComp
$Comp
L power:GND #PWR031
U 1 1 5C3F30C1
P 12900 6350
F 0 "#PWR031" H 12900 6100 50  0001 C CNN
F 1 "GND" H 12900 6200 50  0000 C CNN
F 2 "" H 12900 6350 60  0000 C CNN
F 3 "" H 12900 6350 60  0000 C CNN
	1    12900 6350
	1    0    0    -1  
$EndComp
$Comp
L power:GND #PWR034
U 1 1 5C3F41B2
P 13875 6350
F 0 "#PWR034" H 13875 6100 50  0001 C CNN
F 1 "GND" H 13875 6200 50  0000 C CNN
F 2 "" H 13875 6350 60  0000 C CNN
F 3 "" H 13875 6350 60  0000 C CNN
	1    13875 6350
	1    0    0    -1  
$EndComp
$Comp
L power:GND #PWR026
U 1 1 5C3F42C0
P 13875 5850
F 0 "#PWR026" H 13875 5600 50  0001 C CNN
F 1 "GND" H 13875 5700 50  0000 C CNN
F 2 "" H 13875 5850 60  0000 C CNN
F 3 "" H 13875 5850 60  0000 C CNN
	1    13875 5850
	1    0    0    -1  
$EndComp
Wire Wire Line
	4300 7475 4425 7475
$Comp
L graphics:Logo_Open_Hardware_Small #LOGO1
U 1 1 5C71D098
P 1775 1325
F 0 "#LOGO1" H 1775 1600 50  0001 C CNN
F 1 "Open Source Hardware" H 1775 1619 50  0000 C CNN
F 2 "" H 1775 1325 50  0001 C CNN
F 3 "~" H 1775 1325 50  0001 C CNN
	1    1775 1325
	1    0    0    -1  
$EndComp
Wire Wire Line
	10950 3525 11150 3525
Wire Wire Line
	10950 3525 10950 3750
Wire Wire Line
	10950 4075 11150 4075
Wire Wire Line
	10950 3850 10950 4075
Wire Wire Line
	11650 3525 11800 3525
Wire Wire Line
	11650 4075 11800 4075
Wire Wire Line
	10950 1725 11150 1725
Wire Wire Line
	10950 1725 10950 1950
Wire Wire Line
	10950 2275 11150 2275
Wire Wire Line
	10950 2050 10950 2275
Wire Wire Line
	11650 1725 11800 1725
Wire Wire Line
	11650 2275 11800 2275
Wire Wire Line
	11150 1850 11150 1725
Connection ~ 11150 1725
Wire Wire Line
	11150 1725 11350 1725
Wire Wire Line
	11150 2150 11150 2275
Connection ~ 11150 2275
Wire Wire Line
	11150 2275 11350 2275
Wire Wire Line
	11150 3650 11150 3525
Connection ~ 11150 3525
Wire Wire Line
	11150 3525 11350 3525
Wire Wire Line
	11150 3950 11150 4075
Connection ~ 11150 4075
Wire Wire Line
	11150 4075 11350 4075
Wire Wire Line
	5075 2925 5075 3125
Text GLabel 8450 6025 2    50   Input ~ 0
OUTSEL
Wire Wire Line
	8250 6025 8450 6025
Text GLabel 5825 2925 2    50   Input ~ 0
OUTSEL
NoConn ~ 5825 2825
$Comp
L power:GND #PWR038
U 1 1 5D9C3EE1
P 4975 4225
F 0 "#PWR038" H 4975 3975 50  0001 C CNN
F 1 "GND" H 4975 4075 50  0000 C CNN
F 2 "" H 4975 4225 60  0000 C CNN
F 3 "" H 4975 4225 60  0000 C CNN
	1    4975 4225
	1    0    0    -1  
$EndComp
$Comp
L device:R R14
U 1 1 5D9D7C8B
P 5650 3850
F 0 "R14" V 5600 4025 40  0000 C CNN
F 1 "0" V 5657 3851 40  0000 C CNN
F 2 "Resistor_SMD:R_0402_1005Metric" V 5580 3850 30  0001 C CNN
F 3 "http://industrial.panasonic.com/ww/products/resistors/chip-resistors/chip-resistors/thick-film-chip-resistors/ERJ2GE0R00X" H 5650 3850 30  0001 C CNN
F 4 "Panasonic Electronic Components" H 5650 3850 60  0001 C CNN "MFN"
F 5 "ERJ-2GE0R00X" H 5650 3850 60  0001 C CNN "MFP"
F 6 "P0.0JCT-ND" H 5650 3850 60  0001 C CNN "S1PN"
F 7 "Digi-Key" H 5650 3850 60  0001 C CNN "S1PL"
F 8 "ERJ-2GE0R00X" H 5650 3850 60  0001 C CNN "S2PN"
F 9 "Arrow" H 5650 3850 60  0001 C CNN "S2PL"
F 10 "~" H 5650 3850 60  0001 C CNN "Characteristics"
F 11 "RES SMD 0.0OHM JUMPER 1/10W" H 5650 3850 60  0001 C CNN "Description"
F 12 "0402 (1005 Metric) " H 5650 3850 60  0001 C CNN "Package ID"
F 13 "~" H 5650 3850 60  0001 C CNN "Source"
F 14 "N" H 5650 3850 60  0001 C CNN "Critical"
F 15 "~" H 5650 3850 60  0001 C CNN "Notes"
	1    5650 3850
	0    1    1    0   
$EndComp
$Comp
L device:R R15
U 1 1 5D9D7E37
P 5650 3950
F 0 "R15" V 5600 4125 40  0000 C CNN
F 1 "DNF" V 5657 3951 40  0000 C CNN
F 2 "Resistor_SMD:R_0402_1005Metric" V 5580 3950 30  0001 C CNN
F 3 "http://industrial.panasonic.com/ww/products/resistors/chip-resistors/chip-resistors/thick-film-chip-resistors/ERJ2GE0R00X" H 5650 3950 30  0001 C CNN
F 4 "Panasonic Electronic Components" H 5650 3950 60  0001 C CNN "MFN"
F 5 "ERJ-2GE0R00X" H 5650 3950 60  0001 C CNN "MFP"
F 6 "P0.0JCT-ND" H 5650 3950 60  0001 C CNN "S1PN"
F 7 "Digi-Key" H 5650 3950 60  0001 C CNN "S1PL"
F 8 "ERJ-2GE0R00X" H 5650 3950 60  0001 C CNN "S2PN"
F 9 "Arrow" H 5650 3950 60  0001 C CNN "S2PL"
F 10 "~" H 5650 3950 60  0001 C CNN "Characteristics"
F 11 "RES SMD 0.0OHM JUMPER 1/10W" H 5650 3950 60  0001 C CNN "Description"
F 12 "0402 (1005 Metric) " H 5650 3950 60  0001 C CNN "Package ID"
F 13 "~" H 5650 3950 60  0001 C CNN "Source"
F 14 "N" H 5650 3950 60  0001 C CNN "Critical"
F 15 "~" H 5650 3950 60  0001 C CNN "Notes"
	1    5650 3950
	0    1    1    0   
$EndComp
$Comp
L device:R R16
U 1 1 5D9D7EE1
P 5650 4050
F 0 "R16" V 5600 4225 40  0000 C CNN
F 1 "DNF" V 5657 4051 40  0000 C CNN
F 2 "Resistor_SMD:R_0402_1005Metric" V 5580 4050 30  0001 C CNN
F 3 "http://industrial.panasonic.com/ww/products/resistors/chip-resistors/chip-resistors/thick-film-chip-resistors/ERJ2GE0R00X" H 5650 4050 30  0001 C CNN
F 4 "Panasonic Electronic Components" H 5650 4050 60  0001 C CNN "MFN"
F 5 "ERJ-2GE0R00X" H 5650 4050 60  0001 C CNN "MFP"
F 6 "P0.0JCT-ND" H 5650 4050 60  0001 C CNN "S1PN"
F 7 "Digi-Key" H 5650 4050 60  0001 C CNN "S1PL"
F 8 "ERJ-2GE0R00X" H 5650 4050 60  0001 C CNN "S2PN"
F 9 "Arrow" H 5650 4050 60  0001 C CNN "S2PL"
F 10 "~" H 5650 4050 60  0001 C CNN "Characteristics"
F 11 "RES SMD 0.0OHM JUMPER 1/10W" H 5650 4050 60  0001 C CNN "Description"
F 12 "0402 (1005 Metric) " H 5650 4050 60  0001 C CNN "Package ID"
F 13 "~" H 5650 4050 60  0001 C CNN "Source"
F 14 "N" H 5650 4050 60  0001 C CNN "Critical"
F 15 "~" H 5650 4050 60  0001 C CNN "Notes"
	1    5650 4050
	0    1    1    0   
$EndComp
Wire Wire Line
	5500 3850 5375 3850
Wire Wire Line
	4975 3850 4975 4225
Wire Wire Line
	5375 3850 5375 3950
Wire Wire Line
	5375 4050 5500 4050
Connection ~ 5375 3850
Wire Wire Line
	5375 3850 4975 3850
Wire Wire Line
	5500 3950 5375 3950
Connection ~ 5375 3950
Wire Wire Line
	5375 3950 5375 4050
$Comp
L device:R R9
U 1 1 5DA1CF69
P 11150 1475
F 0 "R9" H 11025 1450 40  0000 C CNN
F 1 "DNF" H 11025 1525 40  0000 C CNN
F 2 "Resistor_SMD:R_0402_1005Metric" V 11080 1475 30  0001 C CNN
F 3 "http://industrial.panasonic.com/ww/products/resistors/chip-resistors/chip-resistors/thick-film-chip-resistors/ERJ2GE0R00X" H 11150 1475 30  0001 C CNN
F 4 "Panasonic Electronic Components" H 11150 1475 60  0001 C CNN "MFN"
F 5 "ERJ-2GE0R00X" H 11150 1475 60  0001 C CNN "MFP"
F 6 "P0.0JCT-ND" H 11150 1475 60  0001 C CNN "S1PN"
F 7 "Digi-Key" H 11150 1475 60  0001 C CNN "S1PL"
F 8 "ERJ-2GE0R00X" H 11150 1475 60  0001 C CNN "S2PN"
F 9 "Arrow" H 11150 1475 60  0001 C CNN "S2PL"
F 10 "~" H 11150 1475 60  0001 C CNN "Characteristics"
F 11 "RES SMD 0.0OHM JUMPER 1/10W" H 11150 1475 60  0001 C CNN "Description"
F 12 "0402 (1005 Metric) " H 11150 1475 60  0001 C CNN "Package ID"
F 13 "~" H 11150 1475 60  0001 C CNN "Source"
F 14 "N" H 11150 1475 60  0001 C CNN "Critical"
F 15 "~" H 11150 1475 60  0001 C CNN "Notes"
F 16 "1" H 11150 1475 50  0001 C CNN "DNP"
	1    11150 1475
	-1   0    0    1   
$EndComp
$Comp
L device:R R10
U 1 1 5DA1D042
P 11150 2525
F 0 "R10" H 11025 2500 40  0000 C CNN
F 1 "DNF" H 11025 2575 40  0000 C CNN
F 2 "Resistor_SMD:R_0402_1005Metric" V 11080 2525 30  0001 C CNN
F 3 "http://industrial.panasonic.com/ww/products/resistors/chip-resistors/chip-resistors/thick-film-chip-resistors/ERJ2GE0R00X" H 11150 2525 30  0001 C CNN
F 4 "Panasonic Electronic Components" H 11150 2525 60  0001 C CNN "MFN"
F 5 "ERJ-2GE0R00X" H 11150 2525 60  0001 C CNN "MFP"
F 6 "P0.0JCT-ND" H 11150 2525 60  0001 C CNN "S1PN"
F 7 "Digi-Key" H 11150 2525 60  0001 C CNN "S1PL"
F 8 "ERJ-2GE0R00X" H 11150 2525 60  0001 C CNN "S2PN"
F 9 "Arrow" H 11150 2525 60  0001 C CNN "S2PL"
F 10 "~" H 11150 2525 60  0001 C CNN "Characteristics"
F 11 "RES SMD 0.0OHM JUMPER 1/10W" H 11150 2525 60  0001 C CNN "Description"
F 12 "0402 (1005 Metric) " H 11150 2525 60  0001 C CNN "Package ID"
F 13 "~" H 11150 2525 60  0001 C CNN "Source"
F 14 "N" H 11150 2525 60  0001 C CNN "Critical"
F 15 "~" H 11150 2525 60  0001 C CNN "Notes"
F 16 "1" H 11150 2525 50  0001 C CNN "DNP"
	1    11150 2525
	-1   0    0    1   
$EndComp
$Comp
L device:R R13
U 1 1 5DA1D3E2
P 11150 3275
F 0 "R13" H 11025 3250 40  0000 C CNN
F 1 "DNF" H 11025 3325 40  0000 C CNN
F 2 "Resistor_SMD:R_0402_1005Metric" V 11080 3275 30  0001 C CNN
F 3 "http://industrial.panasonic.com/ww/products/resistors/chip-resistors/chip-resistors/thick-film-chip-resistors/ERJ2GE0R00X" H 11150 3275 30  0001 C CNN
F 4 "Panasonic Electronic Components" H 11150 3275 60  0001 C CNN "MFN"
F 5 "ERJ-2GE0R00X" H 11150 3275 60  0001 C CNN "MFP"
F 6 "P0.0JCT-ND" H 11150 3275 60  0001 C CNN "S1PN"
F 7 "Digi-Key" H 11150 3275 60  0001 C CNN "S1PL"
F 8 "ERJ-2GE0R00X" H 11150 3275 60  0001 C CNN "S2PN"
F 9 "Arrow" H 11150 3275 60  0001 C CNN "S2PL"
F 10 "~" H 11150 3275 60  0001 C CNN "Characteristics"
F 11 "RES SMD 0.0OHM JUMPER 1/10W" H 11150 3275 60  0001 C CNN "Description"
F 12 "0402 (1005 Metric) " H 11150 3275 60  0001 C CNN "Package ID"
F 13 "~" H 11150 3275 60  0001 C CNN "Source"
F 14 "N" H 11150 3275 60  0001 C CNN "Critical"
F 15 "~" H 11150 3275 60  0001 C CNN "Notes"
F 16 "1" H 11150 3275 50  0001 C CNN "DNP"
	1    11150 3275
	-1   0    0    1   
$EndComp
$Comp
L device:R R17
U 1 1 5DA1D672
P 11150 4350
F 0 "R17" H 11025 4325 40  0000 C CNN
F 1 "DNF" H 11025 4400 40  0000 C CNN
F 2 "Resistor_SMD:R_0402_1005Metric" V 11080 4350 30  0001 C CNN
F 3 "http://industrial.panasonic.com/ww/products/resistors/chip-resistors/chip-resistors/thick-film-chip-resistors/ERJ2GE0R00X" H 11150 4350 30  0001 C CNN
F 4 "Panasonic Electronic Components" H 11150 4350 60  0001 C CNN "MFN"
F 5 "ERJ-2GE0R00X" H 11150 4350 60  0001 C CNN "MFP"
F 6 "P0.0JCT-ND" H 11150 4350 60  0001 C CNN "S1PN"
F 7 "Digi-Key" H 11150 4350 60  0001 C CNN "S1PL"
F 8 "ERJ-2GE0R00X" H 11150 4350 60  0001 C CNN "S2PN"
F 9 "Arrow" H 11150 4350 60  0001 C CNN "S2PL"
F 10 "~" H 11150 4350 60  0001 C CNN "Characteristics"
F 11 "RES SMD 0.0OHM JUMPER 1/10W" H 11150 4350 60  0001 C CNN "Description"
F 12 "0402 (1005 Metric) " H 11150 4350 60  0001 C CNN "Package ID"
F 13 "~" H 11150 4350 60  0001 C CNN "Source"
F 14 "N" H 11150 4350 60  0001 C CNN "Critical"
F 15 "~" H 11150 4350 60  0001 C CNN "Notes"
F 16 "1" H 11150 4350 50  0001 C CNN "DNP"
	1    11150 4350
	-1   0    0    1   
$EndComp
Wire Wire Line
	11150 3425 11150 3525
Wire Wire Line
	11150 4200 11150 4075
Wire Wire Line
	11150 2375 11150 2275
Wire Wire Line
	11150 1725 11150 1625
$Comp
L power:GND #PWR036
U 1 1 5DA46F64
P 11150 2675
F 0 "#PWR036" H 11150 2675 30  0001 C CNN
F 1 "GND" H 11150 2605 30  0001 C CNN
F 2 "" H 11150 2675 60  0000 C CNN
F 3 "" H 11150 2675 60  0000 C CNN
	1    11150 2675
	1    0    0    -1  
$EndComp
$Comp
L power:GND #PWR035
U 1 1 5DA46FF5
P 11150 1325
F 0 "#PWR035" H 11150 1325 30  0001 C CNN
F 1 "GND" H 11150 1255 30  0001 C CNN
F 2 "" H 11150 1325 60  0000 C CNN
F 3 "" H 11150 1325 60  0000 C CNN
	1    11150 1325
	-1   0    0    1   
$EndComp
$Comp
L power:GND #PWR037
U 1 1 5DA4780E
P 11150 3125
F 0 "#PWR037" H 11150 3125 30  0001 C CNN
F 1 "GND" H 11150 3055 30  0001 C CNN
F 2 "" H 11150 3125 60  0000 C CNN
F 3 "" H 11150 3125 60  0000 C CNN
	1    11150 3125
	-1   0    0    1   
$EndComp
$Comp
L power:GND #PWR039
U 1 1 5DA47CAF
P 11150 4500
F 0 "#PWR039" H 11150 4500 30  0001 C CNN
F 1 "GND" H 11150 4430 30  0001 C CNN
F 2 "" H 11150 4500 60  0000 C CNN
F 3 "" H 11150 4500 60  0000 C CNN
	1    11150 4500
	1    0    0    -1  
$EndComp
Connection ~ 11800 3525
Connection ~ 11800 4075
Connection ~ 11800 1725
Connection ~ 11800 2275
Wire Wire Line
	12275 1725 12675 1725
Wire Wire Line
	12275 2275 12675 2275
Wire Wire Line
	12275 3525 12675 3525
Wire Wire Line
	12275 4075 12675 4075
$Comp
L project:SMA_2 J3
U 1 1 5E722E82
P 12800 2275
F 0 "J3" H 12902 2265 50  0000 L CNN
F 1 "~Out1~" H 12902 2174 50  0000 L CNN
F 2 "MMCX_Connectors:mmcx_th" H 12975 2175 50  0001 C CNN
F 3 "" H 12800 2275 60  0000 C CNN
F 4 "Amphenol" H 12800 2275 50  0001 C CNN "MFN"
F 5 "262104" H 12800 2275 50  0001 C CNN "MFP"
F 6 "M01-SJPT4-11BS00" H 12800 2275 50  0001 C CNN "S1PN"
F 7 "Superbat" H 12800 2275 50  0001 C CNN "S1PL"
F 8 "262104" H 12800 2275 50  0001 C CNN "S2PN"
F 9 "Arrow" H 12800 2275 50  0001 C CNN "S2PL"
F 10 "MMCX Connector Jack, Female Socket 50Ohm Through Hole Solder" H 12800 2275 50  0001 C CNN "Description"
	1    12800 2275
	1    0    0    -1  
$EndComp
$Comp
L project:SMA_2 J7
U 1 1 5E72D1D3
P 12800 3525
F 0 "J7" H 12902 3515 50  0000 L CNN
F 1 "Out2" H 12902 3424 50  0000 L CNN
F 2 "MMCX_Connectors:mmcx_th" H 12975 3425 50  0001 C CNN
F 3 "" H 12800 3525 60  0000 C CNN
F 4 "Amphenol" H 12800 3525 50  0001 C CNN "MFN"
F 5 "262104" H 12800 3525 50  0001 C CNN "MFP"
F 6 "M01-SJPT4-11BS00" H 12800 3525 50  0001 C CNN "S1PN"
F 7 "Superbat" H 12800 3525 50  0001 C CNN "S1PL"
F 8 "262104" H 12800 3525 50  0001 C CNN "S2PN"
F 9 "Arrow" H 12800 3525 50  0001 C CNN "S2PL"
F 10 "MMCX Connector Jack, Female Socket 50Ohm Through Hole Solder" H 12800 3525 50  0001 C CNN "Description"
	1    12800 3525
	1    0    0    -1  
$EndComp
$Comp
L project:SMA_2 J8
U 1 1 5E7372F1
P 12800 4075
F 0 "J8" H 12902 4065 50  0000 L CNN
F 1 "~Out2~" H 12902 3974 50  0000 L CNN
F 2 "MMCX_Connectors:mmcx_th" H 12975 3975 50  0001 C CNN
F 3 "" H 12800 4075 60  0000 C CNN
F 4 "Amphenol" H 12800 4075 50  0001 C CNN "MFN"
F 5 "262104" H 12800 4075 50  0001 C CNN "MFP"
F 6 "M01-SJPT4-11BS00" H 12800 4075 50  0001 C CNN "S1PN"
F 7 "Superbat" H 12800 4075 50  0001 C CNN "S1PL"
F 8 "262104" H 12800 4075 50  0001 C CNN "S2PN"
F 9 "Arrow" H 12800 4075 50  0001 C CNN "S2PL"
F 10 "MMCX Connector Jack, Female Socket 50Ohm Through Hole Solder" H 12800 4075 50  0001 C CNN "Description"
	1    12800 4075
	1    0    0    -1  
$EndComp
$Comp
L project:SMA_2 J12
U 1 1 5E741E5E
P 4175 7475
F 0 "J12" H 4277 7465 50  0000 L CNN
F 1 "Ref" H 4277 7374 50  0000 L CNN
F 2 "MMCX_Connectors:mmcx_th" H 4350 7375 50  0001 C CNN
F 3 "" H 4175 7475 60  0000 C CNN
F 4 "Amphenol" H 4175 7475 50  0001 C CNN "MFN"
F 5 "262104" H 4175 7475 50  0001 C CNN "MFP"
F 6 "M01-SJPT4-11BS00" H 4175 7475 50  0001 C CNN "S1PN"
F 7 "Superbat" H 4175 7475 50  0001 C CNN "S1PL"
F 8 "262104" H 4175 7475 50  0001 C CNN "S2PN"
F 9 "Arrow" H 4175 7475 50  0001 C CNN "S2PL"
F 10 "MMCX Connector Jack, Female Socket 50Ohm Through Hole Solder" H 4175 7475 50  0001 C CNN "Description"
F 11 "1:$1.20; 10:$1.08; 100:$0.96; 500:$0.86" H 4175 7475 50  0001 C CNN "kicost:RF_Supplier:pricing"
	1    4175 7475
	-1   0    0    -1  
$EndComp
Wire Wire Line
	3175 7875 5250 7875
Wire Wire Line
	3175 7975 7950 7975
Wire Wire Line
	3175 8075 8050 8075
Wire Wire Line
	3175 8175 8150 8175
Wire Wire Line
	3175 8275 5200 8275
$Comp
L project:PE42553 U3
U 1 1 5ECF5094
P 5500 6475
F 0 "U3" V 4725 7025 60  0000 C CNN
F 1 "PE42553" V 5475 6500 60  0000 C CNN
F 2 "Psemi:Psemi-QFN-16_EP1.75x1.75mm" H 5700 6225 60  0001 C CNN
F 3 "" H 5700 6225 60  0001 C CNN
F 4 "Psemi" H 5500 6475 50  0001 C CNN "MFN"
F 5 "PE42553B-Z" H 5500 6475 50  0001 C CNN "MFP"
F 6 "81-PE42553B-Z" H 5500 6475 50  0001 C CNN "S1PN"
F 7 "Mouser" H 5500 6475 50  0001 C CNN "S1PL"
F 8 "1046-1137-1-ND" H 5500 6475 50  0001 C CNN "S2PN"
F 9 "Digi-Key" H 5500 6475 50  0001 C CNN "S2PL"
F 10 "RF Switch ICs SPDT, High Iso, High Power, Absorptive, 50ohm Instrumentation Switch" H 5500 6475 50  0001 C CNN "Description"
F 11 "16-VFQFN Exposed Pad" H 5500 6475 50  0001 C CNN "Package ID"
	1    5500 6475
	0    1    -1   0   
$EndComp
Text GLabel 5250 7875 2    50   Input ~ 0
Reset
Wire Wire Line
	4725 5400 5400 5400
Wire Wire Line
	5400 5400 5400 5675
Wire Wire Line
	4725 7475 5400 7475
Wire Wire Line
	5400 7475 5400 7275
Text GLabel 5150 5025 0    50   Input ~ 0
Reset
Wire Wire Line
	5150 5025 5250 5025
Wire Wire Line
	5250 5025 5250 4900
Wire Wire Line
	5200 5675 5200 5575
Wire Wire Line
	5200 5575 5600 5575
Wire Wire Line
	6400 7375 5800 7375
Wire Wire Line
	5200 7375 5200 7275
Wire Wire Line
	5600 7275 5600 7375
Connection ~ 5600 7375
Wire Wire Line
	5600 7375 5200 7375
Wire Wire Line
	5800 7275 5800 7375
Connection ~ 5800 7375
Wire Wire Line
	5800 7375 5600 7375
Wire Wire Line
	6300 6775 6400 6775
Connection ~ 6400 6775
Wire Wire Line
	6400 6775 6400 6975
Wire Wire Line
	6300 6175 6400 6175
Connection ~ 6400 6175
Wire Wire Line
	5800 5675 5800 5575
Connection ~ 5800 5575
Wire Wire Line
	5800 5575 6400 5575
Wire Wire Line
	5600 5675 5600 5575
Connection ~ 5600 5575
Wire Wire Line
	5600 5575 5800 5575
Text GLabel 4500 6175 0    60   Input ~ 0
A_3.3V
$Comp
L power:GND #PWR022
U 1 1 5EE052DF
P 5800 7375
F 0 "#PWR022" H 5800 7375 30  0001 C CNN
F 1 "GND" H 5800 7305 30  0001 C CNN
F 2 "" H 5800 7375 60  0000 C CNN
F 3 "" H 5800 7375 60  0000 C CNN
	1    5800 7375
	1    0    0    -1  
$EndComp
Wire Wire Line
	3700 6575 3700 7250
Wire Wire Line
	3700 8375 3175 8375
$Comp
L device:R R6
U 1 1 5EE436E3
P 3350 6975
F 0 "R6" H 3225 6925 40  0000 C CNN
F 1 "10K" H 3225 7025 40  0000 C CNN
F 2 "Resistor_SMD:R_0603_1608Metric" V 3280 6975 30  0001 C CNN
F 3 "" H 3350 6975 30  0001 C CNN
F 4 "Yageo" H 3350 6975 60  0001 C CNN "MFN"
F 5 "RC0603FR-0710KL" H 3350 6975 60  0001 C CNN "MFP"
F 6 "603-RC0603FR-0710KL" H 3350 6975 60  0001 C CNN "S1PN"
F 7 "Mouser" H 3350 6975 60  0001 C CNN "S1PL"
F 8 "~" H 3350 6975 60  0001 C CNN "Characteristics"
F 9 "10 kOhms ±1% 0.1W, 1/10W" H 3350 6975 60  0001 C CNN "Description"
F 10 "0603 (1608 Metric) " H 3350 6975 60  0001 C CNN "Package ID"
F 11 "~" H 3350 6975 60  0001 C CNN "Source"
F 12 "N" H 3350 6975 60  0001 C CNN "Critical"
F 13 "~" H 3350 6975 60  0001 C CNN "Notes"
	1    3350 6975
	-1   0    0    1   
$EndComp
Text GLabel 3250 6650 0    60   Input ~ 0
A_3.3V
Wire Wire Line
	3250 6650 3350 6650
Wire Wire Line
	3350 6650 3350 6825
Wire Wire Line
	3350 7125 3350 7250
Wire Wire Line
	3350 7250 3700 7250
Connection ~ 3700 7250
Wire Wire Line
	3700 7250 3700 8375
$Comp
L connector:Conn_01x06_Male P3
U 1 1 5EE5DE5E
P 2975 8075
F 0 "P3" H 3081 8453 50  0000 C CNN
F 1 "Sig" H 3081 8362 50  0000 C CNN
F 2 "Connector_PinHeader_2.54mm:PinHeader_1x06_P2.54mm_Vertical" H 2975 8075 50  0001 C CNN
F 3 "~" H 2975 8075 50  0001 C CNN
F 4 "Samtec" H 2975 8075 50  0001 C CNN "MFN"
F 5 "HTSW-106-07-G-S" H 2975 8075 50  0001 C CNN "MFP"
F 6 "200-HTSW10607GS" H 2975 8075 50  0001 C CNN "S1PN"
F 7 "Mouser" H 2975 8075 50  0001 C CNN "S1PL"
F 8 "Pin Header Male Pin 0.100\\\"(2.54mm) 6 pin" H 2975 8075 50  0001 C CNN "Description"
F 9 "Through Hole,P=2.54mm" H 2975 8075 50  0001 C CNN "Package ID"
	1    2975 8075
	1    0    0    -1  
$EndComp
Text Notes 2625 8400 0    60   ~ 0
Ref
Wire Wire Line
	6400 5575 6400 6175
Wire Wire Line
	6300 6975 6400 6975
Connection ~ 6400 6975
Wire Wire Line
	6400 6975 6400 7375
Wire Wire Line
	3700 6575 4700 6575
Wire Wire Line
	4700 6375 4600 6375
Wire Wire Line
	4600 6375 4600 5575
Wire Wire Line
	4600 5575 5200 5575
Connection ~ 5200 5575
Wire Wire Line
	4700 6775 4600 6775
Wire Wire Line
	4600 6775 4600 6375
Connection ~ 4600 6375
Wire Wire Line
	4500 6175 4700 6175
Wire Wire Line
	6400 6175 6400 6375
Wire Wire Line
	6300 6375 6400 6375
Connection ~ 6400 6375
Wire Wire Line
	6400 6375 6400 6775
Wire Wire Line
	6300 6575 7850 6575
Wire Wire Line
	7850 5050 7850 6575
Text Notes 5100 3725 0    50   ~ 0
Ref. frequency setting\nfor 20MHz
$EndSCHEMATC
