(module QFN-32-1EP_5x5mm_Pitch0.5mm (layer F.Cu) (tedit 5D0B4387)
  (descr "UH Package; 32-Lead Plastic QFN (5mm x 5mm); (see Linear Technology QFN_32_05-08-1693.pdf)")
  (tags "QFN 0.5")
  (attr smd)
  (fp_text reference IC1 (at 4.2545 -1.2065 90) (layer F.SilkS)
    (effects (font (size 0.762 0.762) (thickness 0.127)))
  )
  (fp_text value ATMEGA32U2 (at -0.050801 4.1402) (layer F.Fab)
    (effects (font (size 0.635 0.635) (thickness 0.1016)))
  )
  (fp_text user %R (at 0.06604 -0.0635) (layer F.Fab)
    (effects (font (size 0.635 0.635) (thickness 0.1016)))
  )
  (fp_line (start -3 -3) (end -3 3) (layer F.CrtYd) (width 0.05))
  (fp_line (start 3 -3) (end 3 3) (layer F.CrtYd) (width 0.05))
  (fp_line (start -3 -3) (end 3 -3) (layer F.CrtYd) (width 0.05))
  (fp_line (start -3 3) (end 3 3) (layer F.CrtYd) (width 0.05))
  (fp_line (start 2.625 -2.625) (end 2.625 -2.1) (layer F.SilkS) (width 0.15))
  (fp_line (start -2.625 2.625) (end -2.625 2.1) (layer F.SilkS) (width 0.15))
  (fp_line (start 2.625 2.625) (end 2.625 2.1) (layer F.SilkS) (width 0.15))
  (fp_line (start -2.625 -2.625) (end -2.1 -2.625) (layer F.SilkS) (width 0.15))
  (fp_line (start -2.625 2.625) (end -2.1 2.625) (layer F.SilkS) (width 0.15))
  (fp_line (start 2.625 2.625) (end 2.1 2.625) (layer F.SilkS) (width 0.15))
  (fp_line (start 2.625 -2.625) (end 2.1 -2.625) (layer F.SilkS) (width 0.15))
  (fp_line (start -2.6162 2.6162) (end -2.6162 -1.4605) (layer F.Fab) (width 0.05))
  (fp_line (start -2.6162 -1.4605) (end -1.4605 -2.6162) (layer F.Fab) (width 0.05))
  (fp_line (start -1.4605 -2.6162) (end 2.6289 -2.6162) (layer F.Fab) (width 0.05))
  (fp_line (start 2.6289 -2.6162) (end 2.6289 2.6289) (layer F.Fab) (width 0.05))
  (fp_line (start 2.6289 2.6289) (end -2.6162 2.6289) (layer F.Fab) (width 0.05))
  (pad 1 smd rect (at -2.4 -1.75) (size 0.7 0.25) (layers F.Cu F.Paste F.Mask)
    (solder_paste_margin -0.0254))
  (pad 2 smd rect (at -2.4 -1.25) (size 0.7 0.25) (layers F.Cu F.Paste F.Mask)
    (solder_paste_margin -0.0254))
  (pad 3 smd rect (at -2.4 -0.75) (size 0.7 0.25) (layers F.Cu F.Paste F.Mask)
    (solder_paste_margin -0.0254))
  (pad 4 smd rect (at -2.4 -0.25) (size 0.7 0.25) (layers F.Cu F.Paste F.Mask)
    (solder_paste_margin -0.0254))
  (pad 5 smd rect (at -2.4 0.25) (size 0.7 0.25) (layers F.Cu F.Paste F.Mask)
    (solder_paste_margin -0.0254))
  (pad 6 smd rect (at -2.4 0.75) (size 0.7 0.25) (layers F.Cu F.Paste F.Mask)
    (solder_paste_margin -0.0254))
  (pad 7 smd rect (at -2.4 1.25) (size 0.7 0.25) (layers F.Cu F.Paste F.Mask)
    (solder_paste_margin -0.0254))
  (pad 8 smd rect (at -2.4 1.75) (size 0.7 0.25) (layers F.Cu F.Paste F.Mask)
    (solder_paste_margin -0.0254))
  (pad 9 smd rect (at -1.75 2.4 90) (size 0.7 0.25) (layers F.Cu F.Paste F.Mask)
    (solder_paste_margin -0.0254))
  (pad 10 smd rect (at -1.25 2.4 90) (size 0.7 0.25) (layers F.Cu F.Paste F.Mask)
    (solder_paste_margin -0.0254))
  (pad 11 smd rect (at -0.75 2.4 90) (size 0.7 0.25) (layers F.Cu F.Paste F.Mask)
    (solder_paste_margin -0.0254))
  (pad 12 smd rect (at -0.25 2.4 90) (size 0.7 0.25) (layers F.Cu F.Paste F.Mask)
    (solder_paste_margin -0.0254))
  (pad 13 smd rect (at 0.25 2.4 90) (size 0.7 0.25) (layers F.Cu F.Paste F.Mask)
    (solder_paste_margin -0.0254))
  (pad 14 smd rect (at 0.75 2.4 90) (size 0.7 0.25) (layers F.Cu F.Paste F.Mask)
    (solder_paste_margin -0.0254))
  (pad 15 smd rect (at 1.25 2.4 90) (size 0.7 0.25) (layers F.Cu F.Paste F.Mask)
    (solder_paste_margin -0.0254))
  (pad 16 smd rect (at 1.75 2.4 90) (size 0.7 0.25) (layers F.Cu F.Paste F.Mask)
    (solder_paste_margin -0.0254))
  (pad 17 smd rect (at 2.4 1.75) (size 0.7 0.25) (layers F.Cu F.Paste F.Mask)
    (solder_paste_margin -0.0254))
  (pad 18 smd rect (at 2.4 1.25) (size 0.7 0.25) (layers F.Cu F.Paste F.Mask)
    (solder_paste_margin -0.0254))
  (pad 19 smd rect (at 2.4 0.75) (size 0.7 0.25) (layers F.Cu F.Paste F.Mask)
    (solder_paste_margin -0.0254))
  (pad 20 smd rect (at 2.4 0.25) (size 0.7 0.25) (layers F.Cu F.Paste F.Mask)
    (solder_paste_margin -0.0254))
  (pad 21 smd rect (at 2.4 -0.25) (size 0.7 0.25) (layers F.Cu F.Paste F.Mask)
    (solder_paste_margin -0.0254))
  (pad 22 smd rect (at 2.4 -0.75) (size 0.7 0.25) (layers F.Cu F.Paste F.Mask)
    (solder_paste_margin -0.0254))
  (pad 23 smd rect (at 2.4 -1.25) (size 0.7 0.25) (layers F.Cu F.Paste F.Mask)
    (solder_paste_margin -0.0254))
  (pad 24 smd rect (at 2.4 -1.75) (size 0.7 0.25) (layers F.Cu F.Paste F.Mask)
    (solder_paste_margin -0.0254))
  (pad 25 smd rect (at 1.75 -2.4 90) (size 0.7 0.25) (layers F.Cu F.Paste F.Mask)
    (solder_paste_margin -0.0254))
  (pad 26 smd rect (at 1.25 -2.4 90) (size 0.7 0.25) (layers F.Cu F.Paste F.Mask)
    (solder_paste_margin -0.0254))
  (pad 27 smd rect (at 0.75 -2.4 90) (size 0.7 0.25) (layers F.Cu F.Paste F.Mask)
    (solder_paste_margin -0.0254))
  (pad 28 smd rect (at 0.25 -2.4 90) (size 0.7 0.25) (layers F.Cu F.Paste F.Mask)
    (solder_paste_margin -0.0254))
  (pad 29 smd rect (at -0.25 -2.4 90) (size 0.7 0.25) (layers F.Cu F.Paste F.Mask)
    (solder_paste_margin -0.0254))
  (pad 30 smd rect (at -0.75 -2.4 90) (size 0.7 0.25) (layers F.Cu F.Paste F.Mask)
    (solder_paste_margin -0.0254))
  (pad 31 smd rect (at -1.25 -2.4 90) (size 0.7 0.25) (layers F.Cu F.Paste F.Mask)
    (solder_paste_margin -0.0254))
  (pad 32 smd rect (at -1.75 -2.4 90) (size 0.7 0.25) (layers F.Cu F.Paste F.Mask)
    (solder_paste_margin -0.0254))
  (pad 33 thru_hole rect (at -1.2954 -0.4318) (size 0.8625 0.8625) (drill 0.35) (layers *.Cu F.Paste F.Mask)
    (solder_paste_margin -0.1016))
  (pad 33 thru_hole rect (at -0.4318 -1.2954) (size 0.8625 0.8625) (drill 0.35) (layers *.Cu F.Paste F.Mask)
    (solder_paste_margin -0.1016))
  (pad 33 thru_hole rect (at -1.2954 -1.2954) (size 0.8625 0.8625) (drill 0.35) (layers *.Cu F.Paste F.Mask)
    (solder_paste_margin -0.1016))
  (pad 33 thru_hole rect (at -0.4318 -0.4318) (size 0.8625 0.8625) (drill 0.35) (layers *.Cu F.Paste F.Mask)
    (solder_paste_margin -0.1016))
  (pad 33 thru_hole rect (at 1.2954 -1.2954) (size 0.8625 0.8625) (drill 0.35) (layers *.Cu F.Paste F.Mask)
    (solder_paste_margin -0.1016))
  (pad 33 thru_hole rect (at 0.4318 -1.2954) (size 0.8625 0.8625) (drill 0.35) (layers *.Cu F.Paste F.Mask)
    (solder_paste_margin -0.1016))
  (pad 33 thru_hole rect (at 0.4318 -0.4318) (size 0.8625 0.8625) (drill 0.35) (layers *.Cu F.Paste F.Mask)
    (solder_paste_margin -0.1016))
  (pad 33 thru_hole rect (at 1.2954 -0.4318) (size 0.8625 0.8625) (drill 0.35) (layers *.Cu F.Paste F.Mask)
    (solder_paste_margin -0.1016))
  (pad 33 thru_hole rect (at -1.2954 0.4318) (size 0.8625 0.8625) (drill 0.35) (layers *.Cu F.Paste F.Mask)
    (solder_paste_margin -0.1016))
  (pad 33 thru_hole rect (at -0.4318 0.4318) (size 0.8625 0.8625) (drill 0.35) (layers *.Cu F.Paste F.Mask)
    (solder_paste_margin -0.1016))
  (pad 33 thru_hole rect (at -1.2954 1.2954) (size 0.8625 0.8625) (drill 0.35) (layers *.Cu F.Paste F.Mask)
    (solder_paste_margin -0.1016))
  (pad 33 thru_hole rect (at -0.4318 1.2954) (size 0.8625 0.8625) (drill 0.35) (layers *.Cu F.Paste F.Mask)
    (solder_paste_margin -0.1016))
  (pad 33 thru_hole rect (at 0.4318 0.4318) (size 0.8625 0.8625) (drill 0.35) (layers *.Cu F.Paste F.Mask)
    (solder_paste_margin -0.1016))
  (pad 33 thru_hole rect (at 1.2954 0.4318) (size 0.8625 0.8625) (drill 0.35) (layers *.Cu F.Paste F.Mask)
    (solder_paste_margin -0.1016))
  (pad 33 thru_hole rect (at 0.4318 1.2954) (size 0.8625 0.8625) (drill 0.35) (layers *.Cu F.Paste F.Mask)
    (solder_paste_margin -0.1016))
  (pad 33 thru_hole rect (at 1.2954 1.2954) (size 0.8625 0.8625) (drill 0.35) (layers *.Cu F.Paste F.Mask)
    (solder_paste_margin -0.1016))
  (model Package_DFN_QFN.3dshapes/QFN-32-1EP_5x5mm_P0.5mm_EP3.45x3.45mm.wrl
    (at (xyz 0 0 0))
    (scale (xyz 1 1 1))
    (rotate (xyz 0 0 0))
  )
)
