(module SMD_pin_array_1x2 (layer F.Cu) (tedit 5D0C97E8)
  (fp_text reference P2 (at 3.048 0.3048 90) (layer F.SilkS) hide
    (effects (font (size 0.635 0.635) (thickness 0.1016)))
  )
  (fp_text value ~ (at 0.127 -2.413) (layer F.Fab)
    (effects (font (size 0.635 0.635) (thickness 0.1016)))
  )
  (fp_text user %R (at 0.06604 -0.0635) (layer F.Fab)
    (effects (font (size 0.635 0.635) (thickness 0.1016)))
  )
  (fp_line (start -1.7653 -1.27) (end 1.778 -1.27) (layer F.Fab) (width 0.1))
  (fp_line (start 1.778 -1.27) (end 1.778 1.27) (layer F.Fab) (width 0.1))
  (fp_line (start 1.778 1.27) (end -0.762 1.27) (layer F.Fab) (width 0.1))
  (fp_line (start -0.762 1.27) (end -1.778 0.254) (layer F.Fab) (width 0.1))
  (fp_line (start -1.778 0.254) (end -1.778 -1.27) (layer F.Fab) (width 0.1))
  (fp_line (start 1.905 1.397) (end 1.905 -1.397) (layer F.CrtYd) (width 0.05))
  (fp_line (start 1.905 -1.397) (end -1.905 -1.397) (layer F.CrtYd) (width 0.05))
  (fp_line (start -1.905 -1.397) (end -1.905 1.397) (layer F.CrtYd) (width 0.05))
  (fp_line (start -1.905 1.397) (end 1.905 1.397) (layer F.CrtYd) (width 0.05))
  (pad 1 smd roundrect (at -1.27 0) (size 1.016 2.54) (layers F.Cu F.Mask) (roundrect_rratio 0.2))
  (pad 2 smd roundrect (at 1.27 0) (size 1.016 2.54) (layers F.Cu F.Mask) (roundrect_rratio 0.2))
)
