(module SMD_pin_array_1x5 (layer F.Cu) (tedit 5D0C3D86)
  (attr smd)
  (fp_text reference P4 (at 6.7818 0.0508 -270) (layer F.SilkS)
    (effects (font (size 0.762 0.762) (thickness 0.127)))
  )
  (fp_text value Sig (at 0.127 -2.413) (layer F.Fab)
    (effects (font (size 1 1) (thickness 0.15)))
  )
  (fp_text user %R (at 0.06604 -0.0635) (layer F.Fab)
    (effects (font (size 0.635 0.635) (thickness 0.1016)))
  )
  (fp_line (start -5.715 1.397) (end -5.715 -1.397) (layer F.CrtYd) (width 0.05))
  (fp_line (start 5.715 1.397) (end -5.715 1.397) (layer F.CrtYd) (width 0.05))
  (fp_line (start 5.715 -1.397) (end 5.715 1.397) (layer F.CrtYd) (width 0.05))
  (fp_line (start -5.715 -1.397) (end 5.715 -1.397) (layer F.CrtYd) (width 0.05))
  (fp_line (start -5.588 0.1397) (end -5.588 -1.27) (layer F.Fab) (width 0.15))
  (fp_line (start 5.588 1.27) (end -4.4704 1.27) (layer F.Fab) (width 0.15))
  (fp_line (start 5.588 -1.27) (end 5.588 1.27) (layer F.Fab) (width 0.15))
  (fp_line (start -5.588 -1.27) (end 5.588 -1.27) (layer F.Fab) (width 0.15))
  (fp_line (start -4.4704 1.27) (end -5.588 0.1524) (layer F.Fab) (width 0.15))
  (pad 5 smd roundrect (at 5.07746 -0.00254) (size 1.016 2.54) (layers F.Cu F.Mask) (roundrect_rratio 0.2))
  (pad 4 smd roundrect (at 2.53746 -0.00254) (size 1.016 2.54) (layers F.Cu F.Mask) (roundrect_rratio 0.2))
  (pad 3 smd roundrect (at -0.00254 -0.00254) (size 1.016 2.54) (layers F.Cu F.Mask) (roundrect_rratio 0.2))
  (pad 2 smd roundrect (at -2.54254 -0.00254) (size 1.016 2.54) (layers F.Cu F.Mask) (roundrect_rratio 0.2))
  (pad 1 smd roundrect (at -5.08254 -0.00254) (size 1.016 2.54) (layers F.Cu F.Mask) (roundrect_rratio 0.2))
)
