EESchema Schematic File Version 4
EELAYER 30 0
EELAYER END
$Descr A4 11693 8268
encoding utf-8
Sheet 1 1
Title "LTC5510 Mixer"
Date "2021-03-07"
Rev "1.4"
Comp "Dyadic Pty. Ltd."
Comment1 "2020"
Comment2 ""
Comment3 ""
Comment4 ""
$EndDescr
$Comp
L project:LTC5510 IC1
U 1 1 5559282E
P 5650 3675
F 0 "IC1" H 5100 4325 60  0000 C CNN
F 1 "LTC5510" H 5650 3675 60  0000 C CNN
F 2 "Package_DFN_QFN:QFN-16-1EP_4x4mm_P0.65mm_EP2.1x2.1mm" H 5450 3675 60  0001 C CNN
F 3 "" H 5450 3675 60  0000 C CNN
F 4 "Linear/Analog Devices" H 5650 3675 50  0001 C CNN "MFN"
F 5 "LTC5510IUF#PBF" H 5650 3675 50  0001 C CNN "MFP"
F 6 "LTC5510IUF#PBF" H 5650 3675 50  0001 C CNN "S1PN"
F 7 "Arrow" H 5650 3675 50  0001 C CNN "S1PL"
F 8 "584-LTC5510IUF#PBF" H 5650 3675 50  0001 C CNN "S2PN"
F 9 "Mouser" H 5650 3675 50  0001 C CNN "S2PL"
F 10 "RF Mixer 1MHz to 6GHz Wideb& Hi Linity Active Mix" H 5650 3675 50  0001 C CNN "Description"
F 11 "QFN-16" H 5650 3675 50  0001 C CNN "Package ID"
	1    5650 3675
	1    0    0    -1  
$EndComp
$Comp
L device:L L1
U 1 1 55593058
P 4800 4325
F 0 "L1" H 4650 4375 50  0000 C CNN
F 1 "220nH" H 4650 4275 50  0000 C CNN
F 2 "Inductor_SMD:L_0603_1608Metric" H 4800 4325 60  0001 C CNN
F 3 "" H 4800 4325 60  0000 C CNN
F 4 "Coilcraft" H 4800 4325 50  0001 C CNN "MFN"
F 5 "0603HP-R22XJLW" H 4800 4325 50  0001 C CNN "MFP"
F 6 "994-0603HP-R22XJLW" H 4800 4325 50  0001 C CNN "S1PN"
F 7 "Mouser" H 4800 4325 50  0001 C CNN "S1PL"
F 8 "0603HP-R22XJLW" H 4800 4325 50  0001 C CNN "S2PN"
F 9 "Coilcraft direct" H 4800 4325 50  0001 C CNN "S2PL"
F 10 "Fixed Inductors 0603HP Hi Perfrmnce 220 nH 5 % 0.28 A" H 4800 4325 50  0001 C CNN "Description"
F 11 "0603 (1608 metric)" H 4800 4325 50  0001 C CNN "Package ID"
	1    4800 4325
	-1   0    0    -1  
$EndComp
$Comp
L project:MABA-010129-CT4A40 T2
U 1 1 55594162
P 9125 3675
F 0 "T2" H 9125 4125 50  0000 L BNN
F 1 "MABA-010129-CT4A40" H 8650 3200 50  0000 L BNN
F 2 "RF_Transformers:MABA-CT4" H 9275 3950 50  0001 C CNN
F 3 "" H 9025 4000 60  0000 C CNN
F 4 "MA-COM" H 9125 3675 50  0001 C CNN "MFN"
F 5 "MABA-010129-CT4A40" H 9125 3675 50  0001 C CNN "MFP"
F 6 "937-MABA010129CT4A40" H 9125 3675 50  0001 C CNN "S1PN"
F 7 "Mouser" H 9125 3675 50  0001 C CNN "S1PL"
F 8 "1465-1708-1-ND" H 9125 3675 50  0001 C CNN "S2PN"
F 9 "Digi-Key" H 9125 3675 50  0001 C CNN "S2PL"
F 10 "RF Balun 5MHz ~ 1.2GHz 50 / 75Ohm 6-SMD (5 Leads)," H 9125 3675 50  0001 C CNN "Description"
	1    9125 3675
	-1   0    0    1   
$EndComp
$Comp
L power:GND #PWR01
U 1 1 55594574
P 6650 2925
F 0 "#PWR01" H 6650 2675 50  0001 C CNN
F 1 "GND" H 6650 2775 50  0000 C CNN
F 2 "" H 6650 2925 60  0000 C CNN
F 3 "" H 6650 2925 60  0000 C CNN
	1    6650 2925
	1    0    0    -1  
$EndComp
$Comp
L power:GND #PWR02
U 1 1 555947D8
P 6450 2525
F 0 "#PWR02" H 6450 2275 50  0001 C CNN
F 1 "GND" H 6450 2375 50  0000 C CNN
F 2 "" H 6450 2525 60  0000 C CNN
F 3 "" H 6450 2525 60  0000 C CNN
	1    6450 2525
	1    0    0    -1  
$EndComp
$Comp
L device:C C2
U 1 1 55594942
P 4650 3575
F 0 "C2" V 4575 3400 50  0000 L CNN
F 1 "0.1uF" V 4575 3650 50  0000 L CNN
F 2 "Capacitor_SMD:C_0402_1005Metric" H 4688 3425 30  0001 C CNN
F 3 "" H 4650 3575 60  0000 C CNN
F 4 "Murata" H 4650 3575 50  0001 C CNN "MFN"
F 5 "GRM155R71C104KA88D" H 4650 3575 50  0001 C CNN "MFP"
F 6 "81-GRM155R71C104KA88" H 4650 3575 50  0001 C CNN "S1PN"
F 7 "Mouser" H 4650 3575 50  0001 C CNN "S1PL"
F 8 "490-3261-1-ND" H 4650 3575 50  0001 C CNN "S2PN"
F 9 "Digi-Key" H 4650 3575 50  0001 C CNN "S2PL"
F 10 "0.1µF ±10% 16V Ceramic Capacitor X7R" H 4650 3575 50  0001 C CNN "Description"
F 11 "0402 (1005 Metric)" H 4650 3575 50  0001 C CNN "Package ID"
	1    4650 3575
	0    1    1    0   
$EndComp
$Comp
L device:C C1
U 1 1 55594B53
P 4200 3675
F 0 "C1" H 4225 3750 50  0000 L CNN
F 1 "0.5pF" H 4225 3600 50  0000 L CNN
F 2 "Capacitor_SMD:C_0402_1005Metric" H 4238 3525 30  0001 C CNN
F 3 "" H 4200 3675 60  0000 C CNN
F 4 "Kemet" H 4200 3675 50  0001 C CNN "MFN"
F 5 "CBR04C508A5GAC" H 4200 3675 50  0001 C CNN "MFP"
F 6 "80-CBR04C508A5G" H 4200 3675 50  0001 C CNN "S1PN"
F 7 "Mouser" H 4200 3675 50  0001 C CNN "S1PL"
F 8 "399-13247-1-ND" H 4200 3675 50  0001 C CNN "S2PN"
F 9 "Digi-Key" H 4200 3675 50  0001 C CNN "S2PL"
F 10 "0.5pF ±0.05pF 50V Ceramic Capacitor C0G, NP0" H 4200 3675 50  0001 C CNN "Description"
F 11 "0402 (1005 Metric)" H 4200 3675 50  0001 C CNN "Package ID"
F 12 "Should be specifically RF cap. (high SRF, no microphonics)" H 4200 3675 50  0001 C CNN "Notes"
	1    4200 3675
	1    0    0    -1  
$EndComp
$Comp
L power:GND #PWR04
U 1 1 555953E5
P 4750 2925
F 0 "#PWR04" H 4750 2675 50  0001 C CNN
F 1 "GND" H 4750 2775 50  0000 C CNN
F 2 "" H 4750 2925 60  0000 C CNN
F 3 "" H 4750 2925 60  0000 C CNN
	1    4750 2925
	1    0    0    -1  
$EndComp
$Comp
L power:GND #PWR05
U 1 1 55595C6D
P 6350 4625
F 0 "#PWR05" H 6350 4375 50  0001 C CNN
F 1 "GND" H 6350 4475 50  0000 C CNN
F 2 "" H 6350 4625 60  0000 C CNN
F 3 "" H 6350 4625 60  0000 C CNN
	1    6350 4625
	1    0    0    -1  
$EndComp
$Comp
L power:GND #PWR06
U 1 1 55595EE9
P 4800 4675
F 0 "#PWR06" H 4800 4425 50  0001 C CNN
F 1 "GND" H 4800 4525 50  0000 C CNN
F 2 "" H 4800 4675 60  0000 C CNN
F 3 "" H 4800 4675 60  0000 C CNN
	1    4800 4675
	1    0    0    -1  
$EndComp
$Comp
L power:GND #PWR07
U 1 1 555962FD
P 5750 6225
F 0 "#PWR07" H 5750 5975 50  0001 C CNN
F 1 "GND" H 5750 6075 50  0000 C CNN
F 2 "" H 5750 6225 60  0000 C CNN
F 3 "" H 5750 6225 60  0000 C CNN
	1    5750 6225
	1    0    0    -1  
$EndComp
$Comp
L device:R R1
U 1 1 5559644C
P 5950 4675
F 0 "R1" H 6075 4700 50  0000 C CNN
F 1 "DNF" H 6075 4625 50  0000 C CNN
F 2 "Resistor_SMD:R_0402_1005Metric" V 5880 4675 30  0001 C CNN
F 3 "" H 5950 4675 30  0000 C CNN
F 4 "Optional" H 5950 4675 50  0001 C CNN "Description"
F 5 "0402 (1005 metric)" H 5950 4675 50  0001 C CNN "Package ID"
F 6 "1" H 5950 4675 50  0001 C CNN "DNP"
	1    5950 4675
	1    0    0    -1  
$EndComp
$Comp
L power:GND #PWR08
U 1 1 5559652E
P 5950 4925
F 0 "#PWR08" H 5950 4675 50  0001 C CNN
F 1 "GND" H 5950 4775 50  0000 C CNN
F 2 "" H 5950 4925 60  0000 C CNN
F 3 "" H 5950 4925 60  0000 C CNN
	1    5950 4925
	1    0    0    -1  
$EndComp
$Comp
L device:L L2
U 1 1 55596AA4
P 7250 3275
F 0 "L2" H 7100 3325 50  0000 C CNN
F 1 "DNF" H 7100 3225 50  0000 C CNN
F 2 "Resistor_SMD:R_0603_1608Metric" H 7250 3275 60  0001 C CNN
F 3 "" H 7250 3275 60  0000 C CNN
F 4 "Optional" H 7250 3275 50  0001 C CNN "Description"
F 5 "0603 (1608 metric)" H 7250 3275 50  0001 C CNN "Package ID"
F 6 "1" H 7250 3275 50  0001 C CNN "DNP"
	1    7250 3275
	-1   0    0    -1  
$EndComp
$Comp
L device:L L3
U 1 1 55596AEF
P 7250 4075
F 0 "L3" H 7100 4125 50  0000 C CNN
F 1 "DNF" H 7100 4025 50  0000 C CNN
F 2 "Resistor_SMD:R_0603_1608Metric" H 7250 4075 60  0001 C CNN
F 3 "" H 7250 4075 60  0000 C CNN
F 4 "Optional" H 7250 4075 50  0001 C CNN "Description"
F 5 "0603 (1608 metric)" H 7250 4075 50  0001 C CNN "Package ID"
F 6 "1" H 7250 4075 50  0001 C CNN "DNP"
	1    7250 4075
	-1   0    0    -1  
$EndComp
$Comp
L device:L L5
U 1 1 55596F9C
P 7975 4375
F 0 "L5" V 8100 4375 50  0000 C CNN
F 1 "15nH" V 7900 4375 50  0000 C CNN
F 2 "Inductor_SMD:L_0603_1608Metric" H 7975 4375 60  0001 C CNN
F 3 "" H 7975 4375 60  0000 C CNN
F 4 "Coilcraft" H 7975 4375 50  0001 C CNN "MFN"
F 5 "0603CS-15NXGLW" H 7975 4375 50  0001 C CNN "MFP"
F 6 "994-0603CS-15NXGLW" H 7975 4375 50  0001 C CNN "S1PN"
F 7 "Mouser" H 7975 4375 50  0001 C CNN "S1PL"
F 8 "0603CS-15NXGLW" H 7975 4375 50  0001 C CNN "S2PN"
F 9 "Coilcraft direct" H 7975 4375 50  0001 C CNN "S2PL"
F 10 "Fixed Inductors 0603CS15 nH 2 % 0.7 A" H 7975 4375 50  0001 C CNN "Description"
F 11 "0603 (1608 metric)" H 7975 4375 50  0001 C CNN "Package ID"
F 12 "LQW18AN15NJ00D" V 7975 4375 60  0001 C CNN "Field4"
F 13 "Digi-Key:490-1171-1-ND" V 7975 4375 60  0001 C CNN "Field5"
	1    7975 4375
	0    1    -1   0   
$EndComp
$Comp
L power:GND #PWR09
U 1 1 55597C98
P 8325 4075
F 0 "#PWR09" H 8325 3825 50  0001 C CNN
F 1 "GND" H 8325 3925 50  0000 C CNN
F 2 "" H 8325 4075 60  0000 C CNN
F 3 "" H 8325 4075 60  0000 C CNN
	1    8325 4075
	1    0    0    -1  
$EndComp
$Comp
L device:C C11
U 1 1 5559843A
P 9975 3025
F 0 "C11" V 9875 2800 50  0000 L CNN
F 1 "0.01uF" V 10150 2825 50  0000 L CNN
F 2 "Capacitor_SMD:C_0402_1005Metric" H 10013 2875 30  0001 C CNN
F 3 "" H 9975 3025 60  0000 C CNN
F 4 "Murata" H 9975 3025 50  0001 C CNN "MFN"
F 5 "GRM155R71C103KA01D" H 9975 3025 50  0001 C CNN "MFP"
F 6 "490-1313-1-ND" H 9975 3025 50  0001 C CNN "S1PN"
F 7 "Digi-Key" H 9975 3025 50  0001 C CNN "S1PL"
F 8 "81-GRM36X103K16" H 9975 3025 50  0001 C CNN "S2PN"
F 9 "Mouser" H 9975 3025 50  0001 C CNN "S2PL"
F 10 "10000pF ±10% 16V Ceramic Capacitor X7R" H 9975 3025 50  0001 C CNN "Description"
F 11 "0402 (1005 Metric)" H 9975 3025 50  0001 C CNN "Package ID"
	1    9975 3025
	0    1    1    0   
$EndComp
Wire Wire Line
	5950 2975 5950 2825
Wire Wire Line
	5950 2825 6500 2825
Wire Wire Line
	6500 2825 6500 3375
Wire Wire Line
	6500 3375 6350 3375
Wire Wire Line
	6650 2825 6650 2925
Connection ~ 6500 2825
Wire Wire Line
	5750 2975 5750 2425
Wire Wire Line
	5750 2425 5950 2425
Wire Wire Line
	6250 2425 6450 2425
Wire Wire Line
	6450 2425 6450 2525
Wire Wire Line
	4000 3525 4200 3525
Wire Wire Line
	4375 3525 4375 3575
Wire Wire Line
	4375 3575 4500 3575
Connection ~ 4200 3525
Wire Wire Line
	4800 3575 4950 3575
Wire Wire Line
	4000 3825 4200 3825
Wire Wire Line
	4375 3825 4375 3775
Wire Wire Line
	4375 3775 4500 3775
Connection ~ 4200 3825
Wire Wire Line
	4800 3775 4950 3775
Wire Wire Line
	5350 2975 5350 2825
Wire Wire Line
	5350 2825 4750 2825
Wire Wire Line
	4750 2825 4750 2925
Wire Wire Line
	5550 1700 5550 2200
Wire Wire Line
	6150 4375 6150 4525
Wire Wire Line
	6150 4525 6350 4525
Wire Wire Line
	6500 4525 6500 3975
Wire Wire Line
	6500 3975 6350 3975
Wire Wire Line
	6350 4625 6350 4525
Connection ~ 6350 4525
Wire Wire Line
	4800 4175 4800 3975
Wire Wire Line
	4800 3975 4950 3975
Wire Wire Line
	4800 4675 4800 4475
Wire Wire Line
	5750 4375 5750 4525
Wire Wire Line
	5550 4375 5550 4525
Connection ~ 5750 4525
Wire Wire Line
	5750 6225 5750 6125
Wire Wire Line
	5950 4375 5950 4525
Wire Wire Line
	5950 4825 5950 4925
Wire Wire Line
	7250 3425 7250 3675
Wire Wire Line
	6350 3775 6850 3775
Wire Wire Line
	6850 3775 6850 4375
Wire Wire Line
	6350 3575 6850 3575
Wire Wire Line
	6850 3575 6850 2975
Wire Wire Line
	8125 2975 8575 2975
Wire Wire Line
	8575 2975 8575 3350
Wire Wire Line
	8575 3350 8825 3350
Wire Wire Line
	8125 4375 8575 4375
Wire Wire Line
	8575 4375 8575 4000
Wire Wire Line
	8575 4000 8825 4000
Wire Wire Line
	7250 3675 7575 3675
Connection ~ 7250 3675
Wire Wire Line
	8325 3725 8325 3675
Connection ~ 8325 3675
Wire Wire Line
	8325 4075 8325 4025
Connection ~ 5750 5750
Wire Wire Line
	7575 5750 7575 3675
Connection ~ 7575 3675
Wire Wire Line
	9550 3350 9725 3350
Wire Wire Line
	9725 3350 9725 3025
Wire Wire Line
	5550 4525 5750 4525
NoConn ~ 4950 3375
Wire Wire Line
	1150 5850 1375 5850
Wire Wire Line
	1775 5850 1775 6075
$Comp
L power:GND #PWR015
U 1 1 557671D8
P 1775 6200
F 0 "#PWR015" H 1775 5950 50  0001 C CNN
F 1 "GND" H 1775 6050 50  0000 C CNN
F 2 "" H 1775 6200 60  0000 C CNN
F 3 "" H 1775 6200 60  0000 C CNN
	1    1775 6200
	-1   0    0    -1  
$EndComp
$Comp
L power:PWR_FLAG #FLG016
U 1 1 557671DE
P 3225 5750
F 0 "#FLG016" H 3225 5845 50  0001 C CNN
F 1 "PWR_FLAG" H 3225 5930 50  0000 C CNN
F 2 "" H 3225 5750 60  0000 C CNN
F 3 "" H 3225 5750 60  0000 C CNN
	1    3225 5750
	-1   0    0    -1  
$EndComp
$Comp
L power:PWR_FLAG #FLG017
U 1 1 557671E5
P 1775 6075
F 0 "#FLG017" H 1775 6170 50  0001 C CNN
F 1 "PWR_FLAG" H 1775 6255 50  0000 C CNN
F 2 "" H 1775 6075 60  0000 C CNN
F 3 "" H 1775 6075 60  0000 C CNN
	1    1775 6075
	0    -1   1    0   
$EndComp
Connection ~ 1775 6075
Wire Wire Line
	5550 2500 5550 2975
Wire Wire Line
	9725 3025 9825 3025
$Comp
L device:C C7
U 1 1 56C6C388
P 2175 6000
F 0 "C7" H 2025 6125 50  0000 L CNN
F 1 "0.1u" H 1925 5900 50  0000 L CNN
F 2 "Capacitor_SMD:C_0805_2012Metric" H 2213 5850 30  0001 C CNN
F 3 "" H 2175 6000 60  0000 C CNN
F 4 "Yageo" H 2175 6000 50  0001 C CNN "MFN"
F 5 "CC0805KRX7R9BB104" H 2175 6000 50  0001 C CNN "MFP"
F 6 "603-CC805KRX7R9BB104" H 2175 6000 50  0001 C CNN "S1PN"
F 7 "Mouser" H 2175 6000 50  0001 C CNN "S1PL"
F 8 "311-1140-1-ND" H 2175 6000 50  0001 C CNN "S2PN"
F 9 "Digi-Key" H 2175 6000 50  0001 C CNN "S2PL"
F 10 "0.1µF ±10% 50V Ceramic Capacitor X7R" H 2175 6000 50  0001 C CNN "Description"
F 11 "0805 (2012 Metric)" H 2175 6000 50  0001 C CNN "Package ID"
	1    2175 6000
	1    0    0    -1  
$EndComp
Wire Wire Line
	1150 5750 1275 5750
Wire Wire Line
	2175 5850 2175 5750
Connection ~ 2175 5750
$Comp
L power:GND #PWR020
U 1 1 56C7305C
P 2175 6200
F 0 "#PWR020" H 2175 5950 50  0001 C CNN
F 1 "GND" H 2175 6050 50  0000 C CNN
F 2 "" H 2175 6200 60  0000 C CNN
F 3 "" H 2175 6200 60  0000 C CNN
	1    2175 6200
	-1   0    0    -1  
$EndComp
Wire Wire Line
	2175 6200 2175 6150
Wire Wire Line
	9550 4000 9725 4000
Wire Wire Line
	9725 4000 9725 4325
Wire Wire Line
	9725 4325 9850 4325
$Comp
L power:GND #PWR025
U 1 1 58807D37
P 2600 3700
F 0 "#PWR025" H 2600 3450 50  0001 C CNN
F 1 "GND" H 2600 3550 50  0000 C CNN
F 2 "" H 2600 3700 60  0000 C CNN
F 3 "" H 2600 3700 60  0000 C CNN
	1    2600 3700
	1    0    0    -1  
$EndComp
$Comp
L power:GND #PWR027
U 1 1 58808714
P 3975 1875
F 0 "#PWR027" H 3975 1625 50  0001 C CNN
F 1 "GND" H 3975 1725 50  0000 C CNN
F 2 "" H 3975 1875 60  0000 C CNN
F 3 "" H 3975 1875 60  0000 C CNN
	1    3975 1875
	1    0    0    -1  
$EndComp
$Comp
L power:GND #PWR029
U 1 1 58809C84
P 10525 3200
F 0 "#PWR029" H 10525 2950 50  0001 C CNN
F 1 "GND" H 10525 3050 50  0000 C CNN
F 2 "" H 10525 3200 60  0000 C CNN
F 3 "" H 10525 3200 60  0000 C CNN
	1    10525 3200
	1    0    0    -1  
$EndComp
$Comp
L power:GND #PWR031
U 1 1 5880A499
P 10525 4500
F 0 "#PWR031" H 10525 4250 50  0001 C CNN
F 1 "GND" H 10525 4350 50  0000 C CNN
F 2 "" H 10525 4500 60  0000 C CNN
F 3 "" H 10525 4500 60  0000 C CNN
	1    10525 4500
	1    0    0    -1  
$EndComp
Wire Wire Line
	10150 4325 10200 4325
Wire Wire Line
	1150 6125 1275 6125
Wire Wire Line
	1275 6125 1275 5750
Connection ~ 1275 5750
Wire Wire Line
	1150 6225 1375 6225
Wire Wire Line
	1375 6225 1375 5850
Connection ~ 1375 5850
Wire Wire Line
	6500 2825 6650 2825
Wire Wire Line
	4200 3525 4375 3525
Wire Wire Line
	4200 3825 4375 3825
Wire Wire Line
	6350 4525 6500 4525
Wire Wire Line
	7250 3675 7250 3925
Wire Wire Line
	8325 3675 8825 3675
Wire Wire Line
	5750 5750 7575 5750
Wire Wire Line
	5750 5750 5750 5825
Wire Wire Line
	7575 3675 8325 3675
Wire Wire Line
	1775 6075 1775 6200
Wire Wire Line
	2175 5750 2275 5750
Wire Wire Line
	1375 5850 1775 5850
$Comp
L project:MIC5205-5.0 U1
U 1 1 5C5F6614
P 3925 5900
F 0 "U1" H 3925 6337 60  0000 C CNN
F 1 "MIC5205-5.0" H 3925 6231 60  0000 C CNN
F 2 "Package_TO_SOT_SMD:SOT-23-5" H 3925 5900 60  0001 C CNN
F 3 "" H 3925 5900 60  0000 C CNN
F 4 "Microchip Technology" H 3925 5900 50  0001 C CNN "MFN"
F 5 "MIC5205-5.0YM5-TR" H 3925 5900 50  0001 C CNN "MFP"
F 6 "998-MIC5205-5.0YM5TR" H 3925 5900 50  0001 C CNN "S1PN"
F 7 "Mouser" H 3925 5900 50  0001 C CNN "S1PL"
F 8 "576-1261-1-ND" H 3925 5900 50  0001 C CNN "S2PN"
F 9 "Digi-Key" H 3925 5900 50  0001 C CNN "S2PL"
F 10 "Linear Voltage Regulator IC 1 Output 150mA" H 3925 5900 50  0001 C CNN "Description"
F 11 "SOT-23-5" H 3925 5900 50  0001 C CNN "Package ID"
	1    3925 5900
	1    0    0    -1  
$EndComp
$Comp
L device:R R2
U 1 1 5C5FCEFC
P 2725 5750
F 0 "R2" V 2932 5750 50  0000 C CNN
F 1 "5" V 2841 5750 50  0000 C CNN
F 2 "Resistor_SMD:R_0603_1608Metric" V 2655 5750 50  0001 C CNN
F 3 "" H 2725 5750 50  0001 C CNN
F 4 "Yageo" H 2725 5750 50  0001 C CNN "MFN"
F 5 "RC0603FR-104R7L" H 2725 5750 50  0001 C CNN "MFP"
F 6 "603-RC0603FR-104R7L" H 2725 5750 50  0001 C CNN "S1PN"
F 7 "Mouser" H 2725 5750 50  0001 C CNN "S1PL"
F 8 "" H 2725 5750 50  0001 C CNN "S2PN"
F 9 "" H 2725 5750 50  0001 C CNN "S2PL"
F 10 "4.7 Ohms 100 mW 0603 1% " H 2725 5750 50  0001 C CNN "Description"
F 11 "0603 (1608 Metric)" H 2725 5750 50  0001 C CNN "Package ID"
	1    2725 5750
	0    1    -1   0   
$EndComp
$Comp
L device:Ferrite_Bead_Small FB1
U 1 1 5C60933D
P 2375 5750
F 0 "FB1" V 2230 5750 50  0000 C CNN
F 1 "~" V 2229 5750 50  0000 C CNN
F 2 "Inductor_SMD:L_0805_2012Metric" V 2305 5750 50  0001 C CNN
F 3 "" H 2375 5750 50  0001 C CNN
F 4 "Murata Electronics" H 2375 5750 50  0001 C CNN "MFN"
F 5 "BLM21PG221SN1D" H 2375 5750 50  0001 C CNN "MFP"
F 6 "81-BLM21P221SG" H 2375 5750 50  0001 C CNN "S1PN"
F 7 "Mouser" H 2375 5750 50  0001 C CNN "S1PL"
F 8 "490-1054-1-ND" H 2375 5750 50  0001 C CNN "S2PN"
F 9 "Digi-Key" H 2375 5750 50  0001 C CNN "S2PL"
F 10 "FERRITE BEAD 220 OHM 0805 1LN" H 2375 5750 50  0001 C CNN "Description"
F 11 "0805 (2012 Metric)" H 2375 5750 50  0001 C CNN "Package ID"
	1    2375 5750
	0    1    1    0   
$EndComp
$Comp
L device:CP C8
U 1 1 5C60949E
P 4975 5975
F 0 "C8" H 5093 6021 50  0000 L CNN
F 1 "2.2u" H 5093 5930 50  0000 L CNN
F 2 "Capacitor_SMD:C_1206_3216Metric" H 5013 5825 50  0001 C CNN
F 3 "" H 4975 5975 50  0001 C CNN
F 4 "Vishay" H 4975 5975 50  0001 C CNN "MFN"
F 5 "TR3A225K025C4000 " H 4975 5975 50  0001 C CNN "MFP"
F 6 "718-1303-1-ND" H 4975 5975 50  0001 C CNN "S1PN"
F 7 "Digi-Key" H 4975 5975 50  0001 C CNN "S1PL"
F 8 " 74-TR3A225K025C4000 " H 4975 5975 50  0001 C CNN "S2PN"
F 9 "Mouser" H 4975 5975 50  0001 C CNN "S2PL"
F 10 "2.2µF Molded Tantalum Capacitors 25V 1206 (3216 Metric) 4Ohm" H 4975 5975 50  0001 C CNN "Description"
F 11 "1206 (3216 Metric)" H 4975 5975 50  0001 C CNN "Package ID"
	1    4975 5975
	1    0    0    -1  
$EndComp
$Comp
L device:C C13
U 1 1 5C609530
P 4675 6225
F 0 "C13" H 4525 6350 50  0000 L CNN
F 1 "470p" H 4425 6125 50  0000 L CNN
F 2 "Capacitor_SMD:C_0603_1608Metric" H 4713 6075 30  0001 C CNN
F 3 "" H 4675 6225 60  0000 C CNN
F 4 "Kemet" H 4675 6225 50  0001 C CNN "MFN"
F 5 "C0603C471J5GACTU " H 4675 6225 50  0001 C CNN "MFP"
F 6 "399-7922-1-ND" H 4675 6225 50  0001 C CNN "S1PN"
F 7 "Digi-Key" H 4675 6225 50  0001 C CNN "S1PL"
F 8 "80-C0603C471J5G" H 4675 6225 50  0001 C CNN "S2PN"
F 9 "Mouser" H 4675 6225 50  0001 C CNN "S2PL"
F 10 "MLCC - SMD/SMT 50V 470pF C0G 5%" H 4675 6225 50  0001 C CNN "Description"
F 11 "0603 (1608 Metric)" H 4675 6225 50  0001 C CNN "Package ID"
	1    4675 6225
	1    0    0    -1  
$EndComp
$Comp
L device:C C10
U 1 1 5C6219A2
P 3025 6000
F 0 "C10" H 2825 6125 50  0000 L CNN
F 1 "0.01u" H 2775 5900 50  0000 L CNN
F 2 "Capacitor_SMD:C_0603_1608Metric" H 3063 5850 30  0001 C CNN
F 3 "" H 3025 6000 60  0000 C CNN
F 4 "Kemet" H 3025 6000 50  0001 C CNN "MFN"
F 5 "C0603C103K5RACTU" H 3025 6000 50  0001 C CNN "MFP"
F 6 "80-C0603C103K5R" H 3025 6000 50  0001 C CNN "S1PN"
F 7 "Mouser" H 3025 6000 50  0001 C CNN "S1PL"
F 8 "399-1091-1-ND" H 3025 6000 50  0001 C CNN "S2PN"
F 9 "Digi-Key" H 3025 6000 50  0001 C CNN "S2PL"
F 10 "Multilayer Ceramic Capacitors MLCC - SMD/SMT 50V 0.01uF 0603 X7R 10%" H 3025 6000 50  0001 C CNN "Description"
F 11 "0603 (1608 metric)" H 3025 6000 50  0001 C CNN "Package ID"
	1    3025 6000
	1    0    0    -1  
$EndComp
Wire Wire Line
	2475 5750 2575 5750
Wire Wire Line
	2875 5750 3025 5750
Wire Wire Line
	3325 5950 3225 5950
Wire Wire Line
	3225 5950 3225 5750
Connection ~ 3225 5750
Wire Wire Line
	3225 5750 3325 5750
Wire Wire Line
	3025 5850 3025 5750
Connection ~ 3025 5750
Wire Wire Line
	3025 5750 3225 5750
$Comp
L power:GND #PWR0101
U 1 1 5C63AD32
P 3025 6200
F 0 "#PWR0101" H 3025 5950 50  0001 C CNN
F 1 "GND" H 3025 6050 50  0000 C CNN
F 2 "" H 3025 6200 60  0000 C CNN
F 3 "" H 3025 6200 60  0000 C CNN
	1    3025 6200
	-1   0    0    -1  
$EndComp
$Comp
L power:GND #PWR0102
U 1 1 5C63AD9F
P 3925 6350
F 0 "#PWR0102" H 3925 6100 50  0001 C CNN
F 1 "GND" H 3925 6200 50  0000 C CNN
F 2 "" H 3925 6350 60  0000 C CNN
F 3 "" H 3925 6350 60  0000 C CNN
	1    3925 6350
	-1   0    0    -1  
$EndComp
Wire Wire Line
	3025 6150 3025 6200
Wire Wire Line
	4525 5950 4675 5950
Wire Wire Line
	4675 5950 4675 6075
$Comp
L power:GND #PWR0103
U 1 1 5C64FB06
P 4675 6375
F 0 "#PWR0103" H 4675 6125 50  0001 C CNN
F 1 "GND" H 4675 6225 50  0000 C CNN
F 2 "" H 4675 6375 60  0000 C CNN
F 3 "" H 4675 6375 60  0000 C CNN
	1    4675 6375
	-1   0    0    -1  
$EndComp
Wire Wire Line
	4525 5750 4975 5750
Wire Wire Line
	4975 5750 4975 5825
$Comp
L power:GND #PWR0104
U 1 1 5C656D98
P 4975 6125
F 0 "#PWR0104" H 4975 5875 50  0001 C CNN
F 1 "GND" H 4975 5975 50  0000 C CNN
F 2 "" H 4975 6125 60  0000 C CNN
F 3 "" H 4975 6125 60  0000 C CNN
	1    4975 6125
	-1   0    0    -1  
$EndComp
Wire Wire Line
	4975 5750 5350 5750
Connection ~ 4975 5750
Wire Wire Line
	1275 5750 2175 5750
$Comp
L device:R X1
U 1 1 5C6E198D
P 4800 1700
F 0 "X1" V 5007 1700 50  0000 C CNN
F 1 "0" V 4916 1700 50  0000 C CNN
F 2 "Resistor_SMD:R_0402_1005Metric" V 4730 1700 50  0001 C CNN
F 3 "" H 4800 1700 50  0001 C CNN
F 4 "Panasonic Electronic Components" H 6500 5550 60  0001 C CNN "MFN"
F 5 "ERJ-2GE0R00X" H 6500 5550 60  0001 C CNN "MFP"
F 6 "P0.0JCT-ND" H 6500 5550 60  0001 C CNN "S1PN"
F 7 "Digi-Key" H 6500 5550 60  0001 C CNN "S1PL"
F 8 "ERJ-2GE0R00X" H 6500 5550 60  0001 C CNN "S2PN"
F 9 "Arrow" H 6500 5550 60  0001 C CNN "S2PL"
F 10 "~" H 6500 5550 60  0001 C CNN "Characteristics"
F 11 "RES SMD 0.0OHM JUMPER 1/10W" H 6500 5550 60  0001 C CNN "Description"
F 12 "0402 (1005 Metric)" H 6500 5550 60  0001 C CNN "Package ID"
F 13 "~" H 6500 5550 60  0001 C CNN "Source"
F 14 "N" H 6500 5550 60  0001 C CNN "Critical"
F 15 "~" H 6500 5550 60  0001 C CNN "Notes"
	1    4800 1700
	0    1    -1   0   
$EndComp
$Comp
L device:R X2
U 1 1 5C6E1D74
P 4550 1950
F 0 "X2" H 4675 1975 50  0000 C CNN
F 1 "DNF" H 4675 1900 50  0000 C CNN
F 2 "Resistor_SMD:R_0402_1005Metric" V 4480 1950 30  0001 C CNN
F 3 "" H 4550 1950 30  0000 C CNN
F 4 "Optional" H 4550 1950 50  0001 C CNN "Description"
F 5 "0402 (1005 metric)" H 4550 1950 50  0001 C CNN "Package ID"
F 6 "1" H 4550 1950 50  0001 C CNN "DNP"
	1    4550 1950
	1    0    0    -1  
$EndComp
$Comp
L device:R X3
U 1 1 5C6E1EFA
P 5050 1950
F 0 "X3" H 5175 1975 50  0000 C CNN
F 1 "DNF" H 5175 1900 50  0000 C CNN
F 2 "Resistor_SMD:R_0402_1005Metric" V 4980 1950 30  0001 C CNN
F 3 "" H 5050 1950 30  0000 C CNN
F 4 "Optional" H 5050 1950 50  0001 C CNN "Description"
F 5 "0402 (1005 metric)" H 5050 1950 50  0001 C CNN "Package ID"
F 6 "1" H 5050 1950 50  0001 C CNN "DNP"
	1    5050 1950
	1    0    0    -1  
$EndComp
$Comp
L power:GND #PWR010
U 1 1 5C6E1F6F
P 4550 2100
F 0 "#PWR010" H 4550 1850 50  0001 C CNN
F 1 "GND" H 4550 1950 50  0000 C CNN
F 2 "" H 4550 2100 60  0000 C CNN
F 3 "" H 4550 2100 60  0000 C CNN
	1    4550 2100
	1    0    0    -1  
$EndComp
$Comp
L power:GND #PWR011
U 1 1 5C6E1FC8
P 5050 2100
F 0 "#PWR011" H 5050 1850 50  0001 C CNN
F 1 "GND" H 5050 1950 50  0000 C CNN
F 2 "" H 5050 2100 60  0000 C CNN
F 3 "" H 5050 2100 60  0000 C CNN
	1    5050 2100
	1    0    0    -1  
$EndComp
Wire Wire Line
	4650 1700 4550 1700
Wire Wire Line
	4950 1700 5050 1700
Wire Wire Line
	5050 1800 5050 1700
Connection ~ 5050 1700
Wire Wire Line
	5050 1700 5550 1700
Wire Wire Line
	4550 1800 4550 1700
Connection ~ 4550 1700
Wire Wire Line
	4550 1700 4100 1700
$Comp
L device:R_Small R12
U 1 1 5C7F6556
P 10200 4500
F 0 "R12" H 10000 4525 50  0000 L CNN
F 1 "DNF" H 10000 4450 50  0000 L CNN
F 2 "Resistor_SMD:R_0402_1005Metric" H 10200 4500 50  0001 C CNN
F 3 "" H 10200 4500 50  0001 C CNN
F 4 "Optional" H 10200 4500 50  0001 C CNN "Description"
F 5 "0402 (1005 metric)" H 10200 4500 50  0001 C CNN "Package ID"
F 6 "1" H 10200 4500 50  0001 C CNN "DNP"
	1    10200 4500
	1    0    0    -1  
$EndComp
$Comp
L power:GND #PWR012
U 1 1 5C7F6707
P 10200 4600
F 0 "#PWR012" H 10200 4350 50  0001 C CNN
F 1 "GND" H 10200 4450 50  0000 C CNN
F 2 "" H 10200 4600 60  0000 C CNN
F 3 "" H 10200 4600 60  0000 C CNN
	1    10200 4600
	1    0    0    -1  
$EndComp
Wire Wire Line
	10200 4400 10200 4325
Connection ~ 10200 4325
$Comp
L project:rfi_shield_clip P3
U 1 1 5C80440B
P 6950 1075
F 0 "P3" H 7078 1094 60  0000 L CNN
F 1 "~" H 7078 1041 60  0000 L CNN
F 2 "RF_Shielding:S1721-46R" H 6950 1075 60  0001 C CNN
F 3 "" H 6950 1075 60  0000 C CNN
F 4 "Harwin Inc." H 6950 1075 50  0001 C CNN "MFN"
F 5 "S1721-46R" H 6950 1075 50  0001 C CNN "MFP"
F 6 "952-1476-1-ND" H 6950 1075 50  0001 C CNN "S1PN"
F 7 "Digi-Key" H 6950 1075 50  0001 C CNN "S1PL"
F 8 "855-S1721-46R" H 6950 1075 50  0001 C CNN "S2PN"
F 9 "Mouser" H 6950 1075 50  0001 C CNN "S2PL"
F 10 "RFI SHIELD CLIP MINI TIN SMD" H 6950 1075 50  0001 C CNN "Description"
	1    6950 1075
	1    0    0    -1  
$EndComp
$Comp
L power:GND #PWR0105
U 1 1 5C812730
P 6950 1175
F 0 "#PWR0105" H 6950 925 50  0001 C CNN
F 1 "GND" H 6950 1025 50  0000 C CNN
F 2 "" H 6950 1175 60  0000 C CNN
F 3 "" H 6950 1175 60  0000 C CNN
	1    6950 1175
	1    0    0    -1  
$EndComp
$Comp
L power:GND #PWR0106
U 1 1 5C8128FB
P 7425 1175
F 0 "#PWR0106" H 7425 925 50  0001 C CNN
F 1 "GND" H 7425 1025 50  0000 C CNN
F 2 "" H 7425 1175 60  0000 C CNN
F 3 "" H 7425 1175 60  0000 C CNN
	1    7425 1175
	1    0    0    -1  
$EndComp
$Comp
L power:GND #PWR0107
U 1 1 5C812D66
P 7900 1175
F 0 "#PWR0107" H 7900 925 50  0001 C CNN
F 1 "GND" H 7900 1025 50  0000 C CNN
F 2 "" H 7900 1175 60  0000 C CNN
F 3 "" H 7900 1175 60  0000 C CNN
	1    7900 1175
	1    0    0    -1  
$EndComp
$Comp
L power:GND #PWR0108
U 1 1 5C812DE1
P 8375 1175
F 0 "#PWR0108" H 8375 925 50  0001 C CNN
F 1 "GND" H 8375 1025 50  0000 C CNN
F 2 "" H 8375 1175 60  0000 C CNN
F 3 "" H 8375 1175 60  0000 C CNN
	1    8375 1175
	1    0    0    -1  
$EndComp
$Comp
L power:GND #PWR0109
U 1 1 5C813054
P 8375 1675
F 0 "#PWR0109" H 8375 1425 50  0001 C CNN
F 1 "GND" H 8375 1525 50  0000 C CNN
F 2 "" H 8375 1675 60  0000 C CNN
F 3 "" H 8375 1675 60  0000 C CNN
	1    8375 1675
	1    0    0    -1  
$EndComp
$Comp
L power:GND #PWR0110
U 1 1 5C8130CF
P 7900 1675
F 0 "#PWR0110" H 7900 1425 50  0001 C CNN
F 1 "GND" H 7900 1525 50  0000 C CNN
F 2 "" H 7900 1675 60  0000 C CNN
F 3 "" H 7900 1675 60  0000 C CNN
	1    7900 1675
	1    0    0    -1  
$EndComp
$Comp
L power:GND #PWR0111
U 1 1 5C81314A
P 7425 1675
F 0 "#PWR0111" H 7425 1425 50  0001 C CNN
F 1 "GND" H 7425 1525 50  0000 C CNN
F 2 "" H 7425 1675 60  0000 C CNN
F 3 "" H 7425 1675 60  0000 C CNN
	1    7425 1675
	1    0    0    -1  
$EndComp
$Comp
L power:GND #PWR0112
U 1 1 5C813385
P 6950 1675
F 0 "#PWR0112" H 6950 1425 50  0001 C CNN
F 1 "GND" H 6950 1525 50  0000 C CNN
F 2 "" H 6950 1675 60  0000 C CNN
F 3 "" H 6950 1675 60  0000 C CNN
	1    6950 1675
	1    0    0    -1  
$EndComp
$Comp
L graphics:Logo_Open_Hardware_Small #LOGO1
U 1 1 5C780467
P 1125 1100
F 0 "#LOGO1" H 1125 1375 50  0001 C CNN
F 1 "Open Source Hardware" H 1125 1394 50  0000 C CNN
F 2 "" H 1125 1100 50  0001 C CNN
F 3 "~" H 1125 1100 50  0001 C CNN
	1    1125 1100
	1    0    0    -1  
$EndComp
Text Notes 1275 5675 0    50   ~ 0
6-12V
$Comp
L connector:Conn_01x02_Male P1
U 1 1 5D1DA1CF
P 950 5750
F 0 "P1" H 1056 5928 50  0000 C CNN
F 1 "Pwr" H 1056 5837 50  0000 C CNN
F 2 "Connector_PinHeader_2.54mm:PinHeader_1x02_P2.54mm_Vertical" H 950 5750 50  0001 C CNN
F 3 "" H 950 5750 50  0001 C CNN
F 4 "Mintron" H 950 5750 50  0001 C CNN "MFN"
F 5 "MTP125-1102S1" H 950 5750 50  0001 C CNN "MFP"
F 6 "C358684" H 950 5750 50  0001 C CNN "S1PN"
F 7 "LCSC" H 950 5750 50  0001 C CNN "S1PL"
F 8 "Pin Header Male Pin 0.100\\\"(2.54mm) 2 pin" H 950 5750 50  0001 C CNN "Description"
F 9 "Through Hole,P=2.54mm" H 950 5750 50  0001 C CNN "Package ID"
F 10 "1:$0.01; 10:$0.01; 100:$0.01; 500:$0.008" H 950 5750 50  0001 C CNN "kicost:LCSC:pricing"
F 11 "https://lcsc.com/product-detail/Pin-Header-Female-Header_MINTRON-MTP125-1102S1_C358684.html" H 950 5750 50  0001 C CNN "kicost:LCSC:link"
	1    950  5750
	1    0    0    -1  
$EndComp
$Comp
L connector:Conn_01x02_Male P2
U 1 1 5D1E1333
P 950 6125
F 0 "P2" H 1050 5950 50  0000 C CNN
F 1 "DNF" H 1050 5850 50  0000 C CNN
F 2 "Connectors:SMD_pin_array_1x2" H 950 6125 50  0001 C CNN
F 3 "~" H 950 6125 50  0001 C CNN
F 4 "Molex" H 950 6125 50  0001 C CNN "MFN"
F 5 "0022284361" H 950 6125 50  0001 C CNN "MFP"
F 6 "WM50017-36-ND" H 950 6125 50  0001 C CNN "S1PN"
F 7 "Digi-Key" H 950 6125 50  0001 C CNN "S1PL"
F 8 "Connector Header Through Hole 36 position 0.100\" (2.54mm)" H 950 6125 50  0001 C CNN "Description"
F 9 "Generic 0.1\" pitch pin header" H 950 6125 50  0001 C CNN "Notes"
F 10 "1" H 950 6125 50  0001 C CNN "DNP"
	1    950  6125
	1    0    0    -1  
$EndComp
$Comp
L device:L L4
U 1 1 5D25B832
P 7975 2975
F 0 "L4" V 8100 2975 50  0000 C CNN
F 1 "15nH" V 7900 2975 50  0000 C CNN
F 2 "Inductor_SMD:L_0603_1608Metric" H 7975 2975 60  0001 C CNN
F 3 "" H 7975 2975 60  0000 C CNN
F 4 "Coilcraft" H 7975 2975 50  0001 C CNN "MFN"
F 5 "0603CS-15NXGLW" H 7975 2975 50  0001 C CNN "MFP"
F 6 "994-0603CS-15NXGLW" H 7975 2975 50  0001 C CNN "S1PN"
F 7 "Mouser" H 7975 2975 50  0001 C CNN "S1PL"
F 8 "0603CS-15NXGLW" H 7975 2975 50  0001 C CNN "S2PN"
F 9 "Coilcraft direct" H 7975 2975 50  0001 C CNN "S2PL"
F 10 "Fixed Inductors 0603CS15 nH 2 % 0.7 A" H 7975 2975 50  0001 C CNN "Description"
F 11 "0603 (1608 metric)" H 7975 2975 50  0001 C CNN "Package ID"
F 12 "LQW18AN15NJ00D" V 7975 2975 60  0001 C CNN "Field4"
F 13 "Digi-Key:490-1171-1-ND" V 7975 2975 60  0001 C CNN "Field5"
	1    7975 2975
	0    1    -1   0   
$EndComp
$Comp
L device:C C3
U 1 1 5D264200
P 4650 3775
F 0 "C3" V 4575 3600 50  0000 L CNN
F 1 "0.1uF" V 4575 3850 50  0000 L CNN
F 2 "Capacitor_SMD:C_0402_1005Metric" H 4688 3625 30  0001 C CNN
F 3 "" H 4650 3775 60  0000 C CNN
F 4 "Murata" H 4650 3775 50  0001 C CNN "MFN"
F 5 "GRM155R71C104KA88D" H 4650 3775 50  0001 C CNN "MFP"
F 6 "81-GRM155R71C104KA88" H 4650 3775 50  0001 C CNN "S1PN"
F 7 "Mouser" H 4650 3775 50  0001 C CNN "S1PL"
F 8 "490-3261-1-ND" H 4650 3775 50  0001 C CNN "S2PN"
F 9 "Digi-Key" H 4650 3775 50  0001 C CNN "S2PL"
F 10 "0.1µF ±10% 16V Ceramic Capacitor X7R" H 4650 3775 50  0001 C CNN "Description"
F 11 "0402 (1005 Metric)" H 4650 3775 50  0001 C CNN "Package ID"
	1    4650 3775
	0    1    1    0   
$EndComp
$Comp
L device:C C6
U 1 1 5D26AF01
P 6100 2425
F 0 "C6" V 6025 2250 50  0000 L CNN
F 1 "0.1uF" V 6025 2500 50  0000 L CNN
F 2 "Capacitor_SMD:C_0402_1005Metric" H 6138 2275 30  0001 C CNN
F 3 "" H 6100 2425 60  0000 C CNN
F 4 "Murata" H 6100 2425 50  0001 C CNN "MFN"
F 5 "GRM155R71C104KA88D" H 6100 2425 50  0001 C CNN "MFP"
F 6 "81-GRM155R71C104KA88" H 6100 2425 50  0001 C CNN "S1PN"
F 7 "Mouser" H 6100 2425 50  0001 C CNN "S1PL"
F 8 "490-3261-1-ND" H 6100 2425 50  0001 C CNN "S2PN"
F 9 "Digi-Key" H 6100 2425 50  0001 C CNN "S2PL"
F 10 "0.1µF ±10% 16V Ceramic Capacitor X7R" H 6100 2425 50  0001 C CNN "Description"
F 11 "0402 (1005 Metric)" H 6100 2425 50  0001 C CNN "Package ID"
	1    6100 2425
	0    1    1    0   
$EndComp
$Comp
L device:C C4
U 1 1 5D27190C
P 5550 2350
F 0 "C4" H 5625 2250 50  0000 L CNN
F 1 "0.1uF" H 5625 2450 50  0000 L CNN
F 2 "Capacitor_SMD:C_0402_1005Metric" H 5588 2200 30  0001 C CNN
F 3 "" H 5550 2350 60  0000 C CNN
F 4 "Murata" H 5550 2350 50  0001 C CNN "MFN"
F 5 "GRM155R71C104KA88D" H 5550 2350 50  0001 C CNN "MFP"
F 6 "81-GRM155R71C104KA88" H 5550 2350 50  0001 C CNN "S1PN"
F 7 "Mouser" H 5550 2350 50  0001 C CNN "S1PL"
F 8 "490-3261-1-ND" H 5550 2350 50  0001 C CNN "S2PN"
F 9 "Digi-Key" H 5550 2350 50  0001 C CNN "S2PL"
F 10 "0.1µF ±10% 16V Ceramic Capacitor X7R" H 5550 2350 50  0001 C CNN "Description"
F 11 "0402 (1005 Metric)" H 5550 2350 50  0001 C CNN "Package ID"
	1    5550 2350
	-1   0    0    1   
$EndComp
$Comp
L device:C C12
U 1 1 5D279602
P 10000 4325
F 0 "C12" V 9900 4100 50  0000 L CNN
F 1 "0.01uF" V 10075 3975 50  0000 L CNN
F 2 "Capacitor_SMD:C_0402_1005Metric" H 10038 4175 30  0001 C CNN
F 3 "" H 10000 4325 60  0000 C CNN
F 4 "Murata" H 10000 4325 50  0001 C CNN "MFN"
F 5 "GRM155R71C103KA01D" H 10000 4325 50  0001 C CNN "MFP"
F 6 "490-1313-1-ND" H 10000 4325 50  0001 C CNN "S1PN"
F 7 "Digi-Key" H 10000 4325 50  0001 C CNN "S1PL"
F 8 "81-GRM36X103K16" H 10000 4325 50  0001 C CNN "S2PN"
F 9 "Mouser" H 10000 4325 50  0001 C CNN "S2PL"
F 10 "10000pF ±10% 16V Ceramic Capacitor X7R" H 10000 4325 50  0001 C CNN "Description"
F 11 "0402 (1005 Metric)" H 10000 4325 50  0001 C CNN "Package ID"
	1    10000 4325
	0    1    1    0   
$EndComp
$Comp
L device:C C9
U 1 1 5D280381
P 8325 3875
F 0 "C9" H 8450 3750 50  0000 L CNN
F 1 "0.01uF" H 8375 3975 50  0000 L CNN
F 2 "Capacitor_SMD:C_0402_1005Metric" H 8363 3725 30  0001 C CNN
F 3 "" H 8325 3875 60  0000 C CNN
F 4 "Murata" H 8325 3875 50  0001 C CNN "MFN"
F 5 "GRM155R71C103KA01D" H 8325 3875 50  0001 C CNN "MFP"
F 6 "490-1313-1-ND" H 8325 3875 50  0001 C CNN "S1PN"
F 7 "Digi-Key" H 8325 3875 50  0001 C CNN "S1PL"
F 8 "81-GRM36X103K16" H 8325 3875 50  0001 C CNN "S2PN"
F 9 "Mouser" H 8325 3875 50  0001 C CNN "S2PL"
F 10 "10000pF ±10% 16V Ceramic Capacitor X7R" H 8325 3875 50  0001 C CNN "Description"
F 11 "0402 (1005 Metric)" H 8325 3875 50  0001 C CNN "Package ID"
	1    8325 3875
	-1   0    0    1   
$EndComp
$Comp
L device:C C5
U 1 1 5D28DA29
P 5750 5975
F 0 "C5" H 5875 5850 50  0000 L CNN
F 1 "DNF" H 5800 6075 50  0000 L CNN
F 2 "Capacitor_SMD:C_0402_1005Metric" H 5788 5825 30  0001 C CNN
F 3 "" H 5750 5975 60  0000 C CNN
F 4 "Murata" H 5750 5975 50  0001 C CNN "MFN"
F 5 "GRM155R71C103KA01D" H 5750 5975 50  0001 C CNN "MFP"
F 6 "490-1313-1-ND" H 5750 5975 50  0001 C CNN "S1PN"
F 7 "Digi-Key" H 5750 5975 50  0001 C CNN "S1PL"
F 8 "81-GRM36X103K16" H 5750 5975 50  0001 C CNN "S2PN"
F 9 "Mouser" H 5750 5975 50  0001 C CNN "S2PL"
F 10 "10000pF ±10% 16V Ceramic Capacitor X7R" H 5750 5975 50  0001 C CNN "Description"
F 11 "0402 (1005 Metric)" H 5750 5975 50  0001 C CNN "Package ID"
	1    5750 5975
	-1   0    0    1   
$EndComp
$Comp
L project:rfi_shield_clip P4
U 1 1 5D2992D6
P 7425 1075
F 0 "P4" H 7553 1094 60  0000 L CNN
F 1 "~" H 7553 1041 60  0000 L CNN
F 2 "RF_Shielding:S1721-46R" H 7425 1075 60  0001 C CNN
F 3 "" H 7425 1075 60  0000 C CNN
F 4 "Harwin Inc." H 7425 1075 50  0001 C CNN "MFN"
F 5 "S1721-46R" H 7425 1075 50  0001 C CNN "MFP"
F 6 "952-1476-1-ND" H 7425 1075 50  0001 C CNN "S1PN"
F 7 "Digi-Key" H 7425 1075 50  0001 C CNN "S1PL"
F 8 "855-S1721-46R" H 7425 1075 50  0001 C CNN "S2PN"
F 9 "Mouser" H 7425 1075 50  0001 C CNN "S2PL"
F 10 "RFI SHIELD CLIP MINI TIN SMD" H 7425 1075 50  0001 C CNN "Description"
	1    7425 1075
	1    0    0    -1  
$EndComp
$Comp
L project:rfi_shield_clip P5
U 1 1 5D29FCD3
P 7900 1075
F 0 "P5" H 8028 1094 60  0000 L CNN
F 1 "~" H 8028 1041 60  0000 L CNN
F 2 "RF_Shielding:S1721-46R" H 7900 1075 60  0001 C CNN
F 3 "" H 7900 1075 60  0000 C CNN
F 4 "Harwin Inc." H 7900 1075 50  0001 C CNN "MFN"
F 5 "S1721-46R" H 7900 1075 50  0001 C CNN "MFP"
F 6 "952-1476-1-ND" H 7900 1075 50  0001 C CNN "S1PN"
F 7 "Digi-Key" H 7900 1075 50  0001 C CNN "S1PL"
F 8 "855-S1721-46R" H 7900 1075 50  0001 C CNN "S2PN"
F 9 "Mouser" H 7900 1075 50  0001 C CNN "S2PL"
F 10 "RFI SHIELD CLIP MINI TIN SMD" H 7900 1075 50  0001 C CNN "Description"
	1    7900 1075
	1    0    0    -1  
$EndComp
$Comp
L project:rfi_shield_clip P6
U 1 1 5D2A66C8
P 8375 1075
F 0 "P6" H 8503 1094 60  0000 L CNN
F 1 "~" H 8503 1041 60  0000 L CNN
F 2 "RF_Shielding:S1721-46R" H 8375 1075 60  0001 C CNN
F 3 "" H 8375 1075 60  0000 C CNN
F 4 "Harwin Inc." H 8375 1075 50  0001 C CNN "MFN"
F 5 "S1721-46R" H 8375 1075 50  0001 C CNN "MFP"
F 6 "952-1476-1-ND" H 8375 1075 50  0001 C CNN "S1PN"
F 7 "Digi-Key" H 8375 1075 50  0001 C CNN "S1PL"
F 8 "855-S1721-46R" H 8375 1075 50  0001 C CNN "S2PN"
F 9 "Mouser" H 8375 1075 50  0001 C CNN "S2PL"
F 10 "RFI SHIELD CLIP MINI TIN SMD" H 8375 1075 50  0001 C CNN "Description"
	1    8375 1075
	1    0    0    -1  
$EndComp
$Comp
L project:rfi_shield_clip P7
U 1 1 5D2AD0B7
P 6950 1575
F 0 "P7" H 7078 1594 60  0000 L CNN
F 1 "~" H 7078 1541 60  0000 L CNN
F 2 "RF_Shielding:S1721-46R" H 6950 1575 60  0001 C CNN
F 3 "" H 6950 1575 60  0000 C CNN
F 4 "Harwin Inc." H 6950 1575 50  0001 C CNN "MFN"
F 5 "S1721-46R" H 6950 1575 50  0001 C CNN "MFP"
F 6 "952-1476-1-ND" H 6950 1575 50  0001 C CNN "S1PN"
F 7 "Digi-Key" H 6950 1575 50  0001 C CNN "S1PL"
F 8 "855-S1721-46R" H 6950 1575 50  0001 C CNN "S2PN"
F 9 "Mouser" H 6950 1575 50  0001 C CNN "S2PL"
F 10 "RFI SHIELD CLIP MINI TIN SMD" H 6950 1575 50  0001 C CNN "Description"
	1    6950 1575
	1    0    0    -1  
$EndComp
$Comp
L project:rfi_shield_clip P8
U 1 1 5D2B3AAB
P 7425 1575
F 0 "P8" H 7553 1594 60  0000 L CNN
F 1 "~" H 7553 1541 60  0000 L CNN
F 2 "RF_Shielding:S1721-46R" H 7425 1575 60  0001 C CNN
F 3 "" H 7425 1575 60  0000 C CNN
F 4 "Harwin Inc." H 7425 1575 50  0001 C CNN "MFN"
F 5 "S1721-46R" H 7425 1575 50  0001 C CNN "MFP"
F 6 "952-1476-1-ND" H 7425 1575 50  0001 C CNN "S1PN"
F 7 "Digi-Key" H 7425 1575 50  0001 C CNN "S1PL"
F 8 "855-S1721-46R" H 7425 1575 50  0001 C CNN "S2PN"
F 9 "Mouser" H 7425 1575 50  0001 C CNN "S2PL"
F 10 "RFI SHIELD CLIP MINI TIN SMD" H 7425 1575 50  0001 C CNN "Description"
	1    7425 1575
	1    0    0    -1  
$EndComp
$Comp
L project:rfi_shield_clip P9
U 1 1 5D2BA4AE
P 7900 1575
F 0 "P9" H 8028 1594 60  0000 L CNN
F 1 "~" H 8028 1541 60  0000 L CNN
F 2 "RF_Shielding:S1721-46R" H 7900 1575 60  0001 C CNN
F 3 "" H 7900 1575 60  0000 C CNN
F 4 "Harwin Inc." H 7900 1575 50  0001 C CNN "MFN"
F 5 "S1721-46R" H 7900 1575 50  0001 C CNN "MFP"
F 6 "952-1476-1-ND" H 7900 1575 50  0001 C CNN "S1PN"
F 7 "Digi-Key" H 7900 1575 50  0001 C CNN "S1PL"
F 8 "855-S1721-46R" H 7900 1575 50  0001 C CNN "S2PN"
F 9 "Mouser" H 7900 1575 50  0001 C CNN "S2PL"
F 10 "RFI SHIELD CLIP MINI TIN SMD" H 7900 1575 50  0001 C CNN "Description"
	1    7900 1575
	1    0    0    -1  
$EndComp
$Comp
L project:rfi_shield_clip P10
U 1 1 5D2C0EA5
P 8375 1575
F 0 "P10" H 8503 1594 60  0000 L CNN
F 1 "~" H 8503 1541 60  0000 L CNN
F 2 "RF_Shielding:S1721-46R" H 8375 1575 60  0001 C CNN
F 3 "" H 8375 1575 60  0000 C CNN
F 4 "Harwin Inc." H 8375 1575 50  0001 C CNN "MFN"
F 5 "S1721-46R" H 8375 1575 50  0001 C CNN "MFP"
F 6 "952-1476-1-ND" H 8375 1575 50  0001 C CNN "S1PN"
F 7 "Digi-Key" H 8375 1575 50  0001 C CNN "S1PL"
F 8 "855-S1721-46R" H 8375 1575 50  0001 C CNN "S2PN"
F 9 "Mouser" H 8375 1575 50  0001 C CNN "S2PL"
F 10 "RFI SHIELD CLIP MINI TIN SMD" H 8375 1575 50  0001 C CNN "Description"
	1    8375 1575
	1    0    0    -1  
$EndComp
$Comp
L project:SMA_2 J1
U 1 1 5D2D0FFA
P 2600 3525
F 0 "J1" H 2750 3540 50  0000 C CNN
F 1 "RF" H 2915 3415 50  0001 C CNN
F 2 "SMA_Connectors:SMA_EDGE_4" H 2600 3525 60  0001 C CNN
F 3 "" H 2600 3525 60  0000 C CNN
F 4 "Molex" H 2600 3525 60  0001 C CNN "MFN"
F 5 "0732511150" H 2600 3525 60  0001 C CNN "MFP"
F 6 "S01-SJEDM-11BS05" H 2600 3525 60  0001 C CNN "S1PN"
F 7 "Superbat" H 2600 3525 60  0001 C CNN "S1PL"
F 8 "73251-1150" H 2600 3525 60  0001 C CNN "S2PN"
F 9 "TTI" H 2600 3525 60  0001 C CNN "S2PL"
F 10 "SMA ST PCB-JCK" H 2600 3525 60  0001 C CNN "Description"
F 11 "1:$1.20; 10:$1.08; 100:$0.98" H 2600 3525 50  0001 C CNN "kicost:RF_Supplier:pricing"
	1    2600 3525
	-1   0    0    -1  
$EndComp
$Comp
L project:SMA_2 J3
U 1 1 5D31B599
P 3975 1700
F 0 "J3" H 4125 1715 50  0000 C CNN
F 1 "LO" H 4290 1590 50  0001 C CNN
F 2 "SMA_Connectors:SMA_EDGE_4" H 3975 1700 60  0001 C CNN
F 3 "" H 3975 1700 60  0000 C CNN
F 4 "Molex" H 3975 1700 60  0001 C CNN "MFN"
F 5 "0732511150" H 3975 1700 60  0001 C CNN "MFP"
F 6 "S01-SJEDM-11BS05" H 3975 1700 60  0001 C CNN "S1PN"
F 7 "Superbat" H 3975 1700 60  0001 C CNN "S1PL"
F 8 "73251-1150" H 3975 1700 60  0001 C CNN "S2PN"
F 9 "TTI" H 3975 1700 60  0001 C CNN "S2PL"
F 10 "SMA ST PCB-JCK" H 3975 1700 60  0001 C CNN "Description"
F 11 "1:$1.20; 10:$1.08; 100:$0.98" H 3975 1700 50  0001 C CNN "kicost:RF_Supplier:pricing"
	1    3975 1700
	-1   0    0    -1  
$EndComp
$Comp
L project:SMA_2 J5
U 1 1 5D320BEE
P 10525 3025
F 0 "J5" H 10675 3040 50  0000 C CNN
F 1 "IF A" H 10840 2915 50  0001 C CNN
F 2 "SMA_Connectors:SMA_EDGE_4" H 10525 3025 60  0001 C CNN
F 3 "" H 10525 3025 60  0000 C CNN
F 4 "Molex" H 10525 3025 60  0001 C CNN "MFN"
F 5 "0732511150" H 10525 3025 60  0001 C CNN "MFP"
F 6 "S01-SJEDM-11BS05" H 10525 3025 60  0001 C CNN "S1PN"
F 7 "Superbat" H 10525 3025 60  0001 C CNN "S1PL"
F 8 "73251-1150" H 10525 3025 60  0001 C CNN "S2PN"
F 9 "TTI" H 10525 3025 60  0001 C CNN "S2PL"
F 10 "SMA ST PCB-JCK" H 10525 3025 60  0001 C CNN "Description"
F 11 "1:$1.20; 10:$1.08; 100:$0.98" H 10525 3025 50  0001 C CNN "kicost:RF_Supplier:pricing"
	1    10525 3025
	1    0    0    -1  
$EndComp
$Comp
L project:SMA_2 J7
U 1 1 5D33094A
P 10525 4325
F 0 "J7" H 10675 4340 50  0000 C CNN
F 1 "RF" H 10840 4215 50  0001 C CNN
F 2 "SMA_Connectors:SMA_EDGE_4" H 10525 4325 60  0001 C CNN
F 3 "" H 10525 4325 60  0000 C CNN
F 4 "Molex" H 10525 4325 60  0001 C CNN "MFN"
F 5 "0732511150" H 10525 4325 60  0001 C CNN "MFP"
F 6 "S01-SJEDM-11BS05" H 10525 4325 60  0001 C CNN "S1PN"
F 7 "Superbat" H 10525 4325 60  0001 C CNN "S1PL"
F 8 "73251-1150" H 10525 4325 60  0001 C CNN "S2PN"
F 9 "TTI" H 10525 4325 60  0001 C CNN "S2PL"
F 10 "SMA ST PCB-JCK" H 10525 4325 60  0001 C CNN "Description"
F 11 "1:$1.20; 10:$1.08; 100:$0.98" H 10525 4325 50  0001 C CNN "kicost:RF_Supplier:pricing"
	1    10525 4325
	1    0    0    -1  
$EndComp
Text Notes 2350 2800 0    50   ~ 0
NOTE\n\nC1 should be replaced with a 1nH inductor for\nlow input frequencies < 1 GHz.
$Comp
L device:R R5
U 1 1 5576AA0F
P 5350 5425
F 0 "R5" H 5475 5450 50  0000 C CNN
F 1 "10K" H 5475 5375 50  0000 C CNN
F 2 "Resistor_SMD:R_0402_1005Metric" V 5280 5425 30  0001 C CNN
F 3 "" H 5350 5425 30  0000 C CNN
F 4 "Yageo" H 5350 5425 50  0001 C CNN "MFN"
F 5 "RC0402FR-0710KL" H 5350 5425 50  0001 C CNN "MFP"
F 6 "603-RC0402FR-0710KL" H 5350 5425 50  0001 C CNN "S1PN"
F 7 "Mouser" H 5350 5425 50  0001 C CNN "S1PL"
F 8 "311-10.0KLRCT-ND" H 5350 5425 50  0001 C CNN "S2PN"
F 9 "Digi-Key" H 5350 5425 50  0001 C CNN "S2PL"
F 10 "10 kOhms ±1% 0.063W, 1/16W Chip Resistor" H 5350 5425 50  0001 C CNN "Description"
F 11 "0402 (1005 metric)" H 5350 5425 50  0001 C CNN "Package ID"
	1    5350 5425
	1    0    0    -1  
$EndComp
Wire Wire Line
	5750 4525 5750 5750
$Comp
L connector:Conn_01x02_Male P11
U 1 1 5DE08559
P 2450 5075
F 0 "P11" H 2556 5253 50  0000 C CNN
F 1 "Enable" H 2556 5162 50  0000 C CNN
F 2 "Connector_PinHeader_2.54mm:PinHeader_1x02_P2.54mm_Vertical" H 2450 5075 50  0001 C CNN
F 3 "" H 2450 5075 50  0001 C CNN
F 4 "Mintron" H 2450 5075 50  0001 C CNN "MFN"
F 5 "MTP125-1102S1" H 2450 5075 50  0001 C CNN "MFP"
F 6 "C358684" H 2450 5075 50  0001 C CNN "S1PN"
F 7 "LCSC" H 2450 5075 50  0001 C CNN "S1PL"
F 8 "Pin Header Male Pin 0.100\"(2.54mm) 2 pin" H 2450 5075 50  0001 C CNN "Description"
F 9 "Through Hole,P=2.54mm" H 2450 5075 50  0001 C CNN "Package ID"
F 10 "1:$0.01; 10:$0.01; 100:$0.01; 500:$0.008" H 2450 5075 50  0001 C CNN "kicost:LCSC:pricing"
F 11 "https://lcsc.com/product-detail/Pin-Header-Female-Header_MINTRON-MTP125-1102S1_C358684.html" H 2450 5075 50  0001 C CNN "kicost:LCSC:link"
	1    2450 5075
	1    0    0    -1  
$EndComp
Wire Wire Line
	2650 5075 5350 5075
Wire Wire Line
	5350 4375 5350 5075
Wire Wire Line
	5350 5275 5350 5075
Connection ~ 5350 5075
Wire Wire Line
	5350 5575 5350 5750
Connection ~ 5350 5750
Wire Wire Line
	5350 5750 5750 5750
$Comp
L power:GND #PWR0113
U 1 1 5DE22308
P 2900 5275
F 0 "#PWR0113" H 2900 5025 50  0001 C CNN
F 1 "GND" H 2900 5125 50  0000 C CNN
F 2 "" H 2900 5275 60  0000 C CNN
F 3 "" H 2900 5275 60  0000 C CNN
	1    2900 5275
	1    0    0    -1  
$EndComp
Wire Wire Line
	2650 5175 2900 5175
Wire Wire Line
	2900 5175 2900 5275
$Comp
L project:MABA-011082 T1
U 1 1 5F08C753
P 3700 3675
F 0 "T1" H 3700 3900 50  0000 C CNN
F 1 "MABA-011082" H 3700 4025 50  0000 C CNN
F 2 "RF_Transformers:SM-22" H 3850 3775 50  0001 C CNN
F 3 "" H 3600 4025 60  0000 C CNN
	1    3700 3675
	1    0    0    -1  
$EndComp
Wire Wire Line
	6850 4375 7250 4375
Wire Wire Line
	6850 2975 7250 2975
Wire Wire Line
	7250 3125 7250 2975
Connection ~ 7250 2975
Wire Wire Line
	7250 2975 7825 2975
Wire Wire Line
	7250 4225 7250 4375
Connection ~ 7250 4375
Wire Wire Line
	7250 4375 7825 4375
Text Notes 7925 4750 0    50   ~ 0
L4, L5 should be 0 ohm for\ndown-conversion to <100MHz.
Text Notes 3725 4425 0    50   ~ 0
L1 should be 0 ohm for \ndown-converter.
Wire Wire Line
	3400 3825 3200 3825
Wire Wire Line
	3200 3825 3200 3975
$Comp
L power:GND #PWR0114
U 1 1 5F017B03
P 3200 4125
F 0 "#PWR0114" H 3200 3875 50  0001 C CNN
F 1 "GND" H 3200 3975 50  0000 C CNN
F 2 "" H 3200 4125 60  0000 C CNN
F 3 "" H 3200 4125 60  0000 C CNN
	1    3200 4125
	1    0    0    -1  
$EndComp
Wire Wire Line
	2725 3525 3400 3525
Wire Wire Line
	10125 3025 10400 3025
Wire Wire Line
	10200 4325 10400 4325
Text Notes 4900 6550 0    50   ~ 0
C8 must have\nESR less than 5 ohms
Wire Wire Line
	3400 3975 3200 3975
Connection ~ 3200 3975
Wire Wire Line
	3200 3975 3200 4075
Wire Wire Line
	4000 3975 4075 3975
Wire Wire Line
	4075 3975 4075 4075
Wire Wire Line
	4075 4075 3200 4075
Connection ~ 3200 4075
Wire Wire Line
	3200 4075 3200 4125
$EndSCHEMATC
