(module MABA-CT4 (layer F.Cu) (tedit 5D01F4FF)
  (descr "SMD WIDEBAND TRANSFORMER")
  (tags "SMD WIDEBAND TRANSFORMER")
  (attr smd)
  (fp_text reference T2 (at 3.0226 0.0254 90) (layer F.SilkS)
    (effects (font (size 0.635 0.635) (thickness 0.1016)))
  )
  (fp_text value MABA-010129-CT4A40 (at 3.4036 0 90) (layer F.Fab) hide
    (effects (font (size 0.635 0.635) (thickness 0.1016)))
  )
  (fp_text user %R (at 0.06604 -0.0635) (layer F.Fab)
    (effects (font (size 0.635 0.635) (thickness 0.1016)))
  )
  (fp_circle (center -1.27 -0.4445) (end -1.143 -0.4445) (layer F.SilkS) (width 0.15))
  (fp_line (start 2.1336 -0.889) (end 2.1336 0.889) (layer F.SilkS) (width 0.15))
  (fp_line (start -1.651 -0.889) (end -1.651 0.889) (layer F.SilkS) (width 0.15))
  (fp_line (start -1.651 0.889) (end 2.1336 0.889) (layer F.SilkS) (width 0.15))
  (fp_line (start -1.651 -0.889) (end 2.1336 -0.889) (layer F.SilkS) (width 0.15))
  (fp_line (start 2.1336 -0.889) (end 2.1336 0.889) (layer F.Fab) (width 0.15))
  (fp_circle (center -1.27 -0.4445) (end -1.143 -0.4445) (layer F.Fab) (width 0.15))
  (fp_line (start -1.651 -0.889) (end -1.651 0.889) (layer F.Fab) (width 0.15))
  (fp_line (start -1.651 0.889) (end 2.1336 0.889) (layer F.Fab) (width 0.15))
  (fp_line (start -1.651 -0.889) (end 2.1336 -0.889) (layer F.Fab) (width 0.15))
  (fp_line (start -1.905 -3.302) (end 2.54 -3.302) (layer F.CrtYd) (width 0.05))
  (fp_line (start 2.54 -3.302) (end 2.54 3.302) (layer F.CrtYd) (width 0.05))
  (fp_line (start 2.54 3.302) (end -1.905 3.302) (layer F.CrtYd) (width 0.05))
  (fp_line (start -1.905 3.302) (end -1.905 -3.302) (layer F.CrtYd) (width 0.05))
  (pad 1 smd rect (at -1.27 -2.1082) (size 0.9144 1.905) (layers F.Cu F.Paste F.Mask))
  (pad 2 smd rect (at 0.254 -2.1082) (size 0.9144 1.905) (layers F.Cu F.Paste F.Mask))
  (pad 3 smd rect (at 1.778 -2.1082) (size 0.9144 1.905) (layers F.Cu F.Paste F.Mask))
  (pad 4 smd rect (at 1.778 2.1336) (size 0.9144 1.905) (layers F.Cu F.Paste F.Mask))
  (pad 5 smd rect (at -1.27 2.1336) (size 0.9144 1.905) (layers F.Cu F.Paste F.Mask))
  (model ${KIPRJMOD}/../KiCad/Modules/packages3d/FluxBalun.wrl
    (offset (xyz 0.2539999961853027 0 0))
    (scale (xyz 0.45 0.45 0.45))
    (rotate (xyz -90 0 -90))
  )
)
