(module via_35mil_20mil (layer F.Cu) (tedit 5B52F887)
  (fp_text reference REF** (at 0.0254 3.51282) (layer F.SilkS)
    (effects (font (size 1 1) (thickness 0.15)) hide)
  )
  (fp_text value via_35mil_20mil (at -0.04064 -3.51282) (layer F.Fab)
    (effects (font (size 1 1) (thickness 0.15)) hide)
  )
  (pad 1 thru_hole circle (at 0 0) (size 0.889 0.889) (drill 0.508) (layers *.Cu *.Mask))
)
