EESchema Schematic File Version 4
EELAYER 30 0
EELAYER END
$Descr A4 11693 8268
encoding utf-8
Sheet 1 1
Title "Antialias Filter"
Date "2021-06-23"
Rev "1.0"
Comp "Dyadic Pty Ltd"
Comment1 ""
Comment2 ""
Comment3 ""
Comment4 ""
$EndDescr
$Comp
L AntiAliasFilter-rescue:RLP-30-RF_Filter U1
U 1 1 60D40808
P 5875 3375
F 0 "U1" H 5875 3792 50  0000 C CNN
F 1 "RLP-30" H 5875 3701 50  0000 C CNN
F 2 "RF_Mini-Circuits:Mini-Circuits_GP1212_LandPatternPL-176" H 5875 2925 50  0001 C CNN
F 3 "https://www.minicircuits.com/pdfs/RLP-30+.pdf" H 5875 3475 50  0001 C CNN
	1    5875 3375
	1    0    0    -1  
$EndComp
$Comp
L AntiAliasFilter-rescue:Conn_Coaxial-Connector J2
U 1 1 60D41306
P 7200 3375
F 0 "J2" H 7300 3350 50  0000 L CNN
F 1 "RF Out" H 7300 3259 50  0000 L CNN
F 2 "MMCX_Connectors:mmcx_th" H 7200 3375 50  0001 C CNN
F 3 " ~" H 7200 3375 50  0001 C CNN
	1    7200 3375
	1    0    0    -1  
$EndComp
$Comp
L AntiAliasFilter-rescue:Conn_Coaxial-Connector J1
U 1 1 60D4206F
P 4550 3375
F 0 "J1" H 4478 3613 50  0000 C CNN
F 1 "RF In" H 4478 3522 50  0000 C CNN
F 2 "MMCX_Connectors:mmcx_th" H 4550 3375 50  0001 C CNN
F 3 " ~" H 4550 3375 50  0001 C CNN
	1    4550 3375
	-1   0    0    -1  
$EndComp
Wire Wire Line
	4750 3375 5475 3375
Wire Wire Line
	6275 3375 7000 3375
$Comp
L AntiAliasFilter-rescue:GND-power #PWR01
U 1 1 60D43110
P 4550 3575
F 0 "#PWR01" H 4550 3325 50  0001 C CNN
F 1 "GND" H 4555 3402 50  0000 C CNN
F 2 "" H 4550 3575 50  0001 C CNN
F 3 "" H 4550 3575 50  0001 C CNN
	1    4550 3575
	1    0    0    -1  
$EndComp
$Comp
L AntiAliasFilter-rescue:GND-power #PWR03
U 1 1 60D4316D
P 5675 3775
F 0 "#PWR03" H 5675 3525 50  0001 C CNN
F 1 "GND" H 5680 3602 50  0000 C CNN
F 2 "" H 5675 3775 50  0001 C CNN
F 3 "" H 5675 3775 50  0001 C CNN
	1    5675 3775
	1    0    0    -1  
$EndComp
$Comp
L AntiAliasFilter-rescue:GND-power #PWR02
U 1 1 60D43674
P 7200 3575
F 0 "#PWR02" H 7200 3325 50  0001 C CNN
F 1 "GND" H 7205 3402 50  0000 C CNN
F 2 "" H 7200 3575 50  0001 C CNN
F 3 "" H 7200 3575 50  0001 C CNN
	1    7200 3575
	1    0    0    -1  
$EndComp
$Comp
L AntiAliasFilter-rescue:GND-power #PWR04
U 1 1 60D43C8C
P 5675 4550
F 0 "#PWR04" H 5675 4300 50  0001 C CNN
F 1 "GND" H 5680 4377 50  0000 C CNN
F 2 "" H 5675 4550 50  0001 C CNN
F 3 "" H 5675 4550 50  0001 C CNN
	1    5675 4550
	1    0    0    -1  
$EndComp
$Comp
L AntiAliasFilter-rescue:PWR_FLAG-power #FLG01
U 1 1 60D444DA
P 5675 4550
F 0 "#FLG01" H 5675 4625 50  0001 C CNN
F 1 "PWR_FLAG" H 5675 4723 50  0000 C CNN
F 2 "" H 5675 4550 50  0001 C CNN
F 3 "~" H 5675 4550 50  0001 C CNN
	1    5675 4550
	1    0    0    -1  
$EndComp
$Comp
L project:rfi_shield_clip P1
U 1 1 60D45916
P 4525 2000
F 0 "P1" H 4653 2070 60  0000 L CNN
F 1 "rfi_shield_clip" H 4653 1964 60  0000 L CNN
F 2 "RF_Shielding:S1721-46R" H 4653 1911 60  0001 L CNN
F 3 "" H 4525 2000 60  0001 C CNN
	1    4525 2000
	1    0    0    -1  
$EndComp
$Comp
L AntiAliasFilter-rescue:GND-power #PWR05
U 1 1 60D45ED1
P 4525 2100
F 0 "#PWR05" H 4525 1850 50  0001 C CNN
F 1 "GND" H 4530 1927 50  0000 C CNN
F 2 "" H 4525 2100 50  0001 C CNN
F 3 "" H 4525 2100 50  0001 C CNN
	1    4525 2100
	1    0    0    -1  
$EndComp
$Comp
L project:rfi_shield_clip P2
U 1 1 60D46310
P 5500 2000
F 0 "P2" H 5628 2070 60  0000 L CNN
F 1 "rfi_shield_clip" H 5628 1964 60  0000 L CNN
F 2 "RF_Shielding:S1721-46R" H 5500 2000 60  0001 C CNN
F 3 "" H 5500 2000 60  0001 C CNN
	1    5500 2000
	1    0    0    -1  
$EndComp
$Comp
L AntiAliasFilter-rescue:GND-power #PWR06
U 1 1 60D4631A
P 5500 2100
F 0 "#PWR06" H 5500 1850 50  0001 C CNN
F 1 "GND" H 5505 1927 50  0000 C CNN
F 2 "" H 5500 2100 50  0001 C CNN
F 3 "" H 5500 2100 50  0001 C CNN
	1    5500 2100
	1    0    0    -1  
$EndComp
$EndSCHEMATC
