(module SM_SMA (layer F.Cu) (tedit 5B3D4EFA)
  (fp_text reference REF** (at -0.02794 6.30174) (layer F.SilkS)
    (effects (font (size 1 1) (thickness 0.15)))
  )
  (fp_text value SM_SMA (at 0 -6.09854) (layer F.Fab)
    (effects (font (size 1 1) (thickness 0.15)))
  )
  (pad 1 smd circle (at 0 0) (size 2.05 2.05) (layers F.Cu F.Paste F.Mask))
  (pad 2 smd roundrect (at -2.66192 2.66192) (size 2.44 2.44) (layers F.Cu F.Paste F.Mask)(roundrect_rratio 0.1))
  (pad 2 smd roundrect (at -2.66192 -2.66192) (size 2.44 2.44) (layers F.Cu F.Paste F.Mask)(roundrect_rratio 0.1))
  (pad 2 smd roundrect (at 2.66192 -2.66192) (size 2.44 2.44) (layers F.Cu F.Paste F.Mask)(roundrect_rratio 0.1))
  (pad 2 smd roundrect (at 2.66192 2.66192) (size 2.44 2.44) (layers F.Cu F.Paste F.Mask)(roundrect_rratio 0.1))
)
