EESchema Schematic File Version 4
EELAYER 30 0
EELAYER END
$Descr A3 16535 11693
encoding utf-8
Sheet 1 1
Title "Hammond 1455T220 Carrier Board"
Date "2022-02-07"
Rev "1.1"
Comp "Dyadic Pty Ltd"
Comment1 "2022"
Comment2 ""
Comment3 ""
Comment4 ""
$EndDescr
$Comp
L project:78M05 U1
U 1 1 5C578E22
P 5850 2950
F 0 "U1" H 5850 3287 60  0000 C CNN
F 1 "LM2940IMPX-10" H 5850 3181 60  0000 C CNN
F 2 "Package_TO_SOT_SMD:SOT-223-3_TabPin2" H 5850 2950 60  0001 C CNN
F 3 "" H 5850 2950 60  0000 C CNN
F 4 "Texas Instruments" H 5850 2950 50  0001 C CNN "MFN"
F 5 "LM2940IMPX-10/NOPB" H 5850 2950 50  0001 C CNN "MFP"
F 6 "926-LM2940IMPX10NOPB" H 5850 2950 50  0001 C CNN "S1PN"
F 7 "Mouser" H 5850 2950 50  0001 C CNN "S1PL"
F 8 "LM2940IMPX-10/NOPB" H 5850 2950 50  0001 C CNN "S2PN"
F 9 "Texas Instruments" H 5850 2950 50  0001 C CNN "S2PL"
F 10 "1-A, high-PSRR, low-dropout voltage regulator" H 5850 2950 50  0001 C CNN "Description"
F 11 "SOT-223-4" H 5850 2950 50  0001 C CNN "Package ID"
	1    5850 2950
	1    0    0    -1  
$EndComp
$Comp
L project:78M05 U3
U 1 1 5C578EE6
P 5875 4325
F 0 "U3" H 5875 4662 60  0000 C CNN
F 1 "LM2940IMPX-5.0" H 5875 4556 60  0000 C CNN
F 2 "Package_TO_SOT_SMD:SOT-223-3_TabPin2" H 5875 4325 60  0001 C CNN
F 3 "" H 5875 4325 60  0000 C CNN
F 4 "Texas Instruments" H 5875 4325 50  0001 C CNN "MFN"
F 5 "LM2940IMPX-5.0/NOPB" H 5875 4325 50  0001 C CNN "MFP"
F 6 "926-LM2940IMPX50NOPB" H 5875 4325 50  0001 C CNN "S1PN"
F 7 "Mouser" H 5875 4325 50  0001 C CNN "S1PL"
F 8 "LM2940IMPX-5.0/NOPB" H 5875 4325 50  0001 C CNN "S2PN"
F 9 "Texas Instruments" H 5875 4325 50  0001 C CNN "S2PL"
F 10 "1-A, high-PSRR, low-dropout voltage regulator" H 5875 4325 50  0001 C CNN "Description"
F 11 "SOT-223" H 5875 4325 50  0001 C CNN "Package ID"
	1    5875 4325
	1    0    0    -1  
$EndComp
$Comp
L project:78M05 U5
U 1 1 5C578FA4
P 5875 5650
F 0 "U5" H 5875 5987 60  0000 C CNN
F 1 "LM3940" H 5875 5881 60  0000 C CNN
F 2 "Package_TO_SOT_SMD:SOT-223-3_TabPin2" H 5875 5650 60  0001 C CNN
F 3 "" H 5875 5650 60  0000 C CNN
F 4 "Texas Instruments" H 5875 5650 50  0001 C CNN "MFN"
F 5 "LM3940IMP-3.3/NOPB" H 5875 5650 50  0001 C CNN "MFP"
F 6 "926-LM3940IMPX33NOPB" H 5875 5650 50  0001 C CNN "S1PN"
F 7 "Mouser" H 5875 5650 50  0001 C CNN "S1PL"
F 8 "LM3940IMP-3.3/NOPBCT-ND" H 5875 5650 50  0001 C CNN "S2PN"
F 9 "Digi-Key" H 5875 5650 50  0001 C CNN "S2PL"
F 10 "Linear Voltage Regulator IC Positive Fixed Output 1A SOT-223-4" H 5875 5650 50  0001 C CNN "Description"
F 11 "SOT-223" H 5875 5650 50  0001 C CNN "Package ID"
	1    5875 5650
	1    0    0    -1  
$EndComp
$Comp
L device:C C2
U 1 1 5C5790A9
P 5350 3150
F 0 "C2" H 5465 3196 50  0000 L CNN
F 1 "0.33u" H 5465 3105 50  0000 L CNN
F 2 "Capacitor_SMD:C_0805_2012Metric" H 5388 3000 50  0001 C CNN
F 3 "~" H 5350 3150 50  0001 C CNN
F 4 "KEMET" H 5350 3150 50  0001 C CNN "MFN"
F 5 "C0805C334K5RACTU " H 5350 3150 50  0001 C CNN "MFP"
F 6 "399-11172-1-ND" H 5350 3150 50  0001 C CNN "S1PN"
F 7 "Digi-Key" H 5350 3150 50  0001 C CNN "S1PL"
F 8 "C0805C334K5RACTU " H 5350 3150 50  0001 C CNN "S2PN"
F 9 "Arrow" H 5350 3150 50  0001 C CNN "S2PL"
F 10 "Cap Ceramic 0.33uF 50V X7R 10%" H 5350 3150 50  0001 C CNN "Description"
F 11 "0805" H 5350 3150 50  0001 C CNN "Package ID"
	1    5350 3150
	1    0    0    -1  
$EndComp
$Comp
L device:CP C4
U 1 1 5C579488
P 7225 3150
F 0 "C4" H 7343 3241 50  0000 L CNN
F 1 "22u" H 7343 3150 50  0000 L CNN
F 2 "Capacitor_Tantalum_SMD:CP_EIA-6032-28_Kemet-C" H 7263 3000 50  0001 C CNN
F 3 "~" H 7225 3150 50  0001 C CNN
F 4 "Kemet" H 7225 3150 50  0001 C CNN "MFN"
F 5 "T491C226K016AT" H 7225 3150 50  0001 C CNN "MFP"
F 6 "80-T491C226K016" H 7225 3150 50  0001 C CNN "S1PN"
F 7 "Mouser" H 7225 3150 50  0001 C CNN "S1PL"
F 8 "T491C226K016AT" H 7225 3150 50  0001 C CNN "S2PN"
F 9 "Arrow" H 7225 3150 50  0001 C CNN "S2PL"
F 10 "Tantalum Capacitors - Solid SMD 16V 22uF 2312 10% ESR=1.6ohms" H 7225 3150 50  0001 C CNN "Description"
F 11 "2312 (6032 metric)" H 7225 3150 50  0001 C CNN "Package ID"
F 12 "16V" H 7343 3059 50  0000 L CNN "Voltage"
	1    7225 3150
	1    0    0    -1  
$EndComp
$Comp
L device:C C1
U 1 1 5C57A0E8
P 4250 3150
F 0 "C1" H 4365 3196 50  0000 L CNN
F 1 "0.1u" H 4365 3105 50  0000 L CNN
F 2 "Capacitor_SMD:C_0805_2012Metric" H 4288 3000 50  0001 C CNN
F 3 "~" H 4250 3150 50  0001 C CNN
F 4 "Yageo" H 4250 3150 50  0001 C CNN "MFN"
F 5 "CC0805KRX7R9BB104 " H 4250 3150 50  0001 C CNN "MFP"
F 6 "311-1140-1-ND" H 4250 3150 50  0001 C CNN "S1PN"
F 7 "Digi-Key" H 4250 3150 50  0001 C CNN "S1PL"
F 8 " CC0805KRX7R9BB104 " H 4250 3150 50  0001 C CNN "S2PN"
F 9 "Arrow" H 4250 3150 50  0001 C CNN "S2PL"
F 10 "Cap Ceramic 0.1uF 50V X7R 10%" H 4250 3150 50  0001 C CNN "Description"
F 11 "0805" H 4250 3150 50  0001 C CNN "Package ID"
	1    4250 3150
	1    0    0    -1  
$EndComp
$Comp
L device:CP C11
U 1 1 5C57B41D
P 7225 4525
F 0 "C11" H 7343 4616 50  0000 L CNN
F 1 "22u" H 7343 4525 50  0000 L CNN
F 2 "Capacitor_Tantalum_SMD:CP_EIA-6032-28_Kemet-C" H 7263 4375 50  0001 C CNN
F 3 "~" H 7225 4525 50  0001 C CNN
F 4 "Kemet" H 7225 4525 50  0001 C CNN "MFN"
F 5 "T491C226K016AT" H 7225 4525 50  0001 C CNN "MFP"
F 6 "80-T491C226K016" H 7225 4525 50  0001 C CNN "S1PN"
F 7 "Mouser" H 7225 4525 50  0001 C CNN "S1PL"
F 8 "T491C226K016AT" H 7225 4525 50  0001 C CNN "S2PN"
F 9 "Arrow" H 7225 4525 50  0001 C CNN "S2PL"
F 10 "Tantalum Capacitors - Solid SMD 16V 22uF 2312 10% ESR=1.6ohms" H 7225 4525 50  0001 C CNN "Description"
F 11 "2312 (6032 metric)" H 7225 4525 50  0001 C CNN "Package ID"
F 12 "16V" H 7343 4434 50  0000 L CNN "Voltage"
	1    7225 4525
	1    0    0    -1  
$EndComp
Wire Wire Line
	6250 2900 6350 2900
Wire Wire Line
	7225 2900 7225 3000
Wire Wire Line
	6275 4275 6375 4275
Wire Wire Line
	7225 4275 7225 4375
Wire Wire Line
	6375 4375 6375 4275
Connection ~ 6375 4275
Wire Wire Line
	6350 3000 6350 2900
Connection ~ 6350 2900
Wire Wire Line
	5150 4275 5375 4275
Wire Wire Line
	5375 4375 5375 4275
Connection ~ 5375 4275
Wire Wire Line
	5375 4275 5475 4275
Wire Wire Line
	6275 5600 6375 5600
Wire Wire Line
	7225 5600 7225 5700
Wire Wire Line
	6375 5700 6375 5600
Connection ~ 6375 5600
Wire Wire Line
	6375 5600 7225 5600
Wire Wire Line
	5475 5600 5375 5600
Wire Wire Line
	5375 5700 5375 5600
Connection ~ 5375 5600
Wire Wire Line
	5375 5600 5150 5600
Wire Wire Line
	5150 2900 5350 2900
Wire Wire Line
	5350 3000 5350 2900
Connection ~ 5350 2900
Wire Wire Line
	5350 2900 5450 2900
Wire Wire Line
	4450 2900 4250 2900
Wire Wire Line
	4250 2900 4250 3000
$Comp
L Connector:Conn_Coaxial_Power J9
U 1 1 5C5838C1
P 3850 3100
F 0 "J9" H 3938 3096 50  0000 L CNN
F 1 "12-15VDC" H 3325 3025 50  0000 L CNN
F 2 "Connector_BarrelJack:BarrelJack_Horizontal" H 3850 3050 50  0001 C CNN
F 3 "~" H 3850 3050 50  0001 C CNN
F 4 "CUI" H 3850 3100 50  0001 C CNN "MFN"
F 5 "PJ-102AH" H 3850 3100 50  0001 C CNN "MFP"
F 6 "490-PJ-102AH" H 3850 3100 50  0001 C CNN "S1PN"
F 7 "Mouser" H 3850 3100 50  0001 C CNN "S1PL"
F 8 "CP-102AH-ND" H 3850 3100 50  0001 C CNN "S2PN"
F 9 "Digi-Key" H 3850 3100 50  0001 C CNN "S2PL"
F 10 "Power Barrel Connector Jack 2.00mm ID (0.079\"), 5.50mm OD (0.217\") Through Hole, Right Angle" H 3850 3100 50  0001 C CNN "Description"
	1    3850 3100
	1    0    0    -1  
$EndComp
Wire Wire Line
	3850 3000 3850 2900
Wire Wire Line
	3850 2900 4250 2900
Connection ~ 4250 2900
$Comp
L power:GND #PWR05
U 1 1 5C583EDF
P 3850 3300
F 0 "#PWR05" H 3850 3050 50  0001 C CNN
F 1 "GND" H 3855 3127 50  0000 C CNN
F 2 "" H 3850 3300 50  0001 C CNN
F 3 "" H 3850 3300 50  0001 C CNN
	1    3850 3300
	1    0    0    -1  
$EndComp
$Comp
L power:GND #PWR06
U 1 1 5C583F15
P 4250 3300
F 0 "#PWR06" H 4250 3050 50  0001 C CNN
F 1 "GND" H 4255 3127 50  0000 C CNN
F 2 "" H 4250 3300 50  0001 C CNN
F 3 "" H 4250 3300 50  0001 C CNN
	1    4250 3300
	1    0    0    -1  
$EndComp
$Comp
L power:GND #PWR07
U 1 1 5C583F44
P 5350 3300
F 0 "#PWR07" H 5350 3050 50  0001 C CNN
F 1 "GND" H 5355 3127 50  0000 C CNN
F 2 "" H 5350 3300 50  0001 C CNN
F 3 "" H 5350 3300 50  0001 C CNN
	1    5350 3300
	1    0    0    -1  
$EndComp
$Comp
L power:GND #PWR03
U 1 1 5C583F73
P 5850 3200
F 0 "#PWR03" H 5850 2950 50  0001 C CNN
F 1 "GND" H 5855 3027 50  0000 C CNN
F 2 "" H 5850 3200 50  0001 C CNN
F 3 "" H 5850 3200 50  0001 C CNN
	1    5850 3200
	1    0    0    -1  
$EndComp
$Comp
L power:GND #PWR08
U 1 1 5C583FA2
P 6350 3300
F 0 "#PWR08" H 6350 3050 50  0001 C CNN
F 1 "GND" H 6355 3127 50  0000 C CNN
F 2 "" H 6350 3300 50  0001 C CNN
F 3 "" H 6350 3300 50  0001 C CNN
	1    6350 3300
	1    0    0    -1  
$EndComp
$Comp
L power:GND #PWR09
U 1 1 5C5841DB
P 7225 3300
F 0 "#PWR09" H 7225 3050 50  0001 C CNN
F 1 "GND" H 7230 3127 50  0000 C CNN
F 2 "" H 7225 3300 50  0001 C CNN
F 3 "" H 7225 3300 50  0001 C CNN
	1    7225 3300
	1    0    0    -1  
$EndComp
$Comp
L power:GND #PWR01
U 1 1 5C584396
P 8525 3100
F 0 "#PWR01" H 8525 2850 50  0001 C CNN
F 1 "GND" H 8530 2927 50  0000 C CNN
F 2 "" H 8525 3100 50  0001 C CNN
F 3 "" H 8525 3100 50  0001 C CNN
	1    8525 3100
	1    0    0    -1  
$EndComp
Wire Wire Line
	8425 2900 8525 2900
Wire Wire Line
	8525 2900 8525 3000
Wire Wire Line
	8425 3000 8525 3000
Connection ~ 8525 3000
Wire Wire Line
	8525 3000 8525 3100
Wire Wire Line
	8425 3100 8525 3100
Wire Wire Line
	7825 2900 7925 2900
Wire Wire Line
	7825 2900 7225 2900
Connection ~ 7825 2900
Connection ~ 7225 2900
Wire Wire Line
	7925 3000 7825 3000
Connection ~ 7825 3000
Wire Wire Line
	7825 3000 7825 2900
Wire Wire Line
	7925 3100 7825 3100
Wire Wire Line
	7825 3100 7825 3000
Wire Wire Line
	7925 4275 7825 4275
Connection ~ 7225 4275
Connection ~ 7825 4275
Wire Wire Line
	7825 4275 7225 4275
Wire Wire Line
	7925 4375 7825 4375
Connection ~ 7825 4375
Wire Wire Line
	7825 4375 7825 4275
Wire Wire Line
	7925 4475 7825 4475
Wire Wire Line
	7825 4475 7825 4375
$Comp
L power:GND #PWR014
U 1 1 5C58B524
P 8525 4475
F 0 "#PWR014" H 8525 4225 50  0001 C CNN
F 1 "GND" H 8530 4302 50  0000 C CNN
F 2 "" H 8525 4475 50  0001 C CNN
F 3 "" H 8525 4475 50  0001 C CNN
	1    8525 4475
	1    0    0    -1  
$EndComp
Wire Wire Line
	8425 4275 8525 4275
Wire Wire Line
	8525 4275 8525 4375
Wire Wire Line
	8425 4375 8525 4375
Connection ~ 8525 4375
Wire Wire Line
	8525 4375 8525 4475
Wire Wire Line
	8425 4475 8525 4475
$Comp
L power:GND #PWR020
U 1 1 5C58FD34
P 7225 4675
F 0 "#PWR020" H 7225 4425 50  0001 C CNN
F 1 "GND" H 7230 4502 50  0000 C CNN
F 2 "" H 7225 4675 50  0001 C CNN
F 3 "" H 7225 4675 50  0001 C CNN
	1    7225 4675
	1    0    0    -1  
$EndComp
$Comp
L power:GND #PWR019
U 1 1 5C58FD63
P 6375 4675
F 0 "#PWR019" H 6375 4425 50  0001 C CNN
F 1 "GND" H 6380 4502 50  0000 C CNN
F 2 "" H 6375 4675 50  0001 C CNN
F 3 "" H 6375 4675 50  0001 C CNN
	1    6375 4675
	1    0    0    -1  
$EndComp
$Comp
L power:GND #PWR016
U 1 1 5C58FD92
P 5875 4575
F 0 "#PWR016" H 5875 4325 50  0001 C CNN
F 1 "GND" H 5880 4402 50  0000 C CNN
F 2 "" H 5875 4575 50  0001 C CNN
F 3 "" H 5875 4575 50  0001 C CNN
	1    5875 4575
	1    0    0    -1  
$EndComp
$Comp
L power:GND #PWR018
U 1 1 5C58FE3F
P 5375 4675
F 0 "#PWR018" H 5375 4425 50  0001 C CNN
F 1 "GND" H 5380 4502 50  0000 C CNN
F 2 "" H 5375 4675 50  0001 C CNN
F 3 "" H 5375 4675 50  0001 C CNN
	1    5375 4675
	1    0    0    -1  
$EndComp
$Comp
L power:GND #PWR028
U 1 1 5C58FE6E
P 5375 6000
F 0 "#PWR028" H 5375 5750 50  0001 C CNN
F 1 "GND" H 5380 5827 50  0000 C CNN
F 2 "" H 5375 6000 50  0001 C CNN
F 3 "" H 5375 6000 50  0001 C CNN
	1    5375 6000
	1    0    0    -1  
$EndComp
$Comp
L power:GND #PWR026
U 1 1 5C58FE9D
P 5875 5900
F 0 "#PWR026" H 5875 5650 50  0001 C CNN
F 1 "GND" H 5880 5727 50  0000 C CNN
F 2 "" H 5875 5900 50  0001 C CNN
F 3 "" H 5875 5900 50  0001 C CNN
	1    5875 5900
	1    0    0    -1  
$EndComp
$Comp
L power:GND #PWR029
U 1 1 5C58FECC
P 6375 6000
F 0 "#PWR029" H 6375 5750 50  0001 C CNN
F 1 "GND" H 6380 5827 50  0000 C CNN
F 2 "" H 6375 6000 50  0001 C CNN
F 3 "" H 6375 6000 50  0001 C CNN
	1    6375 6000
	1    0    0    -1  
$EndComp
$Comp
L power:GND #PWR030
U 1 1 5C58FEFB
P 7225 6000
F 0 "#PWR030" H 7225 5750 50  0001 C CNN
F 1 "GND" H 7230 5827 50  0000 C CNN
F 2 "" H 7225 6000 50  0001 C CNN
F 3 "" H 7225 6000 50  0001 C CNN
	1    7225 6000
	1    0    0    -1  
$EndComp
Wire Wire Line
	8425 5600 8525 5600
Wire Wire Line
	8525 5600 8525 5700
Wire Wire Line
	7925 5600 7825 5600
Connection ~ 7225 5600
Connection ~ 7825 5600
Wire Wire Line
	7825 5600 7225 5600
Wire Wire Line
	7925 5700 7825 5700
Connection ~ 7825 5700
Wire Wire Line
	7825 5700 7825 5600
Wire Wire Line
	7925 5800 7825 5800
Wire Wire Line
	7825 5800 7825 5700
Wire Wire Line
	8425 5700 8525 5700
Connection ~ 8525 5700
Wire Wire Line
	8525 5700 8525 5800
Wire Wire Line
	8425 5800 8525 5800
$Comp
L power:GND #PWR024
U 1 1 5C59C027
P 8525 5800
F 0 "#PWR024" H 8525 5550 50  0001 C CNN
F 1 "GND" H 8530 5627 50  0000 C CNN
F 2 "" H 8525 5800 50  0001 C CNN
F 3 "" H 8525 5800 50  0001 C CNN
	1    8525 5800
	1    0    0    -1  
$EndComp
Wire Wire Line
	6350 2900 6800 2900
Wire Wire Line
	6375 4275 6800 4275
$Comp
L device:R R1
U 1 1 5C5BF1CB
P 5000 2900
F 0 "R1" V 4793 2900 50  0000 C CNN
F 1 "0" V 4884 2900 50  0000 C CNN
F 2 "Resistor_SMD:R_1206_3216Metric" V 4930 2900 50  0001 C CNN
F 3 "~" H 5000 2900 50  0001 C CNN
F 4 "Stackpole Electronics Inc" H 5000 2900 50  0001 C CNN "MFN"
F 5 "RMCF1206ZG0R00 " H 5000 2900 50  0001 C CNN "MFP"
F 6 "RMCF1206ZG0R00CT-ND " H 5000 2900 50  0001 C CNN "S1PN"
F 7 "Digi-Key" H 5000 2900 50  0001 C CNN "S1PL"
F 8 "RMCF1206ZG0R00" H 5000 2900 50  0001 C CNN "S2PN"
F 9 "Arrow" H 5000 2900 50  0001 C CNN "S2PL"
F 10 "Res Thick Film 0 Ohm" H 5000 2900 50  0001 C CNN "Description"
F 11 "1206" H 5000 2900 50  0001 C CNN "Package ID"
	1    5000 2900
	0    1    1    0   
$EndComp
Wire Wire Line
	4700 4275 4850 4275
Wire Wire Line
	4700 5600 4850 5600
$Comp
L Connector_Generic:Conn_02x03_Odd_Even J7
U 1 1 5C5D52C3
P 8125 3000
F 0 "J7" H 8175 3225 50  0000 C CNN
F 1 "~" H 8175 3226 50  0000 C CNN
F 2 "Connector_PinHeader_2.54mm:PinHeader_2x03_P2.54mm_Vertical" H 8125 3000 50  0001 C CNN
F 3 "~" H 8125 3000 50  0001 C CNN
F 4 "Samtec" H 8125 3000 50  0001 C CNN "MFN"
F 5 "HTSW-103-16-G-D" H 8125 3000 50  0001 C CNN "MFP"
F 6 "200-HTSW10316GD" H 8125 3000 50  0001 C CNN "S1PN"
F 7 "Mouser" H 8125 3000 50  0001 C CNN "S1PL"
F 8 "CONN HEADER VERT 6POS 2.54MM" H 8125 3000 50  0001 C CNN "Description"
F 9 "Generic 0.1\" pitch pin header with extended mating length" H 8125 3000 50  0001 C CNN "Notes"
F 10 "1" H 8125 3000 50  0001 C CNN "DNP"
	1    8125 3000
	1    0    0    -1  
$EndComp
Connection ~ 8525 3100
Connection ~ 8525 4475
Connection ~ 8525 5800
Wire Wire Line
	4650 2900 4850 2900
Wire Wire Line
	6800 2900 6800 3750
Wire Wire Line
	6800 3750 4700 3750
Wire Wire Line
	4700 3750 4700 4275
Connection ~ 6800 2900
Wire Wire Line
	6800 2900 7225 2900
Wire Wire Line
	6800 4275 6800 5100
Wire Wire Line
	6800 5100 4700 5100
Wire Wire Line
	4700 5100 4700 5600
Connection ~ 6800 4275
Wire Wire Line
	6800 4275 7225 4275
$Comp
L device:Ferrite_Bead_Small FB1
U 1 1 5CD65CC2
P 4550 2900
F 0 "FB1" V 4405 2900 50  0000 C CNN
F 1 "~" V 4404 2900 50  0000 C CNN
F 2 "Inductor_SMD:L_0805_2012Metric" V 4480 2900 50  0001 C CNN
F 3 "~" H 4550 2900 50  0001 C CNN
F 4 "Fair-Rite" H 4550 2900 50  0001 C CNN "MFN"
F 5 "2508056017Y2" H 4550 2900 50  0001 C CNN "MFP"
F 6 "623-2508056017Y2" H 4550 2900 50  0001 C CNN "S1PN"
F 7 "Mouser" H 4550 2900 50  0001 C CNN "S1PL"
F 8 "1838838" H 4550 2900 50  0001 C CNN "S2PN"
F 9 "Element14" H 4550 2900 50  0001 C CNN "S2PL"
F 10 "Ferrite Beads MultLyr Chip Bead 600ohm 0805 2000mA" H 4550 2900 50  0001 C CNN "Description"
F 11 "0805" H 4550 2900 50  0001 C CNN "Package ID"
	1    4550 2900
	0    1    1    0   
$EndComp
$Comp
L device:CP C17
U 1 1 5CD6AB75
P 7225 5850
F 0 "C17" H 7343 5941 50  0000 L CNN
F 1 "33u" H 7343 5850 50  0000 L CNN
F 2 "Capacitor_Tantalum_SMD:CP_EIA-6032-28_Kemet-C" H 7263 5700 50  0001 C CNN
F 3 "~" H 7225 5850 50  0001 C CNN
F 4 "KEMET" H 7225 5850 50  0001 C CNN "MFN"
F 5 "T491C336K016AT" H 7225 5850 50  0001 C CNN "MFP"
F 6 "80-T491C336K016" H 7225 5850 50  0001 C CNN "S1PN"
F 7 "Mouser" H 7225 5850 50  0001 C CNN "S1PL"
F 8 "T491C336K016AT" H 7225 5850 50  0001 C CNN "S2PN"
F 9 "Arrow" H 7225 5850 50  0001 C CNN "S2PL"
F 10 "Tantalum Capacitors - Solid SMD 16V 33uF 2312 10% ESR=1.2ohms" H 7225 5850 50  0001 C CNN "Description"
F 11 "2312 (6032 metric)" H 7225 5850 50  0001 C CNN "Package ID"
F 12 "16V" H 7343 5759 50  0000 L CNN "Voltage"
	1    7225 5850
	1    0    0    -1  
$EndComp
$Comp
L device:C C3
U 1 1 5CD6C87B
P 6350 3150
F 0 "C3" H 6465 3196 50  0000 L CNN
F 1 "0.1u" H 6465 3105 50  0000 L CNN
F 2 "Capacitor_SMD:C_0805_2012Metric" H 6388 3000 50  0001 C CNN
F 3 "~" H 6350 3150 50  0001 C CNN
F 4 "Yageo" H 6350 3150 50  0001 C CNN "MFN"
F 5 "CC0805KRX7R9BB104 " H 6350 3150 50  0001 C CNN "MFP"
F 6 "311-1140-1-ND" H 6350 3150 50  0001 C CNN "S1PN"
F 7 "Digi-Key" H 6350 3150 50  0001 C CNN "S1PL"
F 8 " CC0805KRX7R9BB104 " H 6350 3150 50  0001 C CNN "S2PN"
F 9 "Arrow" H 6350 3150 50  0001 C CNN "S2PL"
F 10 "Cap Ceramic 0.1uF 50V X7R 10%" H 6350 3150 50  0001 C CNN "Description"
F 11 "0805" H 6350 3150 50  0001 C CNN "Package ID"
	1    6350 3150
	1    0    0    -1  
$EndComp
$Comp
L device:C C10
U 1 1 5CD6C8E8
P 6375 4525
F 0 "C10" H 6490 4571 50  0000 L CNN
F 1 "0.1u" H 6490 4480 50  0000 L CNN
F 2 "Capacitor_SMD:C_0805_2012Metric" H 6413 4375 50  0001 C CNN
F 3 "~" H 6375 4525 50  0001 C CNN
F 4 "Yageo" H 6375 4525 50  0001 C CNN "MFN"
F 5 "CC0805KRX7R9BB104 " H 6375 4525 50  0001 C CNN "MFP"
F 6 "311-1140-1-ND" H 6375 4525 50  0001 C CNN "S1PN"
F 7 "Digi-Key" H 6375 4525 50  0001 C CNN "S1PL"
F 8 " CC0805KRX7R9BB104 " H 6375 4525 50  0001 C CNN "S2PN"
F 9 "Arrow" H 6375 4525 50  0001 C CNN "S2PL"
F 10 "Cap Ceramic 0.1uF 50V X7R 10%" H 6375 4525 50  0001 C CNN "Description"
F 11 "0805" H 6375 4525 50  0001 C CNN "Package ID"
	1    6375 4525
	1    0    0    -1  
$EndComp
$Comp
L device:C C16
U 1 1 5CD6C960
P 6375 5850
F 0 "C16" H 6490 5896 50  0000 L CNN
F 1 "0.1u" H 6490 5805 50  0000 L CNN
F 2 "Capacitor_SMD:C_0805_2012Metric" H 6413 5700 50  0001 C CNN
F 3 "~" H 6375 5850 50  0001 C CNN
F 4 "Yageo" H 6375 5850 50  0001 C CNN "MFN"
F 5 "CC0805KRX7R9BB104 " H 6375 5850 50  0001 C CNN "MFP"
F 6 "311-1140-1-ND" H 6375 5850 50  0001 C CNN "S1PN"
F 7 "Digi-Key" H 6375 5850 50  0001 C CNN "S1PL"
F 8 " CC0805KRX7R9BB104 " H 6375 5850 50  0001 C CNN "S2PN"
F 9 "Arrow" H 6375 5850 50  0001 C CNN "S2PL"
F 10 "Cap Ceramic 0.1uF 50V X7R 10%" H 6375 5850 50  0001 C CNN "Description"
F 11 "0805" H 6375 5850 50  0001 C CNN "Package ID"
	1    6375 5850
	1    0    0    -1  
$EndComp
$Comp
L device:C C9
U 1 1 5CD70D62
P 5375 4525
F 0 "C9" H 5490 4571 50  0000 L CNN
F 1 "0.33u" H 5490 4480 50  0000 L CNN
F 2 "Capacitor_SMD:C_0805_2012Metric" H 5413 4375 50  0001 C CNN
F 3 "~" H 5375 4525 50  0001 C CNN
F 4 "KEMET" H 5375 4525 50  0001 C CNN "MFN"
F 5 "C0805C334K5RACTU " H 5375 4525 50  0001 C CNN "MFP"
F 6 "399-11172-1-ND" H 5375 4525 50  0001 C CNN "S1PN"
F 7 "Digi-Key" H 5375 4525 50  0001 C CNN "S1PL"
F 8 "C0805C334K5RACTU " H 5375 4525 50  0001 C CNN "S2PN"
F 9 "Arrow" H 5375 4525 50  0001 C CNN "S2PL"
F 10 "Cap Ceramic 0.33uF 50V X7R 10%" H 5375 4525 50  0001 C CNN "Description"
F 11 "0805" H 5375 4525 50  0001 C CNN "Package ID"
	1    5375 4525
	1    0    0    -1  
$EndComp
$Comp
L device:C C15
U 1 1 5CD70DD1
P 5375 5850
F 0 "C15" H 5490 5896 50  0000 L CNN
F 1 "0.33u" H 5490 5805 50  0000 L CNN
F 2 "Capacitor_SMD:C_0805_2012Metric" H 5413 5700 50  0001 C CNN
F 3 "~" H 5375 5850 50  0001 C CNN
F 4 "KEMET" H 5375 5850 50  0001 C CNN "MFN"
F 5 "C0805C334K5RACTU " H 5375 5850 50  0001 C CNN "MFP"
F 6 "399-11172-1-ND" H 5375 5850 50  0001 C CNN "S1PN"
F 7 "Digi-Key" H 5375 5850 50  0001 C CNN "S1PL"
F 8 "C0805C334K5RACTU " H 5375 5850 50  0001 C CNN "S2PN"
F 9 "Arrow" H 5375 5850 50  0001 C CNN "S2PL"
F 10 "Cap Ceramic 0.33uF 50V X7R 10%" H 5375 5850 50  0001 C CNN "Description"
F 11 "0805" H 5375 5850 50  0001 C CNN "Package ID"
	1    5375 5850
	1    0    0    -1  
$EndComp
$Comp
L device:R R3
U 1 1 5CD73BF8
P 5000 4275
F 0 "R3" V 4793 4275 50  0000 C CNN
F 1 "0" V 4884 4275 50  0000 C CNN
F 2 "Resistor_SMD:R_1206_3216Metric" V 4930 4275 50  0001 C CNN
F 3 "~" H 5000 4275 50  0001 C CNN
F 4 "Stackpole Electronics Inc" H 5000 4275 50  0001 C CNN "MFN"
F 5 "RMCF1206ZG0R00 " H 5000 4275 50  0001 C CNN "MFP"
F 6 "RMCF1206ZG0R00CT-ND " H 5000 4275 50  0001 C CNN "S1PN"
F 7 "Digi-Key" H 5000 4275 50  0001 C CNN "S1PL"
F 8 "RMCF1206ZG0R00" H 5000 4275 50  0001 C CNN "S2PN"
F 9 "Arrow" H 5000 4275 50  0001 C CNN "S2PL"
F 10 "Res Thick Film 0 Ohm" H 5000 4275 50  0001 C CNN "Description"
F 11 "1206" H 5000 4275 50  0001 C CNN "Package ID"
	1    5000 4275
	0    1    1    0   
$EndComp
$Comp
L device:R R5
U 1 1 5CD73C69
P 5000 5600
F 0 "R5" V 4793 5600 50  0000 C CNN
F 1 "0" V 4884 5600 50  0000 C CNN
F 2 "Resistor_SMD:R_1206_3216Metric" V 4930 5600 50  0001 C CNN
F 3 "~" H 5000 5600 50  0001 C CNN
F 4 "Stackpole Electronics Inc" H 5000 5600 50  0001 C CNN "MFN"
F 5 "RMCF1206ZG0R00 " H 5000 5600 50  0001 C CNN "MFP"
F 6 "RMCF1206ZG0R00CT-ND " H 5000 5600 50  0001 C CNN "S1PN"
F 7 "Digi-Key" H 5000 5600 50  0001 C CNN "S1PL"
F 8 "RMCF1206ZG0R00" H 5000 5600 50  0001 C CNN "S2PN"
F 9 "Arrow" H 5000 5600 50  0001 C CNN "S2PL"
F 10 "Res Thick Film 0 Ohm" H 5000 5600 50  0001 C CNN "Description"
F 11 "1206" H 5000 5600 50  0001 C CNN "Package ID"
	1    5000 5600
	0    1    1    0   
$EndComp
$Comp
L Connector_Generic:Conn_02x03_Odd_Even J10
U 1 1 5D1A79ED
P 8125 4375
F 0 "J10" H 8175 4600 50  0000 C CNN
F 1 "~" H 8175 4601 50  0000 C CNN
F 2 "Connector_PinHeader_2.54mm:PinHeader_2x03_P2.54mm_Vertical" H 8125 4375 50  0001 C CNN
F 3 "~" H 8125 4375 50  0001 C CNN
F 4 "Samtec" H 8125 4375 50  0001 C CNN "MFN"
F 5 "HTSW-103-16-G-D" H 8125 4375 50  0001 C CNN "MFP"
F 6 "200-HTSW10316GD" H 8125 4375 50  0001 C CNN "S1PN"
F 7 "Mouser" H 8125 4375 50  0001 C CNN "S1PL"
F 8 "CONN HEADER VERT 6POS 2.54MM" H 8125 4375 50  0001 C CNN "Description"
F 9 "Generic 0.1\" pitch pin header with extended mating length" H 8125 4375 50  0001 C CNN "Notes"
F 10 "1" H 8125 4375 50  0001 C CNN "DNP"
	1    8125 4375
	1    0    0    -1  
$EndComp
$Comp
L Connector_Generic:Conn_02x03_Odd_Even J12
U 1 1 5D1A7A6A
P 8125 5700
F 0 "J12" H 8175 5925 50  0000 C CNN
F 1 "~" H 8175 5926 50  0000 C CNN
F 2 "Connector_PinHeader_2.54mm:PinHeader_2x03_P2.54mm_Vertical" H 8125 5700 50  0001 C CNN
F 3 "~" H 8125 5700 50  0001 C CNN
F 4 "Samtec" H 8125 5700 50  0001 C CNN "MFN"
F 5 "HTSW-103-16-G-D" H 8125 5700 50  0001 C CNN "MFP"
F 6 "200-HTSW10316GD" H 8125 5700 50  0001 C CNN "S1PN"
F 7 "Mouser" H 8125 5700 50  0001 C CNN "S1PL"
F 8 "CONN HEADER VERT 6POS 2.54MM" H 8125 5700 50  0001 C CNN "Description"
F 9 "Generic 0.1\" pitch pin header with extended mating length" H 8125 5700 50  0001 C CNN "Notes"
F 10 "1" H 8125 5700 50  0001 C CNN "DNP"
	1    8125 5700
	1    0    0    -1  
$EndComp
$Comp
L Connector_Generic:Conn_02x04_Odd_Even J1
U 1 1 5E07805E
P 4975 1475
F 0 "J1" H 5025 1700 50  0000 C CNN
F 1 "~" H 5025 1150 50  0000 C CNN
F 2 "Connector_PinHeader_2.54mm:PinHeader_2x04_P2.54mm_Vertical" H 4975 1475 50  0001 C CNN
F 3 "~" H 4975 1475 50  0001 C CNN
F 4 "Samtec" H 4975 1475 50  0001 C CNN "MFN"
F 5 "TSW-104-16-G-D" H 4975 1475 50  0001 C CNN "MFP"
F 6 "200-TSW10416GD" H 4975 1475 50  0001 C CNN "S1PN"
F 7 "Mouser" H 4975 1475 50  0001 C CNN "S1PL"
F 8 "CONN HEADER VERT 8POS 2.54MM" H 4975 1475 50  0001 C CNN "Description"
F 9 "Generic 0.1\" pitch pin header with extended mating length" H 4975 1475 50  0001 C CNN "Notes"
	1    4975 1475
	1    0    0    -1  
$EndComp
$Comp
L Connector_Generic:Conn_02x04_Odd_Even J2
U 1 1 5E0780E8
P 6275 1475
F 0 "J2" H 6325 1700 50  0000 C CNN
F 1 "~" H 6325 1150 50  0000 C CNN
F 2 "Connector_PinHeader_2.54mm:PinHeader_2x04_P2.54mm_Vertical" H 6275 1475 50  0001 C CNN
F 3 "~" H 6275 1475 50  0001 C CNN
F 4 "Samtec" H 6275 1475 50  0001 C CNN "MFN"
F 5 "TSW-104-16-G-D" H 6275 1475 50  0001 C CNN "MFP"
F 6 "200-TSW10416GD" H 6275 1475 50  0001 C CNN "S1PN"
F 7 "Mouser" H 6275 1475 50  0001 C CNN "S1PL"
F 8 "CONN HEADER VERT 8POS 2.54MM" H 6275 1475 50  0001 C CNN "Description"
F 9 "Generic 0.1\" pitch pin header with extended mating length" H 6275 1475 50  0001 C CNN "Notes"
	1    6275 1475
	1    0    0    -1  
$EndComp
$Comp
L Connector_Generic:Conn_02x04_Odd_Even J3
U 1 1 5E0781A0
P 7650 1475
F 0 "J3" H 7700 1700 50  0000 C CNN
F 1 "~" H 7700 1150 50  0000 C CNN
F 2 "Connector_PinHeader_2.54mm:PinHeader_2x04_P2.54mm_Vertical" H 7650 1475 50  0001 C CNN
F 3 "~" H 7650 1475 50  0001 C CNN
F 4 "Samtec" H 7650 1475 50  0001 C CNN "MFN"
F 5 "TSW-104-16-G-D" H 7650 1475 50  0001 C CNN "MFP"
F 6 "200-TSW10416GD" H 7650 1475 50  0001 C CNN "S1PN"
F 7 "Mouser" H 7650 1475 50  0001 C CNN "S1PL"
F 8 "CONN HEADER VERT 8POS 2.54MM" H 7650 1475 50  0001 C CNN "Description"
F 9 "Generic 0.1\" pitch pin header with extended mating length" H 7650 1475 50  0001 C CNN "Notes"
	1    7650 1475
	1    0    0    -1  
$EndComp
Wire Wire Line
	4775 1375 4675 1375
Wire Wire Line
	4675 1375 4675 1475
Wire Wire Line
	4675 1675 4775 1675
Wire Wire Line
	4775 1575 4675 1575
Connection ~ 4675 1575
Wire Wire Line
	4675 1575 4675 1675
Wire Wire Line
	4775 1475 4675 1475
Connection ~ 4675 1475
Wire Wire Line
	4675 1475 4675 1575
Wire Wire Line
	5275 1375 5375 1375
Wire Wire Line
	5375 1375 5375 1475
Wire Wire Line
	5375 1675 5275 1675
Wire Wire Line
	5275 1575 5375 1575
Connection ~ 5375 1575
Wire Wire Line
	5375 1575 5375 1675
Wire Wire Line
	5275 1475 5375 1475
Connection ~ 5375 1475
Wire Wire Line
	5375 1475 5375 1575
Wire Wire Line
	6075 1375 5975 1375
Wire Wire Line
	5975 1375 5975 1475
Wire Wire Line
	5975 1675 6075 1675
Wire Wire Line
	6575 1375 6675 1375
Wire Wire Line
	6675 1375 6675 1475
Wire Wire Line
	6675 1675 6575 1675
Wire Wire Line
	6075 1475 5975 1475
Connection ~ 5975 1475
Wire Wire Line
	5975 1475 5975 1575
Wire Wire Line
	6075 1575 5975 1575
Connection ~ 5975 1575
Wire Wire Line
	5975 1575 5975 1675
Wire Wire Line
	6575 1475 6675 1475
Connection ~ 6675 1475
Wire Wire Line
	6675 1475 6675 1575
Wire Wire Line
	6575 1575 6675 1575
Connection ~ 6675 1575
Wire Wire Line
	6675 1575 6675 1675
Wire Wire Line
	7450 1375 7325 1375
Wire Wire Line
	7325 1375 7325 1475
Wire Wire Line
	7325 1675 7450 1675
Wire Wire Line
	7450 1575 7325 1575
Connection ~ 7325 1575
Wire Wire Line
	7325 1575 7325 1675
Wire Wire Line
	7450 1475 7325 1475
Connection ~ 7325 1475
Wire Wire Line
	7325 1475 7325 1575
Wire Wire Line
	7950 1375 8075 1375
Wire Wire Line
	8075 1375 8075 1475
Wire Wire Line
	8075 1675 7950 1675
Wire Wire Line
	7950 1575 8075 1575
Connection ~ 8075 1575
Wire Wire Line
	8075 1575 8075 1675
Wire Wire Line
	7950 1475 8075 1475
Connection ~ 8075 1475
Wire Wire Line
	8075 1475 8075 1575
$Comp
L project:78M05 U6
U 1 1 5E0F9829
P 10650 5650
F 0 "U6" H 10650 5987 60  0000 C CNN
F 1 "LM3940" H 10650 5881 60  0000 C CNN
F 2 "Package_TO_SOT_SMD:SOT-223-3_TabPin2" H 10650 5650 60  0001 C CNN
F 3 "" H 10650 5650 60  0000 C CNN
F 4 "Texas Instruments" H 10650 5650 50  0001 C CNN "MFN"
F 5 "LM3940IMP-3.3/NOPB" H 10650 5650 50  0001 C CNN "MFP"
F 6 "926-LM3940IMPX33NOPB" H 10650 5650 50  0001 C CNN "S1PN"
F 7 "Mouser" H 10650 5650 50  0001 C CNN "S1PL"
F 8 "LM3940IMP-3.3/NOPBCT-ND" H 10650 5650 50  0001 C CNN "S2PN"
F 9 "Digi-Key" H 10650 5650 50  0001 C CNN "S2PL"
F 10 "Linear Voltage Regulator IC Positive Fixed Output 1A SOT-223-4" H 10650 5650 50  0001 C CNN "Description"
F 11 "SOT-223" H 10650 5650 50  0001 C CNN "Package ID"
	1    10650 5650
	1    0    0    -1  
$EndComp
$Comp
L device:C C6
U 1 1 5E0F9837
P 10125 3150
F 0 "C6" H 10240 3196 50  0000 L CNN
F 1 "0.33u" H 10240 3105 50  0000 L CNN
F 2 "Capacitor_SMD:C_0805_2012Metric" H 10163 3000 50  0001 C CNN
F 3 "~" H 10125 3150 50  0001 C CNN
F 4 "KEMET" H 10125 3150 50  0001 C CNN "MFN"
F 5 "C0805C334K5RACTU " H 10125 3150 50  0001 C CNN "MFP"
F 6 "399-11172-1-ND" H 10125 3150 50  0001 C CNN "S1PN"
F 7 "Digi-Key" H 10125 3150 50  0001 C CNN "S1PL"
F 8 "C0805C334K5RACTU " H 10125 3150 50  0001 C CNN "S2PN"
F 9 "Arrow" H 10125 3150 50  0001 C CNN "S2PL"
F 10 "Cap Ceramic 0.33uF 50V X7R 10%" H 10125 3150 50  0001 C CNN "Description"
F 11 "0805" H 10125 3150 50  0001 C CNN "Package ID"
	1    10125 3150
	1    0    0    -1  
$EndComp
$Comp
L device:CP C8
U 1 1 5E0F9846
P 12000 3150
F 0 "C8" H 12118 3241 50  0000 L CNN
F 1 "22u" H 12118 3150 50  0000 L CNN
F 2 "Capacitor_Tantalum_SMD:CP_EIA-6032-28_Kemet-C" H 12038 3000 50  0001 C CNN
F 3 "~" H 12000 3150 50  0001 C CNN
F 4 "Kemet" H 12000 3150 50  0001 C CNN "MFN"
F 5 "T491C226K016AT " H 12000 3150 50  0001 C CNN "MFP"
F 6 "80-T491C226K016" H 12000 3150 50  0001 C CNN "S1PN"
F 7 "Mouser" H 12000 3150 50  0001 C CNN "S1PL"
F 8 "T491C226K016AT" H 12000 3150 50  0001 C CNN "S2PN"
F 9 "Arrow" H 12000 3150 50  0001 C CNN "S2PL"
F 10 "Tantalum Capacitors - Solid SMD 16V 22uF 2312 10% ESR=1.6ohms" H 12000 3150 50  0001 C CNN "Description"
F 11 "2312 (6032 metric)" H 12000 3150 50  0001 C CNN "Package ID"
F 12 "16V" H 12118 3059 50  0000 L CNN "Voltage"
	1    12000 3150
	1    0    0    -1  
$EndComp
$Comp
L device:CP C14
U 1 1 5E0F9855
P 12000 4525
F 0 "C14" H 12118 4616 50  0000 L CNN
F 1 "22u" H 12118 4525 50  0000 L CNN
F 2 "Capacitor_Tantalum_SMD:CP_EIA-6032-28_Kemet-C" H 12038 4375 50  0001 C CNN
F 3 "~" H 12000 4525 50  0001 C CNN
F 4 "Kemet" H 12000 4525 50  0001 C CNN "MFN"
F 5 "T491C226K016AT" H 12000 4525 50  0001 C CNN "MFP"
F 6 "80-T491C226K016" H 12000 4525 50  0001 C CNN "S1PN"
F 7 "Mouser" H 12000 4525 50  0001 C CNN "S1PL"
F 8 "T491C226K016AT" H 12000 4525 50  0001 C CNN "S2PN"
F 9 "Arrow" H 12000 4525 50  0001 C CNN "S2PL"
F 10 "Tantalum Capacitors - Solid SMD 16V 22uF 2312 10% ESR=1.6ohms" H 12000 4525 50  0001 C CNN "Description"
F 11 "2312 (6032 metric)" H 12000 4525 50  0001 C CNN "Package ID"
F 12 "16V" H 12118 4434 50  0000 L CNN "Voltage"
	1    12000 4525
	1    0    0    -1  
$EndComp
Wire Wire Line
	11025 2900 11125 2900
Wire Wire Line
	12000 2900 12000 3000
Wire Wire Line
	11050 4275 11150 4275
Wire Wire Line
	12000 4275 12000 4375
Wire Wire Line
	11150 4375 11150 4275
Connection ~ 11150 4275
Wire Wire Line
	11125 3000 11125 2900
Connection ~ 11125 2900
Wire Wire Line
	9925 4275 10150 4275
Wire Wire Line
	10150 4375 10150 4275
Connection ~ 10150 4275
Wire Wire Line
	10150 4275 10250 4275
Wire Wire Line
	11050 5600 11150 5600
Wire Wire Line
	12000 5600 12000 5700
Wire Wire Line
	11150 5700 11150 5600
Connection ~ 11150 5600
Wire Wire Line
	11150 5600 12000 5600
Wire Wire Line
	10250 5600 10150 5600
Wire Wire Line
	10150 5700 10150 5600
Connection ~ 10150 5600
Wire Wire Line
	10150 5600 9925 5600
Wire Wire Line
	9925 2900 10125 2900
Wire Wire Line
	10125 3000 10125 2900
Connection ~ 10125 2900
Wire Wire Line
	10125 2900 10225 2900
$Comp
L power:GND #PWR011
U 1 1 5E0F9874
P 10125 3300
F 0 "#PWR011" H 10125 3050 50  0001 C CNN
F 1 "GND" H 10130 3127 50  0000 C CNN
F 2 "" H 10125 3300 50  0001 C CNN
F 3 "" H 10125 3300 50  0001 C CNN
	1    10125 3300
	1    0    0    -1  
$EndComp
$Comp
L power:GND #PWR04
U 1 1 5E0F987A
P 10625 3200
F 0 "#PWR04" H 10625 2950 50  0001 C CNN
F 1 "GND" H 10630 3027 50  0000 C CNN
F 2 "" H 10625 3200 50  0001 C CNN
F 3 "" H 10625 3200 50  0001 C CNN
	1    10625 3200
	1    0    0    -1  
$EndComp
$Comp
L power:GND #PWR012
U 1 1 5E0F9880
P 11125 3300
F 0 "#PWR012" H 11125 3050 50  0001 C CNN
F 1 "GND" H 11130 3127 50  0000 C CNN
F 2 "" H 11125 3300 50  0001 C CNN
F 3 "" H 11125 3300 50  0001 C CNN
	1    11125 3300
	1    0    0    -1  
$EndComp
$Comp
L power:GND #PWR013
U 1 1 5E0F9886
P 12000 3300
F 0 "#PWR013" H 12000 3050 50  0001 C CNN
F 1 "GND" H 12005 3127 50  0000 C CNN
F 2 "" H 12000 3300 50  0001 C CNN
F 3 "" H 12000 3300 50  0001 C CNN
	1    12000 3300
	1    0    0    -1  
$EndComp
$Comp
L power:GND #PWR02
U 1 1 5E0F988C
P 13300 3100
F 0 "#PWR02" H 13300 2850 50  0001 C CNN
F 1 "GND" H 13305 2927 50  0000 C CNN
F 2 "" H 13300 3100 50  0001 C CNN
F 3 "" H 13300 3100 50  0001 C CNN
	1    13300 3100
	1    0    0    -1  
$EndComp
Wire Wire Line
	13200 2900 13300 2900
Wire Wire Line
	13300 2900 13300 3000
Wire Wire Line
	13200 3000 13300 3000
Connection ~ 13300 3000
Wire Wire Line
	13300 3000 13300 3100
Wire Wire Line
	13200 3100 13300 3100
Wire Wire Line
	12600 2900 12700 2900
Wire Wire Line
	12600 2900 12000 2900
Connection ~ 12600 2900
Connection ~ 12000 2900
Wire Wire Line
	12700 3000 12600 3000
Connection ~ 12600 3000
Wire Wire Line
	12600 3000 12600 2900
Wire Wire Line
	12700 3100 12600 3100
Wire Wire Line
	12600 3100 12600 3000
Wire Wire Line
	12700 4275 12600 4275
Connection ~ 12000 4275
Connection ~ 12600 4275
Wire Wire Line
	12600 4275 12000 4275
Wire Wire Line
	12700 4375 12600 4375
Connection ~ 12600 4375
Wire Wire Line
	12600 4375 12600 4275
Wire Wire Line
	12700 4475 12600 4475
Wire Wire Line
	12600 4475 12600 4375
$Comp
L power:GND #PWR015
U 1 1 5E0F98AA
P 13300 4475
F 0 "#PWR015" H 13300 4225 50  0001 C CNN
F 1 "GND" H 13305 4302 50  0000 C CNN
F 2 "" H 13300 4475 50  0001 C CNN
F 3 "" H 13300 4475 50  0001 C CNN
	1    13300 4475
	1    0    0    -1  
$EndComp
Wire Wire Line
	13200 4275 13300 4275
Wire Wire Line
	13300 4275 13300 4375
Wire Wire Line
	13200 4375 13300 4375
Connection ~ 13300 4375
Wire Wire Line
	13300 4375 13300 4475
Wire Wire Line
	13200 4475 13300 4475
$Comp
L power:GND #PWR023
U 1 1 5E0F98B6
P 12000 4675
F 0 "#PWR023" H 12000 4425 50  0001 C CNN
F 1 "GND" H 12005 4502 50  0000 C CNN
F 2 "" H 12000 4675 50  0001 C CNN
F 3 "" H 12000 4675 50  0001 C CNN
	1    12000 4675
	1    0    0    -1  
$EndComp
$Comp
L power:GND #PWR022
U 1 1 5E0F98BC
P 11150 4675
F 0 "#PWR022" H 11150 4425 50  0001 C CNN
F 1 "GND" H 11155 4502 50  0000 C CNN
F 2 "" H 11150 4675 50  0001 C CNN
F 3 "" H 11150 4675 50  0001 C CNN
	1    11150 4675
	1    0    0    -1  
$EndComp
$Comp
L power:GND #PWR017
U 1 1 5E0F98C2
P 10650 4575
F 0 "#PWR017" H 10650 4325 50  0001 C CNN
F 1 "GND" H 10655 4402 50  0000 C CNN
F 2 "" H 10650 4575 50  0001 C CNN
F 3 "" H 10650 4575 50  0001 C CNN
	1    10650 4575
	1    0    0    -1  
$EndComp
$Comp
L power:GND #PWR021
U 1 1 5E0F98C8
P 10150 4675
F 0 "#PWR021" H 10150 4425 50  0001 C CNN
F 1 "GND" H 10155 4502 50  0000 C CNN
F 2 "" H 10150 4675 50  0001 C CNN
F 3 "" H 10150 4675 50  0001 C CNN
	1    10150 4675
	1    0    0    -1  
$EndComp
$Comp
L power:GND #PWR031
U 1 1 5E0F98CE
P 10150 6000
F 0 "#PWR031" H 10150 5750 50  0001 C CNN
F 1 "GND" H 10155 5827 50  0000 C CNN
F 2 "" H 10150 6000 50  0001 C CNN
F 3 "" H 10150 6000 50  0001 C CNN
	1    10150 6000
	1    0    0    -1  
$EndComp
$Comp
L power:GND #PWR027
U 1 1 5E0F98D4
P 10650 5900
F 0 "#PWR027" H 10650 5650 50  0001 C CNN
F 1 "GND" H 10655 5727 50  0000 C CNN
F 2 "" H 10650 5900 50  0001 C CNN
F 3 "" H 10650 5900 50  0001 C CNN
	1    10650 5900
	1    0    0    -1  
$EndComp
$Comp
L power:GND #PWR032
U 1 1 5E0F98DA
P 11150 6000
F 0 "#PWR032" H 11150 5750 50  0001 C CNN
F 1 "GND" H 11155 5827 50  0000 C CNN
F 2 "" H 11150 6000 50  0001 C CNN
F 3 "" H 11150 6000 50  0001 C CNN
	1    11150 6000
	1    0    0    -1  
$EndComp
$Comp
L power:GND #PWR033
U 1 1 5E0F98E0
P 12000 6000
F 0 "#PWR033" H 12000 5750 50  0001 C CNN
F 1 "GND" H 12005 5827 50  0000 C CNN
F 2 "" H 12000 6000 50  0001 C CNN
F 3 "" H 12000 6000 50  0001 C CNN
	1    12000 6000
	1    0    0    -1  
$EndComp
Wire Wire Line
	13200 5600 13300 5600
Wire Wire Line
	13300 5600 13300 5700
Wire Wire Line
	12700 5600 12600 5600
Connection ~ 12000 5600
Connection ~ 12600 5600
Wire Wire Line
	12600 5600 12000 5600
Wire Wire Line
	12700 5700 12600 5700
Connection ~ 12600 5700
Wire Wire Line
	12600 5700 12600 5600
Wire Wire Line
	12700 5800 12600 5800
Wire Wire Line
	12600 5800 12600 5700
Wire Wire Line
	13200 5700 13300 5700
Connection ~ 13300 5700
Wire Wire Line
	13300 5700 13300 5800
Wire Wire Line
	13200 5800 13300 5800
$Comp
L power:GND #PWR025
U 1 1 5E0F98F5
P 13300 5800
F 0 "#PWR025" H 13300 5550 50  0001 C CNN
F 1 "GND" H 13305 5627 50  0000 C CNN
F 2 "" H 13300 5800 50  0001 C CNN
F 3 "" H 13300 5800 50  0001 C CNN
	1    13300 5800
	1    0    0    -1  
$EndComp
Wire Wire Line
	11125 2900 11575 2900
Wire Wire Line
	11150 4275 11575 4275
$Comp
L device:R R2
U 1 1 5E0F9905
P 9775 2900
F 0 "R2" V 9568 2900 50  0000 C CNN
F 1 "0" V 9659 2900 50  0000 C CNN
F 2 "Resistor_SMD:R_1206_3216Metric" V 9705 2900 50  0001 C CNN
F 3 "~" H 9775 2900 50  0001 C CNN
F 4 "Stackpole Electronics Inc" H 9775 2900 50  0001 C CNN "MFN"
F 5 "RMCF1206ZG0R00 " H 9775 2900 50  0001 C CNN "MFP"
F 6 "RMCF1206ZG0R00CT-ND " H 9775 2900 50  0001 C CNN "S1PN"
F 7 "Digi-Key" H 9775 2900 50  0001 C CNN "S1PL"
F 8 "RMCF1206ZG0R00" H 9775 2900 50  0001 C CNN "S2PN"
F 9 "Arrow" H 9775 2900 50  0001 C CNN "S2PL"
F 10 "Res Thick Film 0 Ohm" H 9775 2900 50  0001 C CNN "Description"
F 11 "1206" H 9775 2900 50  0001 C CNN "Package ID"
	1    9775 2900
	0    1    1    0   
$EndComp
Wire Wire Line
	9475 4275 9625 4275
Wire Wire Line
	9475 5600 9625 5600
$Comp
L Connector_Generic:Conn_02x03_Odd_Even J8
U 1 1 5E0F9913
P 12900 3000
F 0 "J8" H 12950 3225 50  0000 C CNN
F 1 "~" H 12950 3226 50  0000 C CNN
F 2 "Connector_PinHeader_2.54mm:PinHeader_2x03_P2.54mm_Vertical" H 12900 3000 50  0001 C CNN
F 3 "~" H 12900 3000 50  0001 C CNN
F 4 "Samtec" H 12900 3000 50  0001 C CNN "MFN"
F 5 "HTSW-103-16-G-D" H 12900 3000 50  0001 C CNN "MFP"
F 6 "200-HTSW10316GD" H 12900 3000 50  0001 C CNN "S1PN"
F 7 "Mouser" H 12900 3000 50  0001 C CNN "S1PL"
F 8 "CONN HEADER VERT 6POS 2.54MM" H 12900 3000 50  0001 C CNN "Description"
F 9 "Generic 0.1\" pitch pin header with extended mating length" H 12900 3000 50  0001 C CNN "Notes"
F 10 "1" H 12900 3000 50  0001 C CNN "DNP"
	1    12900 3000
	1    0    0    -1  
$EndComp
Connection ~ 13300 3100
Connection ~ 13300 4475
Connection ~ 13300 5800
Wire Wire Line
	9500 2900 9625 2900
Wire Wire Line
	11575 2900 11575 3750
Wire Wire Line
	11575 3750 9475 3750
Wire Wire Line
	9475 3750 9475 4275
Connection ~ 11575 2900
Wire Wire Line
	11575 2900 12000 2900
Wire Wire Line
	11575 4275 11575 5100
Wire Wire Line
	11575 5100 9475 5100
Wire Wire Line
	9475 5100 9475 5600
Connection ~ 11575 4275
Wire Wire Line
	11575 4275 12000 4275
$Comp
L power:PWR_FLAG #FLG02
U 1 1 5E0F9927
P 13300 2900
F 0 "#FLG02" H 13300 2975 50  0001 C CNN
F 1 "PWR_FLAG" H 13300 3074 50  0000 C CNN
F 2 "" H 13300 2900 50  0001 C CNN
F 3 "~" H 13300 2900 50  0001 C CNN
	1    13300 2900
	1    0    0    -1  
$EndComp
Connection ~ 13300 2900
$Comp
L device:CP C20
U 1 1 5E0F9937
P 12000 5850
F 0 "C20" H 12118 5941 50  0000 L CNN
F 1 "33u" H 12118 5850 50  0000 L CNN
F 2 "Capacitor_Tantalum_SMD:CP_EIA-6032-28_Kemet-C" H 12038 5700 50  0001 C CNN
F 3 "~" H 12000 5850 50  0001 C CNN
F 4 "Kemet" H 12000 5850 50  0001 C CNN "MFN"
F 5 "T491C336K016AT" H 12000 5850 50  0001 C CNN "MFP"
F 6 "80-T491C336K016" H 12000 5850 50  0001 C CNN "S1PN"
F 7 "Mouser" H 12000 5850 50  0001 C CNN "S1PL"
F 8 "T491C336K016AT" H 12000 5850 50  0001 C CNN "S2PN"
F 9 "Arrow" H 12000 5850 50  0001 C CNN "S2PL"
F 10 "Tantalum Capacitors - Solid SMD 16V 33uF 2312 10% ESR=1.2ohms" H 12000 5850 50  0001 C CNN "Description"
F 11 "2312 (6032 metric)" H 12000 5850 50  0001 C CNN "Package ID"
F 12 "16V" H 12118 5759 50  0000 L CNN "Voltage"
	1    12000 5850
	1    0    0    -1  
$EndComp
$Comp
L device:C C7
U 1 1 5E0F9945
P 11125 3150
F 0 "C7" H 11240 3196 50  0000 L CNN
F 1 "0.1u" H 11240 3105 50  0000 L CNN
F 2 "Capacitor_SMD:C_0805_2012Metric" H 11163 3000 50  0001 C CNN
F 3 "~" H 11125 3150 50  0001 C CNN
F 4 "Yageo" H 11125 3150 50  0001 C CNN "MFN"
F 5 "CC0805KRX7R9BB104 " H 11125 3150 50  0001 C CNN "MFP"
F 6 "311-1140-1-ND" H 11125 3150 50  0001 C CNN "S1PN"
F 7 "Digi-Key" H 11125 3150 50  0001 C CNN "S1PL"
F 8 " CC0805KRX7R9BB104 " H 11125 3150 50  0001 C CNN "S2PN"
F 9 "Arrow" H 11125 3150 50  0001 C CNN "S2PL"
F 10 "Cap Ceramic 0.1uF 50V X7R 10%" H 11125 3150 50  0001 C CNN "Description"
F 11 "0805" H 11125 3150 50  0001 C CNN "Package ID"
	1    11125 3150
	1    0    0    -1  
$EndComp
$Comp
L device:C C13
U 1 1 5E0F9953
P 11150 4525
F 0 "C13" H 11265 4571 50  0000 L CNN
F 1 "0.1u" H 11265 4480 50  0000 L CNN
F 2 "Capacitor_SMD:C_0805_2012Metric" H 11188 4375 50  0001 C CNN
F 3 "~" H 11150 4525 50  0001 C CNN
F 4 "Yageo" H 11150 4525 50  0001 C CNN "MFN"
F 5 "CC0805KRX7R9BB104 " H 11150 4525 50  0001 C CNN "MFP"
F 6 "311-1140-1-ND" H 11150 4525 50  0001 C CNN "S1PN"
F 7 "Digi-Key" H 11150 4525 50  0001 C CNN "S1PL"
F 8 " CC0805KRX7R9BB104 " H 11150 4525 50  0001 C CNN "S2PN"
F 9 "Arrow" H 11150 4525 50  0001 C CNN "S2PL"
F 10 "Cap Ceramic 0.1uF 50V X7R 10%" H 11150 4525 50  0001 C CNN "Description"
F 11 "0805" H 11150 4525 50  0001 C CNN "Package ID"
	1    11150 4525
	1    0    0    -1  
$EndComp
$Comp
L device:C C19
U 1 1 5E0F9961
P 11150 5850
F 0 "C19" H 11265 5896 50  0000 L CNN
F 1 "0.1u" H 11265 5805 50  0000 L CNN
F 2 "Capacitor_SMD:C_0805_2012Metric" H 11188 5700 50  0001 C CNN
F 3 "~" H 11150 5850 50  0001 C CNN
F 4 "Yageo" H 11150 5850 50  0001 C CNN "MFN"
F 5 "CC0805KRX7R9BB104 " H 11150 5850 50  0001 C CNN "MFP"
F 6 "311-1140-1-ND" H 11150 5850 50  0001 C CNN "S1PN"
F 7 "Digi-Key" H 11150 5850 50  0001 C CNN "S1PL"
F 8 " CC0805KRX7R9BB104 " H 11150 5850 50  0001 C CNN "S2PN"
F 9 "Arrow" H 11150 5850 50  0001 C CNN "S2PL"
F 10 "Cap Ceramic 0.1uF 50V X7R 10%" H 11150 5850 50  0001 C CNN "Description"
F 11 "0805" H 11150 5850 50  0001 C CNN "Package ID"
	1    11150 5850
	1    0    0    -1  
$EndComp
$Comp
L device:C C12
U 1 1 5E0F996F
P 10150 4525
F 0 "C12" H 10265 4571 50  0000 L CNN
F 1 "0.33u" H 10265 4480 50  0000 L CNN
F 2 "Capacitor_SMD:C_0805_2012Metric" H 10188 4375 50  0001 C CNN
F 3 "~" H 10150 4525 50  0001 C CNN
F 4 "KEMET" H 10150 4525 50  0001 C CNN "MFN"
F 5 "C0805C334K5RACTU " H 10150 4525 50  0001 C CNN "MFP"
F 6 "399-11172-1-ND" H 10150 4525 50  0001 C CNN "S1PN"
F 7 "Digi-Key" H 10150 4525 50  0001 C CNN "S1PL"
F 8 "C0805C334K5RACTU " H 10150 4525 50  0001 C CNN "S2PN"
F 9 "Arrow" H 10150 4525 50  0001 C CNN "S2PL"
F 10 "Cap Ceramic 0.33uF 50V X7R 10%" H 10150 4525 50  0001 C CNN "Description"
F 11 "0805" H 10150 4525 50  0001 C CNN "Package ID"
	1    10150 4525
	1    0    0    -1  
$EndComp
$Comp
L device:C C18
U 1 1 5E0F997D
P 10150 5850
F 0 "C18" H 10265 5896 50  0000 L CNN
F 1 "0.33u" H 10265 5805 50  0000 L CNN
F 2 "Capacitor_SMD:C_0805_2012Metric" H 10188 5700 50  0001 C CNN
F 3 "~" H 10150 5850 50  0001 C CNN
F 4 "KEMET" H 10150 5850 50  0001 C CNN "MFN"
F 5 "C0805C334K5RACTU " H 10150 5850 50  0001 C CNN "MFP"
F 6 "399-11172-1-ND" H 10150 5850 50  0001 C CNN "S1PN"
F 7 "Digi-Key" H 10150 5850 50  0001 C CNN "S1PL"
F 8 "C0805C334K5RACTU " H 10150 5850 50  0001 C CNN "S2PN"
F 9 "Arrow" H 10150 5850 50  0001 C CNN "S2PL"
F 10 "Cap Ceramic 0.33uF 50V X7R 10%" H 10150 5850 50  0001 C CNN "Description"
F 11 "0805" H 10150 5850 50  0001 C CNN "Package ID"
	1    10150 5850
	1    0    0    -1  
$EndComp
$Comp
L device:R R4
U 1 1 5E0F998B
P 9775 4275
F 0 "R4" V 9568 4275 50  0000 C CNN
F 1 "0" V 9659 4275 50  0000 C CNN
F 2 "Resistor_SMD:R_1206_3216Metric" V 9705 4275 50  0001 C CNN
F 3 "~" H 9775 4275 50  0001 C CNN
F 4 "Stackpole Electronics Inc" H 9775 4275 50  0001 C CNN "MFN"
F 5 "RMCF1206ZG0R00 " H 9775 4275 50  0001 C CNN "MFP"
F 6 "RMCF1206ZG0R00CT-ND " H 9775 4275 50  0001 C CNN "S1PN"
F 7 "Digi-Key" H 9775 4275 50  0001 C CNN "S1PL"
F 8 "RMCF1206ZG0R00" H 9775 4275 50  0001 C CNN "S2PN"
F 9 "Arrow" H 9775 4275 50  0001 C CNN "S2PL"
F 10 "Res Thick Film 0 Ohm" H 9775 4275 50  0001 C CNN "Description"
F 11 "1206" H 9775 4275 50  0001 C CNN "Package ID"
	1    9775 4275
	0    1    1    0   
$EndComp
$Comp
L device:R R6
U 1 1 5E0F9999
P 9775 5600
F 0 "R6" V 9568 5600 50  0000 C CNN
F 1 "0" V 9659 5600 50  0000 C CNN
F 2 "Resistor_SMD:R_1206_3216Metric" V 9705 5600 50  0001 C CNN
F 3 "~" H 9775 5600 50  0001 C CNN
F 4 "Stackpole Electronics Inc" H 9775 5600 50  0001 C CNN "MFN"
F 5 "RMCF1206ZG0R00 " H 9775 5600 50  0001 C CNN "MFP"
F 6 "RMCF1206ZG0R00CT-ND " H 9775 5600 50  0001 C CNN "S1PN"
F 7 "Digi-Key" H 9775 5600 50  0001 C CNN "S1PL"
F 8 "RMCF1206ZG0R00" H 9775 5600 50  0001 C CNN "S2PN"
F 9 "Arrow" H 9775 5600 50  0001 C CNN "S2PL"
F 10 "Res Thick Film 0 Ohm" H 9775 5600 50  0001 C CNN "Description"
F 11 "1206" H 9775 5600 50  0001 C CNN "Package ID"
	1    9775 5600
	0    1    1    0   
$EndComp
$Comp
L Connector_Generic:Conn_02x03_Odd_Even J11
U 1 1 5E0F99A5
P 12900 4375
F 0 "J11" H 12950 4600 50  0000 C CNN
F 1 "~" H 12950 4601 50  0000 C CNN
F 2 "Connector_PinHeader_2.54mm:PinHeader_2x03_P2.54mm_Vertical" H 12900 4375 50  0001 C CNN
F 3 "~" H 12900 4375 50  0001 C CNN
F 4 "Samtec" H 12900 4375 50  0001 C CNN "MFN"
F 5 "HTSW-103-16-G-D" H 12900 4375 50  0001 C CNN "MFP"
F 6 "200-HTSW10316GD" H 12900 4375 50  0001 C CNN "S1PN"
F 7 "Mouser" H 12900 4375 50  0001 C CNN "S1PL"
F 8 "CONN HEADER VERT 6POS 2.54MM" H 12900 4375 50  0001 C CNN "Description"
F 9 "Generic 0.1\" pitch pin header with extended mating length" H 12900 4375 50  0001 C CNN "Notes"
F 10 "1" H 12900 4375 50  0001 C CNN "DNP"
	1    12900 4375
	1    0    0    -1  
$EndComp
$Comp
L Connector_Generic:Conn_02x03_Odd_Even J13
U 1 1 5E0F99B1
P 12900 5700
F 0 "J13" H 12950 5925 50  0000 C CNN
F 1 "~" H 12950 5926 50  0000 C CNN
F 2 "Connector_PinHeader_2.54mm:PinHeader_2x03_P2.54mm_Vertical" H 12900 5700 50  0001 C CNN
F 3 "~" H 12900 5700 50  0001 C CNN
F 4 "Samtec" H 12900 5700 50  0001 C CNN "MFN"
F 5 "HTSW-103-16-G-D" H 12900 5700 50  0001 C CNN "MFP"
F 6 "200-HTSW10316GD" H 12900 5700 50  0001 C CNN "S1PN"
F 7 "Mouser" H 12900 5700 50  0001 C CNN "S1PL"
F 8 "CONN HEADER VERT 6POS 2.54MM" H 12900 5700 50  0001 C CNN "Description"
F 9 "Generic 0.1\" pitch pin header with extended mating length" H 12900 5700 50  0001 C CNN "Notes"
F 10 "1" H 12900 5700 50  0001 C CNN "DNP"
	1    12900 5700
	1    0    0    -1  
$EndComp
$Comp
L device:Ferrite_Bead_Small FB2
U 1 1 5E108006
P 9400 2900
F 0 "FB2" V 9255 2900 50  0000 C CNN
F 1 "~" V 9254 2900 50  0000 C CNN
F 2 "Inductor_SMD:L_0805_2012Metric" V 9330 2900 50  0001 C CNN
F 3 "~" H 9400 2900 50  0001 C CNN
F 4 "Fair-Rite" H 9400 2900 50  0001 C CNN "MFN"
F 5 "2508056017Y2" H 9400 2900 50  0001 C CNN "MFP"
F 6 "623-2508056017Y2" H 9400 2900 50  0001 C CNN "S1PN"
F 7 "Mouser" H 9400 2900 50  0001 C CNN "S1PL"
F 8 "1838838" H 9400 2900 50  0001 C CNN "S2PN"
F 9 "Element14" H 9400 2900 50  0001 C CNN "S2PL"
F 10 "Ferrite Beads MultLyr Chip Bead 600ohm 0805 2000mA" H 9400 2900 50  0001 C CNN "Description"
F 11 "0805" H 9400 2900 50  0001 C CNN "Package ID"
	1    9400 2900
	0    1    1    0   
$EndComp
$Comp
L device:C C5
U 1 1 5E10F603
P 9150 3150
F 0 "C5" H 9265 3196 50  0000 L CNN
F 1 "0.1u" H 9265 3105 50  0000 L CNN
F 2 "Capacitor_SMD:C_0805_2012Metric" H 9188 3000 50  0001 C CNN
F 3 "~" H 9150 3150 50  0001 C CNN
F 4 "Yageo" H 9150 3150 50  0001 C CNN "MFN"
F 5 "CC0805KRX7R9BB104 " H 9150 3150 50  0001 C CNN "MFP"
F 6 "311-1140-1-ND" H 9150 3150 50  0001 C CNN "S1PN"
F 7 "Digi-Key" H 9150 3150 50  0001 C CNN "S1PL"
F 8 " CC0805KRX7R9BB104 " H 9150 3150 50  0001 C CNN "S2PN"
F 9 "Arrow" H 9150 3150 50  0001 C CNN "S2PL"
F 10 "Cap Ceramic 0.1uF 50V X7R 10%" H 9150 3150 50  0001 C CNN "Description"
F 11 "0805" H 9150 3150 50  0001 C CNN "Package ID"
	1    9150 3150
	1    0    0    -1  
$EndComp
Wire Wire Line
	9150 2900 9150 3000
$Comp
L power:GND #PWR010
U 1 1 5E10F60A
P 9150 3300
F 0 "#PWR010" H 9150 3050 50  0001 C CNN
F 1 "GND" H 9155 3127 50  0000 C CNN
F 2 "" H 9150 3300 50  0001 C CNN
F 3 "" H 9150 3300 50  0001 C CNN
	1    9150 3300
	1    0    0    -1  
$EndComp
Wire Wire Line
	9150 2900 9300 2900
$Comp
L Connector_Generic:Conn_02x04_Odd_Even J4
U 1 1 5E134D19
P 9650 1475
F 0 "J4" H 9700 1700 50  0000 C CNN
F 1 "~" H 9725 1150 50  0000 C CNN
F 2 "Connector_PinHeader_2.54mm:PinHeader_2x04_P2.54mm_Vertical" H 9650 1475 50  0001 C CNN
F 3 "~" H 9650 1475 50  0001 C CNN
F 4 "Samtec" H 9650 1475 50  0001 C CNN "MFN"
F 5 "TSW-104-16-G-D" H 9650 1475 50  0001 C CNN "MFP"
F 6 "200-TSW10416GD" H 9650 1475 50  0001 C CNN "S1PN"
F 7 "Mouser" H 9650 1475 50  0001 C CNN "S1PL"
F 8 "CONN HEADER VERT 8POS 2.54MM" H 9650 1475 50  0001 C CNN "Description"
F 9 "Generic 0.1\" pitch pin header with extended mating length" H 9650 1475 50  0001 C CNN "Notes"
	1    9650 1475
	1    0    0    -1  
$EndComp
$Comp
L Connector_Generic:Conn_02x04_Odd_Even J5
U 1 1 5E134D1F
P 10950 1475
F 0 "J5" H 11000 1700 50  0000 C CNN
F 1 "~" H 11000 1150 50  0000 C CNN
F 2 "Connector_PinHeader_2.54mm:PinHeader_2x04_P2.54mm_Vertical" H 10950 1475 50  0001 C CNN
F 3 "~" H 10950 1475 50  0001 C CNN
F 4 "Samtec" H 10950 1475 50  0001 C CNN "MFN"
F 5 "TSW-104-16-G-D" H 10950 1475 50  0001 C CNN "MFP"
F 6 "200-TSW10416GD" H 10950 1475 50  0001 C CNN "S1PN"
F 7 "Mouser" H 10950 1475 50  0001 C CNN "S1PL"
F 8 "CONN HEADER VERT 8POS 2.54MM" H 10950 1475 50  0001 C CNN "Description"
F 9 "Generic 0.1\" pitch pin header with extended mating length" H 10950 1475 50  0001 C CNN "Notes"
	1    10950 1475
	1    0    0    -1  
$EndComp
Wire Wire Line
	9450 1375 9350 1375
Wire Wire Line
	9350 1375 9350 1475
Wire Wire Line
	9350 1675 9450 1675
Wire Wire Line
	9450 1575 9350 1575
Connection ~ 9350 1575
Wire Wire Line
	9350 1575 9350 1675
Wire Wire Line
	9450 1475 9350 1475
Connection ~ 9350 1475
Wire Wire Line
	9350 1475 9350 1575
Wire Wire Line
	9950 1375 10050 1375
Wire Wire Line
	10050 1375 10050 1475
Wire Wire Line
	10050 1675 9950 1675
Wire Wire Line
	9950 1575 10050 1575
Connection ~ 10050 1575
Wire Wire Line
	10050 1575 10050 1675
Wire Wire Line
	9950 1475 10050 1475
Connection ~ 10050 1475
Wire Wire Line
	10050 1475 10050 1575
Wire Wire Line
	10750 1375 10650 1375
Wire Wire Line
	10650 1375 10650 1475
Wire Wire Line
	10650 1675 10750 1675
Wire Wire Line
	11250 1375 11350 1375
Wire Wire Line
	11350 1375 11350 1475
Wire Wire Line
	11350 1675 11250 1675
Wire Wire Line
	10750 1475 10650 1475
Connection ~ 10650 1475
Wire Wire Line
	10650 1475 10650 1575
Wire Wire Line
	10750 1575 10650 1575
Connection ~ 10650 1575
Wire Wire Line
	10650 1575 10650 1675
Wire Wire Line
	11250 1475 11350 1475
Connection ~ 11350 1475
Wire Wire Line
	11350 1475 11350 1575
Wire Wire Line
	11250 1575 11350 1575
Connection ~ 11350 1575
Wire Wire Line
	11350 1575 11350 1675
$Comp
L project:78M05 U7
U 1 1 5E2FA60E
P 5875 7000
F 0 "U7" H 5875 7337 60  0000 C CNN
F 1 "DNF" H 5875 7231 60  0000 C CNN
F 2 "Package_TO_SOT_SMD:SOT-223-3_TabPin2" H 5875 7000 60  0001 C CNN
F 3 "" H 5875 7000 60  0000 C CNN
F 4 "Texas Instruments" H 5875 7000 50  0001 C CNN "MFN"
F 5 "LM3940IMP-3.3/NOPB" H 5875 7000 50  0001 C CNN "MFP"
F 6 "926-LM3940IMPX33NOPB" H 5875 7000 50  0001 C CNN "S1PN"
F 7 "Mouser" H 5875 7000 50  0001 C CNN "S1PL"
F 8 "LM3940IMP-3.3/NOPBCT-ND" H 5875 7000 50  0001 C CNN "S2PN"
F 9 "Digi-Key" H 5875 7000 50  0001 C CNN "S2PL"
F 10 "LDO Regulator Pos 3.3V 0.5A 4-Pin(3+Tab)" H 5875 7000 50  0001 C CNN "Description"
F 11 "SOT-223" H 5875 7000 50  0001 C CNN "Package ID"
F 12 "1" H 5875 7000 50  0001 C CNN "DNP"
	1    5875 7000
	1    0    0    -1  
$EndComp
Wire Wire Line
	6275 6950 6375 6950
Wire Wire Line
	7225 6950 7225 7050
Wire Wire Line
	6375 7050 6375 6950
Connection ~ 6375 6950
Wire Wire Line
	6375 6950 7225 6950
Wire Wire Line
	5475 6950 5375 6950
Wire Wire Line
	5375 7050 5375 6950
Connection ~ 5375 6950
Wire Wire Line
	5375 6950 5100 6950
$Comp
L power:GND #PWR038
U 1 1 5E2FA61D
P 5375 7350
F 0 "#PWR038" H 5375 7100 50  0001 C CNN
F 1 "GND" H 5380 7177 50  0000 C CNN
F 2 "" H 5375 7350 50  0001 C CNN
F 3 "" H 5375 7350 50  0001 C CNN
	1    5375 7350
	1    0    0    -1  
$EndComp
$Comp
L power:GND #PWR036
U 1 1 5E2FA623
P 5875 7250
F 0 "#PWR036" H 5875 7000 50  0001 C CNN
F 1 "GND" H 5880 7077 50  0000 C CNN
F 2 "" H 5875 7250 50  0001 C CNN
F 3 "" H 5875 7250 50  0001 C CNN
	1    5875 7250
	1    0    0    -1  
$EndComp
$Comp
L power:GND #PWR039
U 1 1 5E2FA629
P 6375 7350
F 0 "#PWR039" H 6375 7100 50  0001 C CNN
F 1 "GND" H 6380 7177 50  0000 C CNN
F 2 "" H 6375 7350 50  0001 C CNN
F 3 "" H 6375 7350 50  0001 C CNN
	1    6375 7350
	1    0    0    -1  
$EndComp
$Comp
L power:GND #PWR040
U 1 1 5E2FA62F
P 7225 7350
F 0 "#PWR040" H 7225 7100 50  0001 C CNN
F 1 "GND" H 7230 7177 50  0000 C CNN
F 2 "" H 7225 7350 50  0001 C CNN
F 3 "" H 7225 7350 50  0001 C CNN
	1    7225 7350
	1    0    0    -1  
$EndComp
Wire Wire Line
	8425 6950 8525 6950
Wire Wire Line
	8525 6950 8525 7050
Wire Wire Line
	7925 6950 7825 6950
Connection ~ 7225 6950
Connection ~ 7825 6950
Wire Wire Line
	7825 6950 7225 6950
Wire Wire Line
	7925 7050 7825 7050
Connection ~ 7825 7050
Wire Wire Line
	7825 7050 7825 6950
Wire Wire Line
	7925 7150 7825 7150
Wire Wire Line
	7825 7150 7825 7050
Wire Wire Line
	8425 7050 8525 7050
Connection ~ 8525 7050
Wire Wire Line
	8525 7050 8525 7150
Wire Wire Line
	8425 7150 8525 7150
$Comp
L power:GND #PWR034
U 1 1 5E2FA644
P 8525 7150
F 0 "#PWR034" H 8525 6900 50  0001 C CNN
F 1 "GND" H 8530 6977 50  0000 C CNN
F 2 "" H 8525 7150 50  0001 C CNN
F 3 "" H 8525 7150 50  0001 C CNN
	1    8525 7150
	1    0    0    -1  
$EndComp
Connection ~ 8525 7150
$Comp
L device:CP C23
U 1 1 5E2FA654
P 7225 7200
F 0 "C23" H 7343 7291 50  0000 L CNN
F 1 "DNF" H 7343 7200 50  0000 L CNN
F 2 "Capacitor_Tantalum_SMD:CP_EIA-6032-28_Kemet-C" H 7263 7050 50  0001 C CNN
F 3 "~" H 7225 7200 50  0001 C CNN
F 4 "KEMET" H 7225 7200 50  0001 C CNN "MFN"
F 5 "T491C336K016AT" H 7225 7200 50  0001 C CNN "MFP"
F 6 "80-T491C336K016" H 7225 7200 50  0001 C CNN "S1PN"
F 7 "Mouser" H 7225 7200 50  0001 C CNN "S1PL"
F 8 "T491C336K016AT" H 7225 7200 50  0001 C CNN "S2PN"
F 9 "Arrow" H 7225 7200 50  0001 C CNN "S2PL"
F 10 "Tantalum Capacitors - Solid SMD 16V 33uF 2312 10% ESR=1.2ohms" H 7225 7200 50  0001 C CNN "Description"
F 11 "2312 (6032 metric)" H 7225 7200 50  0001 C CNN "Package ID"
F 12 "16V" H 7343 7109 50  0000 L CNN "Voltage"
F 13 "1" H 7225 7200 50  0001 C CNN "DNP"
	1    7225 7200
	1    0    0    -1  
$EndComp
$Comp
L device:C C22
U 1 1 5E2FA662
P 6375 7200
F 0 "C22" H 6490 7246 50  0000 L CNN
F 1 "DNF" H 6490 7155 50  0000 L CNN
F 2 "Capacitor_SMD:C_0805_2012Metric" H 6413 7050 50  0001 C CNN
F 3 "~" H 6375 7200 50  0001 C CNN
F 4 "Yageo" H 6375 7200 50  0001 C CNN "MFN"
F 5 "CC0805KRX7R9BB104 " H 6375 7200 50  0001 C CNN "MFP"
F 6 "311-1140-1-ND" H 6375 7200 50  0001 C CNN "S1PN"
F 7 "Digi-Key" H 6375 7200 50  0001 C CNN "S1PL"
F 8 " CC0805KRX7R9BB104 " H 6375 7200 50  0001 C CNN "S2PN"
F 9 "Arrow" H 6375 7200 50  0001 C CNN "S2PL"
F 10 "Cap Ceramic 0.1uF 50V X7R 10%" H 6375 7200 50  0001 C CNN "Description"
F 11 "0805" H 6375 7200 50  0001 C CNN "Package ID"
F 12 "1" H 6375 7200 50  0001 C CNN "DNP"
	1    6375 7200
	1    0    0    -1  
$EndComp
$Comp
L device:C C21
U 1 1 5E2FA670
P 5375 7200
F 0 "C21" H 5490 7246 50  0000 L CNN
F 1 "DNF" H 5490 7155 50  0000 L CNN
F 2 "Capacitor_SMD:C_0805_2012Metric" H 5413 7050 50  0001 C CNN
F 3 "~" H 5375 7200 50  0001 C CNN
F 4 "KEMET" H 5375 7200 50  0001 C CNN "MFN"
F 5 "C0805C334K5RACTU " H 5375 7200 50  0001 C CNN "MFP"
F 6 "399-11172-1-ND" H 5375 7200 50  0001 C CNN "S1PN"
F 7 "Digi-Key" H 5375 7200 50  0001 C CNN "S1PL"
F 8 "C0805C334K5RACTU " H 5375 7200 50  0001 C CNN "S2PN"
F 9 "Arrow" H 5375 7200 50  0001 C CNN "S2PL"
F 10 "Cap Ceramic 0.33uF 50V X7R 10%" H 5375 7200 50  0001 C CNN "Description"
F 11 "0805" H 5375 7200 50  0001 C CNN "Package ID"
F 12 "1" H 5375 7200 50  0001 C CNN "DNP"
	1    5375 7200
	1    0    0    -1  
$EndComp
$Comp
L Connector_Generic:Conn_02x03_Odd_Even J6
U 1 1 5E2FA67C
P 8125 7050
F 0 "J6" H 8175 7300 50  0000 C CNN
F 1 "DNF" H 8200 6825 50  0000 C CNN
F 2 "Connector_PinHeader_2.54mm:PinHeader_2x03_P2.54mm_Vertical" H 8125 7050 50  0001 C CNN
F 3 "~" H 8125 7050 50  0001 C CNN
F 4 "Samtec" H 8125 7050 50  0001 C CNN "MFN"
F 5 "HTSW-103-16-G-D" H 8125 7050 50  0001 C CNN "MFP"
F 6 "200-HTSW10316GD" H 8125 7050 50  0001 C CNN "S1PN"
F 7 "Mouser" H 8125 7050 50  0001 C CNN "S1PL"
F 8 "CONN HEADER VERT 6POS 2.54MM" H 8125 7050 50  0001 C CNN "Description"
F 9 "Generic 0.1\" pitch pin header with extended mating length" H 8125 7050 50  0001 C CNN "Notes"
F 10 "1" H 8125 7050 50  0001 C CNN "DNP"
F 11 "1" H 8125 7050 50  0001 C CNN "DNP"
	1    8125 7050
	1    0    0    -1  
$EndComp
$Comp
L project:78M05 U8
U 1 1 5E307559
P 10650 7000
F 0 "U8" H 10650 7337 60  0000 C CNN
F 1 "DNF" H 10650 7231 60  0000 C CNN
F 2 "Package_TO_SOT_SMD:SOT-223-3_TabPin2" H 10650 7000 60  0001 C CNN
F 3 "" H 10650 7000 60  0000 C CNN
F 4 "Texas Instruments" H 10650 7000 50  0001 C CNN "MFN"
F 5 "LM3940IMP-3.3/NOPB" H 10650 7000 50  0001 C CNN "MFP"
F 6 "926-LM3940IMPX33NOPB" H 10650 7000 50  0001 C CNN "S1PN"
F 7 "Mouser" H 10650 7000 50  0001 C CNN "S1PL"
F 8 "LM3940IMP-3.3/NOPBCT-ND" H 10650 7000 50  0001 C CNN "S2PN"
F 9 "Digi-Key" H 10650 7000 50  0001 C CNN "S2PL"
F 10 "Linear Voltage Regulator IC Positive Fixed Output 1A SOT-223-4" H 10650 7000 50  0001 C CNN "Description"
F 11 "SOT-223" H 10650 7000 50  0001 C CNN "Package ID"
F 12 "1" H 10650 7000 50  0001 C CNN "DNP"
	1    10650 7000
	1    0    0    -1  
$EndComp
Wire Wire Line
	11050 6950 11150 6950
Wire Wire Line
	12000 6950 12000 7050
Wire Wire Line
	11150 7050 11150 6950
Connection ~ 11150 6950
Wire Wire Line
	11150 6950 12000 6950
Wire Wire Line
	10250 6950 10150 6950
Wire Wire Line
	10150 7050 10150 6950
Connection ~ 10150 6950
Wire Wire Line
	10150 6950 9875 6950
$Comp
L power:GND #PWR041
U 1 1 5E307568
P 10150 7350
F 0 "#PWR041" H 10150 7100 50  0001 C CNN
F 1 "GND" H 10155 7177 50  0000 C CNN
F 2 "" H 10150 7350 50  0001 C CNN
F 3 "" H 10150 7350 50  0001 C CNN
	1    10150 7350
	1    0    0    -1  
$EndComp
$Comp
L power:GND #PWR037
U 1 1 5E30756E
P 10650 7250
F 0 "#PWR037" H 10650 7000 50  0001 C CNN
F 1 "GND" H 10655 7077 50  0000 C CNN
F 2 "" H 10650 7250 50  0001 C CNN
F 3 "" H 10650 7250 50  0001 C CNN
	1    10650 7250
	1    0    0    -1  
$EndComp
$Comp
L power:GND #PWR042
U 1 1 5E307574
P 11150 7350
F 0 "#PWR042" H 11150 7100 50  0001 C CNN
F 1 "GND" H 11155 7177 50  0000 C CNN
F 2 "" H 11150 7350 50  0001 C CNN
F 3 "" H 11150 7350 50  0001 C CNN
	1    11150 7350
	1    0    0    -1  
$EndComp
$Comp
L power:GND #PWR043
U 1 1 5E30757A
P 12000 7350
F 0 "#PWR043" H 12000 7100 50  0001 C CNN
F 1 "GND" H 12005 7177 50  0000 C CNN
F 2 "" H 12000 7350 50  0001 C CNN
F 3 "" H 12000 7350 50  0001 C CNN
	1    12000 7350
	1    0    0    -1  
$EndComp
Wire Wire Line
	13200 6950 13300 6950
Wire Wire Line
	13300 6950 13300 7050
Wire Wire Line
	12700 6950 12600 6950
Connection ~ 12000 6950
Connection ~ 12600 6950
Wire Wire Line
	12600 6950 12000 6950
Wire Wire Line
	12700 7050 12600 7050
Connection ~ 12600 7050
Wire Wire Line
	12600 7050 12600 6950
Wire Wire Line
	12700 7150 12600 7150
Wire Wire Line
	12600 7150 12600 7050
Wire Wire Line
	13200 7050 13300 7050
Connection ~ 13300 7050
Wire Wire Line
	13300 7050 13300 7150
Wire Wire Line
	13200 7150 13300 7150
$Comp
L power:GND #PWR035
U 1 1 5E30758F
P 13300 7150
F 0 "#PWR035" H 13300 6900 50  0001 C CNN
F 1 "GND" H 13305 6977 50  0000 C CNN
F 2 "" H 13300 7150 50  0001 C CNN
F 3 "" H 13300 7150 50  0001 C CNN
	1    13300 7150
	1    0    0    -1  
$EndComp
Connection ~ 13300 7150
$Comp
L device:CP C26
U 1 1 5E30759F
P 12000 7200
F 0 "C26" H 12118 7291 50  0000 L CNN
F 1 "DNF" H 12118 7200 50  0000 L CNN
F 2 "Capacitor_Tantalum_SMD:CP_EIA-6032-28_Kemet-C" H 12038 7050 50  0001 C CNN
F 3 "~" H 12000 7200 50  0001 C CNN
F 4 "Kemet" H 12000 7200 50  0001 C CNN "MFN"
F 5 "T491C336K016AT" H 12000 7200 50  0001 C CNN "MFP"
F 6 "80-T491C336K016" H 12000 7200 50  0001 C CNN "S1PN"
F 7 "Mouser" H 12000 7200 50  0001 C CNN "S1PL"
F 8 "T491C336K016AT" H 12000 7200 50  0001 C CNN "S2PN"
F 9 "Arrow" H 12000 7200 50  0001 C CNN "S2PL"
F 10 "Tantalum Capacitors - Solid SMD 16V 33uF 2312 10% ESR=1.2ohms" H 12000 7200 50  0001 C CNN "Description"
F 11 "2312 (6032 metric)" H 12000 7200 50  0001 C CNN "Package ID"
F 12 "16V" H 12118 7109 50  0000 L CNN "Voltage"
F 13 "1" H 12000 7200 50  0001 C CNN "DNP"
	1    12000 7200
	1    0    0    -1  
$EndComp
$Comp
L device:C C25
U 1 1 5E3075AD
P 11150 7200
F 0 "C25" H 11265 7246 50  0000 L CNN
F 1 "DNF" H 11265 7155 50  0000 L CNN
F 2 "Capacitor_SMD:C_0805_2012Metric" H 11188 7050 50  0001 C CNN
F 3 "~" H 11150 7200 50  0001 C CNN
F 4 "Yageo" H 11150 7200 50  0001 C CNN "MFN"
F 5 "CC0805KRX7R9BB104 " H 11150 7200 50  0001 C CNN "MFP"
F 6 "311-1140-1-ND" H 11150 7200 50  0001 C CNN "S1PN"
F 7 "Digi-Key" H 11150 7200 50  0001 C CNN "S1PL"
F 8 " CC0805KRX7R9BB104 " H 11150 7200 50  0001 C CNN "S2PN"
F 9 "Arrow" H 11150 7200 50  0001 C CNN "S2PL"
F 10 "Cap Ceramic 0.1uF 50V X7R 10%" H 11150 7200 50  0001 C CNN "Description"
F 11 "0805" H 11150 7200 50  0001 C CNN "Package ID"
F 12 "1" H 11150 7200 50  0001 C CNN "DNP"
	1    11150 7200
	1    0    0    -1  
$EndComp
$Comp
L device:C C24
U 1 1 5E3075BB
P 10150 7200
F 0 "C24" H 10265 7246 50  0000 L CNN
F 1 "DNF" H 10265 7155 50  0000 L CNN
F 2 "Capacitor_SMD:C_0805_2012Metric" H 10188 7050 50  0001 C CNN
F 3 "~" H 10150 7200 50  0001 C CNN
F 4 "KEMET" H 10150 7200 50  0001 C CNN "MFN"
F 5 "C0805C334K5RACTU " H 10150 7200 50  0001 C CNN "MFP"
F 6 "399-11172-1-ND" H 10150 7200 50  0001 C CNN "S1PN"
F 7 "Digi-Key" H 10150 7200 50  0001 C CNN "S1PL"
F 8 "C0805C334K5RACTU " H 10150 7200 50  0001 C CNN "S2PN"
F 9 "Arrow" H 10150 7200 50  0001 C CNN "S2PL"
F 10 "Cap Ceramic 0.33uF 50V X7R 10%" H 10150 7200 50  0001 C CNN "Description"
F 11 "0805" H 10150 7200 50  0001 C CNN "Package ID"
F 12 "1" H 10150 7200 50  0001 C CNN "DNP"
	1    10150 7200
	1    0    0    -1  
$EndComp
$Comp
L Connector_Generic:Conn_02x03_Odd_Even J14
U 1 1 5E3075C7
P 12900 7050
F 0 "J14" H 12950 7275 50  0000 C CNN
F 1 "DNF" H 12950 6825 50  0000 C CNN
F 2 "Connector_PinHeader_2.54mm:PinHeader_2x03_P2.54mm_Vertical" H 12900 7050 50  0001 C CNN
F 3 "~" H 12900 7050 50  0001 C CNN
F 4 "Samtec" H 12900 7050 50  0001 C CNN "MFN"
F 5 "HTSW-103-16-G-D" H 12900 7050 50  0001 C CNN "MFP"
F 6 "200-HTSW10316GD" H 12900 7050 50  0001 C CNN "S1PN"
F 7 "Mouser" H 12900 7050 50  0001 C CNN "S1PL"
F 8 "CONN HEADER VERT 6POS 2.54MM" H 12900 7050 50  0001 C CNN "Description"
F 9 "Generic 0.1\" pitch pin header with extended mating length" H 12900 7050 50  0001 C CNN "Notes"
	1    12900 7050
	1    0    0    -1  
$EndComp
$Comp
L Connector_Generic:Conn_01x02 J16
U 1 1 5E3166EE
P 4750 7050
F 0 "J16" H 4670 6817 50  0000 C CNN
F 1 "DNF" H 4650 6725 50  0000 C CNN
F 2 "Connector_PinHeader_2.54mm:PinHeader_1x02_P2.54mm_Vertical" H 4750 7050 50  0001 C CNN
F 3 "~" H 4750 7050 50  0001 C CNN
F 4 "Samtec" H 4750 7050 50  0001 C CNN "MFN"
F 5 "HTSW-101-16-L-D" H 4750 7050 50  0001 C CNN "MFP"
F 6 "200-HTSW10116LD" H 4750 7050 50  0001 C CNN "S1PN"
F 7 "Mouser" H 4750 7050 50  0001 C CNN "S1PL"
F 8 "CONN HEADER VERT 2POS 2.54MM" H 4750 7050 50  0001 C CNN "Description"
F 9 "Generic 0.1\" pitch pin header with extended mating length" H 4750 7050 50  0001 C CNN "Notes"
	1    4750 7050
	-1   0    0    1   
$EndComp
$Comp
L Connector_Generic:Conn_01x02 J17
U 1 1 5E31685D
P 9525 7050
F 0 "J17" H 9445 6817 50  0000 C CNN
F 1 "DNF" H 9450 6725 50  0000 C CNN
F 2 "Connector_PinHeader_2.54mm:PinHeader_1x02_P2.54mm_Vertical" H 9525 7050 50  0001 C CNN
F 3 "~" H 9525 7050 50  0001 C CNN
F 4 "Samtec" H 9525 7050 50  0001 C CNN "MFN"
F 5 "HTSW-101-16-L-D" H 9525 7050 50  0001 C CNN "MFP"
F 6 "200-HTSW10116LD" H 9525 7050 50  0001 C CNN "S1PN"
F 7 "Mouser" H 9525 7050 50  0001 C CNN "S1PL"
F 8 "CONN HEADER VERT 2POS 2.54MM" H 9525 7050 50  0001 C CNN "Description"
F 9 "Generic 0.1\" pitch pin header with extended mating length" H 9525 7050 50  0001 C CNN "Notes"
	1    9525 7050
	-1   0    0    1   
$EndComp
Wire Wire Line
	4950 7050 5100 7050
Wire Wire Line
	5100 7050 5100 6950
Connection ~ 5100 6950
Wire Wire Line
	5100 6950 4950 6950
Wire Wire Line
	9725 7050 9875 7050
Wire Wire Line
	9875 7050 9875 6950
Connection ~ 9875 6950
Wire Wire Line
	9875 6950 9725 6950
$Comp
L Connector_Generic:Conn_01x02 J15
U 1 1 5E353011
P 3850 2400
F 0 "J15" V 3770 2212 50  0000 R CNN
F 1 "~" V 3875 2125 50  0000 C CNN
F 2 "Connector_PinHeader_2.54mm:PinHeader_1x02_P2.54mm_Vertical" H 3850 2400 50  0001 C CNN
F 3 "~" H 3850 2400 50  0001 C CNN
F 4 "Samtec" H 3850 2400 50  0001 C CNN "MFN"
F 5 "HTSW-101-16-L-D" H 3850 2400 50  0001 C CNN "MFP"
F 6 "200-HTSW10116LD" H 3850 2400 50  0001 C CNN "S1PN"
F 7 "Mouser" H 3850 2400 50  0001 C CNN "S1PL"
F 8 "CONN HEADER VERT 2POS 2.54MM" H 3850 2400 50  0001 C CNN "Description"
F 9 "Generic 0.1\" pitch pin header with extended mating length" H 3850 2400 50  0001 C CNN "Notes"
	1    3850 2400
	0    -1   -1   0   
$EndComp
Wire Wire Line
	3850 2600 3850 2725
Connection ~ 3850 2900
Wire Wire Line
	3950 2600 3950 2725
Wire Wire Line
	3950 2725 3850 2725
Connection ~ 3850 2725
Wire Wire Line
	3850 2725 3850 2900
$Comp
L Connector_Generic:Conn_01x02 J18
U 1 1 5E3F3D44
P 9150 2400
F 0 "J18" V 9070 2212 50  0000 R CNN
F 1 "~" V 9175 2125 50  0000 C CNN
F 2 "Connector_PinHeader_2.54mm:PinHeader_1x02_P2.54mm_Vertical" H 9150 2400 50  0001 C CNN
F 3 "~" H 9150 2400 50  0001 C CNN
F 4 "Samtec" H 9150 2400 50  0001 C CNN "MFN"
F 5 "HTSW-101-16-L-D" H 9150 2400 50  0001 C CNN "MFP"
F 6 "200-HTSW10116LD" H 9150 2400 50  0001 C CNN "S1PN"
F 7 "Mouser" H 9150 2400 50  0001 C CNN "S1PL"
F 8 "CONN HEADER VERT 2POS 2.54MM" H 9150 2400 50  0001 C CNN "Description"
F 9 "Generic 0.1\" pitch pin header with extended mating length" H 9150 2400 50  0001 C CNN "Notes"
	1    9150 2400
	0    -1   -1   0   
$EndComp
Wire Wire Line
	9150 2600 9150 2725
Connection ~ 9150 2900
Wire Wire Line
	9250 2600 9250 2725
Wire Wire Line
	9250 2725 9150 2725
Connection ~ 9150 2725
Wire Wire Line
	9150 2725 9150 2900
Text Notes 3325 3100 0    50   ~ 0
12-15VDC
Text Notes 8100 3275 0    50   ~ 0
10V
Text Notes 8125 4625 0    50   ~ 0
5V
Text Notes 8100 5975 0    50   ~ 0
3.3V
Text Notes 12875 3275 0    50   ~ 0
10V
Text Notes 12900 4625 0    50   ~ 0
5V
Text Notes 12875 5975 0    50   ~ 0
3.3V
$Comp
L project:78M05 U2
U 1 1 5F9BA0D6
P 10625 2950
F 0 "U2" H 10625 3287 60  0000 C CNN
F 1 "LM2940IMPX-10" H 10625 3181 60  0000 C CNN
F 2 "Package_TO_SOT_SMD:SOT-223-3_TabPin2" H 10625 2950 60  0001 C CNN
F 3 "" H 10625 2950 60  0000 C CNN
F 4 "Texas Instruments" H 10625 2950 50  0001 C CNN "MFN"
F 5 "LM2940IMPX-10/NOPB" H 10625 2950 50  0001 C CNN "MFP"
F 6 "926-LM2940IMPX10NOPB" H 10625 2950 50  0001 C CNN "S1PN"
F 7 "Mouser" H 10625 2950 50  0001 C CNN "S1PL"
F 8 "LM2940IMPX-10/NOPB" H 10625 2950 50  0001 C CNN "S2PN"
F 9 "Texas Instruments" H 10625 2950 50  0001 C CNN "S2PL"
F 10 "1-A, high-PSRR, low-dropout voltage regulator" H 10625 2950 50  0001 C CNN "Description"
F 11 "SOT-223-4" H 10625 2950 50  0001 C CNN "Package ID"
	1    10625 2950
	1    0    0    -1  
$EndComp
$Comp
L project:78M05 U4
U 1 1 5F9CC18A
P 10650 4325
F 0 "U4" H 10650 4662 60  0000 C CNN
F 1 "LM2940IMPX-5.0" H 10650 4556 60  0000 C CNN
F 2 "Package_TO_SOT_SMD:SOT-223-3_TabPin2" H 10650 4325 60  0001 C CNN
F 3 "" H 10650 4325 60  0000 C CNN
F 4 "Texas Instruments" H 10650 4325 50  0001 C CNN "MFN"
F 5 "LM2940IMPX-5.0/NOPB" H 10650 4325 50  0001 C CNN "MFP"
F 6 "926-LM2940IMPX50NOPB" H 10650 4325 50  0001 C CNN "S1PN"
F 7 "Mouser" H 10650 4325 50  0001 C CNN "S1PL"
F 8 "LM2940IMPX-5.0/NOPB" H 10650 4325 50  0001 C CNN "S2PN"
F 9 "Texas Instruments" H 10650 4325 50  0001 C CNN "S2PL"
F 10 "1-A, high-PSRR, low-dropout voltage regulator" H 10650 4325 50  0001 C CNN "Description"
F 11 "SOT-223" H 10650 4325 50  0001 C CNN "Package ID"
	1    10650 4325
	1    0    0    -1  
$EndComp
Text Notes 2725 2900 0    39   ~ 0
Note: The PJ-102AH jack mates\nwith the PP3-002A plug
$EndSCHEMATC
