EESchema Schematic File Version 4
EELAYER 30 0
EELAYER END
$Descr A4 11693 8268
encoding utf-8
Sheet 1 1
Title "Hammond 1455N220 Carrier Board"
Date "2022-02-04"
Rev "1.1"
Comp "Dyadic Pty Ltd"
Comment1 "2022"
Comment2 ""
Comment3 ""
Comment4 ""
$EndDescr
$Comp
L project:78M05 U1
U 1 1 5C578E22
P 5650 1475
F 0 "U1" H 5650 1812 60  0000 C CNN
F 1 "LM2940IMPX-10" H 5650 1706 60  0000 C CNN
F 2 "Package_TO_SOT_SMD:SOT-223-3_TabPin2" H 5650 1475 60  0001 C CNN
F 3 "" H 5650 1475 60  0000 C CNN
F 4 "Texas Instruments" H 5650 1475 50  0001 C CNN "MFN"
F 5 "LM2940IMPX-10/NOPB" H 5650 1475 50  0001 C CNN "MFP"
F 6 "926-LM2940IMPX10NOPB" H 5650 1475 50  0001 C CNN "S1PN"
F 7 "Mouser" H 5650 1475 50  0001 C CNN "S1PL"
F 8 "LM2940IMPX-10/NOPB" H 5650 1475 50  0001 C CNN "S2PN"
F 9 "Texas Instruments" H 5650 1475 50  0001 C CNN "S2PL"
F 10 "Linear Voltage Regulator IC 1 Output 1A" H 5650 1475 50  0001 C CNN "Description"
F 11 "SOT-223-4" H 5650 1475 50  0001 C CNN "Package ID"
	1    5650 1475
	1    0    0    -1  
$EndComp
$Comp
L project:78M05 U2
U 1 1 5C578EE6
P 5675 2850
F 0 "U2" H 5675 3187 60  0000 C CNN
F 1 "LM2940IMPX-5.0" H 5675 3081 60  0000 C CNN
F 2 "Package_TO_SOT_SMD:SOT-223-3_TabPin2" H 5675 2850 60  0001 C CNN
F 3 "" H 5675 2850 60  0000 C CNN
F 4 "Texas Instruments" H 5675 2850 50  0001 C CNN "MFN"
F 5 "LM2940IMPX-5.0/NOPB" H 5675 2850 50  0001 C CNN "MFP"
F 6 "926-LM2940IMPX50NOPB" H 5675 2850 50  0001 C CNN "S1PN"
F 7 "Mouser" H 5675 2850 50  0001 C CNN "S1PL"
F 8 "LM2940IMPX-5.0/NOPB" H 5675 2850 50  0001 C CNN "S2PN"
F 9 "Texas Instruments" H 5675 2850 50  0001 C CNN "S2PL"
F 10 "Linear Voltage Regulator IC Pos 5V Output 1A" H 5675 2850 50  0001 C CNN "Description"
F 11 "SOT-223" H 5675 2850 50  0001 C CNN "Package ID"
	1    5675 2850
	1    0    0    -1  
$EndComp
$Comp
L project:78M05 U3
U 1 1 5C578FA4
P 5675 4175
F 0 "U3" H 5675 4512 60  0000 C CNN
F 1 "LM3940" H 5675 4406 60  0000 C CNN
F 2 "Package_TO_SOT_SMD:SOT-223-3_TabPin2" H 5675 4175 60  0001 C CNN
F 3 "" H 5675 4175 60  0000 C CNN
F 4 "Texas Instruments" H 5675 4175 50  0001 C CNN "MFN"
F 5 "LM3940IMP-3.3/NOPB" H 5675 4175 50  0001 C CNN "MFP"
F 6 "926-LM3940IMPX33NOPB" H 5675 4175 50  0001 C CNN "S1PN"
F 7 "Mouser" H 5675 4175 50  0001 C CNN "S1PL"
F 8 "LM3940IMP-3.3/NOPBCT-ND" H 5675 4175 50  0001 C CNN "S2PN"
F 9 "Digi-Key" H 5675 4175 50  0001 C CNN "S2PL"
F 10 "Linear Voltage Regulator IC Positive Fixed Output 1A SOT-223-4" H 5675 4175 50  0001 C CNN "Description"
F 11 "SOT-223" H 5675 4175 50  0001 C CNN "Package ID"
	1    5675 4175
	1    0    0    -1  
$EndComp
$Comp
L device:C C2
U 1 1 5C5790A9
P 5150 1675
F 0 "C2" H 5265 1721 50  0000 L CNN
F 1 "0.33u" H 5265 1630 50  0000 L CNN
F 2 "Capacitor_SMD:C_0805_2012Metric" H 5188 1525 50  0001 C CNN
F 3 "~" H 5150 1675 50  0001 C CNN
F 4 "KEMET" H 5150 1675 50  0001 C CNN "MFN"
F 5 "C0805C334K5RACTU " H 5150 1675 50  0001 C CNN "MFP"
F 6 "399-11172-1-ND" H 5150 1675 50  0001 C CNN "S1PN"
F 7 "Digi-Key" H 5150 1675 50  0001 C CNN "S1PL"
F 8 "C0805C334K5RACTU " H 5150 1675 50  0001 C CNN "S2PN"
F 9 "Arrow" H 5150 1675 50  0001 C CNN "S2PL"
F 10 "Cap Ceramic 0.33uF 50V X7R 10%" H 5150 1675 50  0001 C CNN "Description"
F 11 "0805" H 5150 1675 50  0001 C CNN "Package ID"
	1    5150 1675
	1    0    0    -1  
$EndComp
$Comp
L device:CP C4
U 1 1 5C579488
P 7700 1675
F 0 "C4" H 7818 1766 50  0000 L CNN
F 1 "22u" H 7818 1675 50  0000 L CNN
F 2 "Capacitor_Tantalum_SMD:CP_EIA-6032-28_Kemet-C" H 7738 1525 50  0001 C CNN
F 3 "~" H 7700 1675 50  0001 C CNN
F 4 "Kemet" H 7700 1675 50  0001 C CNN "MFN"
F 5 "T491C226K016AT" H 7700 1675 50  0001 C CNN "MFP"
F 6 "80-T491C226K016" H 7700 1675 50  0001 C CNN "S1PN"
F 7 "Mouser" H 7700 1675 50  0001 C CNN "S1PL"
F 8 "T491C226K016AT" H 7700 1675 50  0001 C CNN "S2PN"
F 9 "Arrow" H 7700 1675 50  0001 C CNN "S2PL"
F 10 "Tantalum Capacitors - Solid SMD 16V 22uF 2312 10% ESR=1.6ohms" H 7700 1675 50  0001 C CNN "Description"
F 11 "2312 (6032 metric)" H 7700 1675 50  0001 C CNN "Package ID"
F 12 "16V" H 7818 1584 50  0000 L CNN "Voltage"
	1    7700 1675
	1    0    0    -1  
$EndComp
$Comp
L device:C C1
U 1 1 5C57A0E8
P 3850 1675
F 0 "C1" H 3965 1721 50  0000 L CNN
F 1 "0.1u" H 3965 1630 50  0000 L CNN
F 2 "Capacitor_SMD:C_0805_2012Metric" H 3888 1525 50  0001 C CNN
F 3 "~" H 3850 1675 50  0001 C CNN
F 4 "Yageo" H 3850 1675 50  0001 C CNN "MFN"
F 5 "CC0805KRX7R9BB104 " H 3850 1675 50  0001 C CNN "MFP"
F 6 "311-1140-1-ND" H 3850 1675 50  0001 C CNN "S1PN"
F 7 "Digi-Key" H 3850 1675 50  0001 C CNN "S1PL"
F 8 " CC0805KRX7R9BB104 " H 3850 1675 50  0001 C CNN "S2PN"
F 9 "Arrow" H 3850 1675 50  0001 C CNN "S2PL"
F 10 "Cap Ceramic 0.1uF 50V X7R 10%" H 3850 1675 50  0001 C CNN "Description"
F 11 "0805" H 3850 1675 50  0001 C CNN "Package ID"
	1    3850 1675
	1    0    0    -1  
$EndComp
$Comp
L device:CP C7
U 1 1 5C57B41D
P 7700 3050
F 0 "C7" H 7818 3141 50  0000 L CNN
F 1 "22u" H 7818 3050 50  0000 L CNN
F 2 "Capacitor_Tantalum_SMD:CP_EIA-6032-28_Kemet-C" H 7738 2900 50  0001 C CNN
F 3 "~" H 7700 3050 50  0001 C CNN
F 4 "KEMET" H 7700 3050 50  0001 C CNN "MFN"
F 5 "T491C226K016AT" H 7700 3050 50  0001 C CNN "MFP"
F 6 "80-T491C226K016" H 7700 3050 50  0001 C CNN "S1PN"
F 7 "Mouser" H 7700 3050 50  0001 C CNN "S1PL"
F 8 "T491C226K016AT" H 7700 3050 50  0001 C CNN "S2PN"
F 9 "Arrow" H 7700 3050 50  0001 C CNN "S2PL"
F 10 "Tantalum Capacitors - Solid SMD 16V 22uF 2312 10% ESR=1.6ohms" H 7700 3050 50  0001 C CNN "Description"
F 11 "2312 (6032 metric)" H 7700 3050 50  0001 C CNN "Package ID"
F 12 "16V" H 7818 2959 50  0000 L CNN "Voltage"
	1    7700 3050
	1    0    0    -1  
$EndComp
Wire Wire Line
	6050 1425 6150 1425
Wire Wire Line
	7700 1425 7700 1525
Wire Wire Line
	6075 2800 6175 2800
Wire Wire Line
	7700 2800 7700 2900
Wire Wire Line
	6175 2900 6175 2800
Connection ~ 6175 2800
Wire Wire Line
	6150 1525 6150 1425
Connection ~ 6150 1425
Wire Wire Line
	4950 2800 5175 2800
Wire Wire Line
	5175 2900 5175 2800
Connection ~ 5175 2800
Wire Wire Line
	5175 2800 5275 2800
Wire Wire Line
	6075 4125 6175 4125
Wire Wire Line
	7700 4125 7700 4225
Wire Wire Line
	6175 4225 6175 4125
Connection ~ 6175 4125
Wire Wire Line
	6175 4125 7700 4125
Wire Wire Line
	5275 4125 5175 4125
Wire Wire Line
	5175 4225 5175 4125
Connection ~ 5175 4125
Wire Wire Line
	5175 4125 4950 4125
Wire Wire Line
	4950 1425 5150 1425
Wire Wire Line
	5150 1525 5150 1425
Connection ~ 5150 1425
Wire Wire Line
	5150 1425 5250 1425
Wire Wire Line
	4050 1425 3850 1425
Wire Wire Line
	3850 1425 3850 1525
$Comp
L Connector:Conn_Coaxial_Power J1
U 1 1 5C5838C1
P 3450 1625
F 0 "J1" H 3538 1621 50  0000 L CNN
F 1 "12-15V" H 3075 1525 50  0000 L CNN
F 2 "Connector_BarrelJack:BarrelJack_Horizontal" H 3450 1575 50  0001 C CNN
F 3 "~" H 3450 1575 50  0001 C CNN
F 4 "CUI" H 3450 1625 50  0001 C CNN "MFN"
F 5 "PJ-102AH" H 3450 1625 50  0001 C CNN "MFP"
F 6 "490-PJ-102AH" H 3450 1625 50  0001 C CNN "S1PN"
F 7 "Mouser" H 3450 1625 50  0001 C CNN "S1PL"
F 8 "CP-102AH-ND" H 3450 1625 50  0001 C CNN "S2PN"
F 9 "Digi-Key" H 3450 1625 50  0001 C CNN "S2PL"
F 10 "Power Barrel Connector Jack 2.00mm ID (0.079\"), 5.50mm OD (0.217\") Through Hole, Right Angle" H 3450 1625 50  0001 C CNN "Description"
	1    3450 1625
	1    0    0    -1  
$EndComp
Wire Wire Line
	3450 1525 3450 1425
Wire Wire Line
	3450 1425 3850 1425
Connection ~ 3850 1425
$Comp
L power:GND #PWR0101
U 1 1 5C583EDF
P 3450 1825
F 0 "#PWR0101" H 3450 1575 50  0001 C CNN
F 1 "GND" H 3455 1652 50  0000 C CNN
F 2 "" H 3450 1825 50  0001 C CNN
F 3 "" H 3450 1825 50  0001 C CNN
	1    3450 1825
	1    0    0    -1  
$EndComp
$Comp
L power:GND #PWR0102
U 1 1 5C583F15
P 3850 1825
F 0 "#PWR0102" H 3850 1575 50  0001 C CNN
F 1 "GND" H 3855 1652 50  0000 C CNN
F 2 "" H 3850 1825 50  0001 C CNN
F 3 "" H 3850 1825 50  0001 C CNN
	1    3850 1825
	1    0    0    -1  
$EndComp
$Comp
L power:GND #PWR0103
U 1 1 5C583F44
P 5150 1825
F 0 "#PWR0103" H 5150 1575 50  0001 C CNN
F 1 "GND" H 5155 1652 50  0000 C CNN
F 2 "" H 5150 1825 50  0001 C CNN
F 3 "" H 5150 1825 50  0001 C CNN
	1    5150 1825
	1    0    0    -1  
$EndComp
$Comp
L power:GND #PWR0104
U 1 1 5C583F73
P 5650 1725
F 0 "#PWR0104" H 5650 1475 50  0001 C CNN
F 1 "GND" H 5655 1552 50  0000 C CNN
F 2 "" H 5650 1725 50  0001 C CNN
F 3 "" H 5650 1725 50  0001 C CNN
	1    5650 1725
	1    0    0    -1  
$EndComp
$Comp
L power:GND #PWR0105
U 1 1 5C583FA2
P 6150 1825
F 0 "#PWR0105" H 6150 1575 50  0001 C CNN
F 1 "GND" H 6155 1652 50  0000 C CNN
F 2 "" H 6150 1825 50  0001 C CNN
F 3 "" H 6150 1825 50  0001 C CNN
	1    6150 1825
	1    0    0    -1  
$EndComp
$Comp
L power:GND #PWR0106
U 1 1 5C5841DB
P 7700 1825
F 0 "#PWR0106" H 7700 1575 50  0001 C CNN
F 1 "GND" H 7705 1652 50  0000 C CNN
F 2 "" H 7700 1825 50  0001 C CNN
F 3 "" H 7700 1825 50  0001 C CNN
	1    7700 1825
	1    0    0    -1  
$EndComp
$Comp
L power:GND #PWR0107
U 1 1 5C584396
P 9000 1625
F 0 "#PWR0107" H 9000 1375 50  0001 C CNN
F 1 "GND" H 9005 1452 50  0000 C CNN
F 2 "" H 9000 1625 50  0001 C CNN
F 3 "" H 9000 1625 50  0001 C CNN
	1    9000 1625
	1    0    0    -1  
$EndComp
Wire Wire Line
	8900 1425 9000 1425
Wire Wire Line
	9000 1425 9000 1525
Wire Wire Line
	8900 1525 9000 1525
Connection ~ 9000 1525
Wire Wire Line
	9000 1525 9000 1625
Wire Wire Line
	8900 1625 9000 1625
Wire Wire Line
	8300 1425 8400 1425
Wire Wire Line
	8300 1425 7700 1425
Connection ~ 8300 1425
Connection ~ 7700 1425
Wire Wire Line
	8400 1525 8300 1525
Connection ~ 8300 1525
Wire Wire Line
	8300 1525 8300 1425
Wire Wire Line
	8400 1625 8300 1625
Wire Wire Line
	8300 1625 8300 1525
Wire Wire Line
	8400 2800 8300 2800
Connection ~ 7700 2800
Connection ~ 8300 2800
Wire Wire Line
	8300 2800 7700 2800
Wire Wire Line
	8400 2900 8300 2900
Connection ~ 8300 2900
Wire Wire Line
	8300 2900 8300 2800
Wire Wire Line
	8400 3000 8300 3000
Wire Wire Line
	8300 3000 8300 2900
$Comp
L power:GND #PWR0108
U 1 1 5C58B524
P 9000 3000
F 0 "#PWR0108" H 9000 2750 50  0001 C CNN
F 1 "GND" H 9005 2827 50  0000 C CNN
F 2 "" H 9000 3000 50  0001 C CNN
F 3 "" H 9000 3000 50  0001 C CNN
	1    9000 3000
	1    0    0    -1  
$EndComp
Wire Wire Line
	8900 2800 9000 2800
Wire Wire Line
	9000 2800 9000 2900
Wire Wire Line
	8900 2900 9000 2900
Connection ~ 9000 2900
Wire Wire Line
	9000 2900 9000 3000
Wire Wire Line
	8900 3000 9000 3000
$Comp
L power:GND #PWR0109
U 1 1 5C58FD34
P 7700 3200
F 0 "#PWR0109" H 7700 2950 50  0001 C CNN
F 1 "GND" H 7705 3027 50  0000 C CNN
F 2 "" H 7700 3200 50  0001 C CNN
F 3 "" H 7700 3200 50  0001 C CNN
	1    7700 3200
	1    0    0    -1  
$EndComp
$Comp
L power:GND #PWR0110
U 1 1 5C58FD63
P 6175 3200
F 0 "#PWR0110" H 6175 2950 50  0001 C CNN
F 1 "GND" H 6180 3027 50  0000 C CNN
F 2 "" H 6175 3200 50  0001 C CNN
F 3 "" H 6175 3200 50  0001 C CNN
	1    6175 3200
	1    0    0    -1  
$EndComp
$Comp
L power:GND #PWR0111
U 1 1 5C58FD92
P 5675 3100
F 0 "#PWR0111" H 5675 2850 50  0001 C CNN
F 1 "GND" H 5680 2927 50  0000 C CNN
F 2 "" H 5675 3100 50  0001 C CNN
F 3 "" H 5675 3100 50  0001 C CNN
	1    5675 3100
	1    0    0    -1  
$EndComp
$Comp
L power:GND #PWR0112
U 1 1 5C58FE3F
P 5175 3200
F 0 "#PWR0112" H 5175 2950 50  0001 C CNN
F 1 "GND" H 5180 3027 50  0000 C CNN
F 2 "" H 5175 3200 50  0001 C CNN
F 3 "" H 5175 3200 50  0001 C CNN
	1    5175 3200
	1    0    0    -1  
$EndComp
$Comp
L power:GND #PWR0113
U 1 1 5C58FE6E
P 5175 4525
F 0 "#PWR0113" H 5175 4275 50  0001 C CNN
F 1 "GND" H 5180 4352 50  0000 C CNN
F 2 "" H 5175 4525 50  0001 C CNN
F 3 "" H 5175 4525 50  0001 C CNN
	1    5175 4525
	1    0    0    -1  
$EndComp
$Comp
L power:GND #PWR0114
U 1 1 5C58FE9D
P 5675 4425
F 0 "#PWR0114" H 5675 4175 50  0001 C CNN
F 1 "GND" H 5680 4252 50  0000 C CNN
F 2 "" H 5675 4425 50  0001 C CNN
F 3 "" H 5675 4425 50  0001 C CNN
	1    5675 4425
	1    0    0    -1  
$EndComp
$Comp
L power:GND #PWR0115
U 1 1 5C58FECC
P 6175 4525
F 0 "#PWR0115" H 6175 4275 50  0001 C CNN
F 1 "GND" H 6180 4352 50  0000 C CNN
F 2 "" H 6175 4525 50  0001 C CNN
F 3 "" H 6175 4525 50  0001 C CNN
	1    6175 4525
	1    0    0    -1  
$EndComp
$Comp
L power:GND #PWR0116
U 1 1 5C58FEFB
P 7700 4525
F 0 "#PWR0116" H 7700 4275 50  0001 C CNN
F 1 "GND" H 7705 4352 50  0000 C CNN
F 2 "" H 7700 4525 50  0001 C CNN
F 3 "" H 7700 4525 50  0001 C CNN
	1    7700 4525
	1    0    0    -1  
$EndComp
Wire Wire Line
	8900 4125 9000 4125
Wire Wire Line
	9000 4125 9000 4225
Wire Wire Line
	8400 4125 8300 4125
Connection ~ 7700 4125
Connection ~ 8300 4125
Wire Wire Line
	8300 4125 7700 4125
Wire Wire Line
	8400 4225 8300 4225
Connection ~ 8300 4225
Wire Wire Line
	8300 4225 8300 4125
Wire Wire Line
	8400 4325 8300 4325
Wire Wire Line
	8300 4325 8300 4225
Wire Wire Line
	8900 4225 9000 4225
Connection ~ 9000 4225
Wire Wire Line
	9000 4225 9000 4325
Wire Wire Line
	8900 4325 9000 4325
$Comp
L power:GND #PWR0117
U 1 1 5C59C027
P 9000 4325
F 0 "#PWR0117" H 9000 4075 50  0001 C CNN
F 1 "GND" H 9005 4152 50  0000 C CNN
F 2 "" H 9000 4325 50  0001 C CNN
F 3 "" H 9000 4325 50  0001 C CNN
	1    9000 4325
	1    0    0    -1  
$EndComp
Wire Wire Line
	6150 1425 6600 1425
Wire Wire Line
	6175 2800 6600 2800
$Comp
L device:R R1
U 1 1 5C5BF1CB
P 4800 1425
F 0 "R1" V 4593 1425 50  0000 C CNN
F 1 "0" V 4684 1425 50  0000 C CNN
F 2 "Resistor_SMD:R_1206_3216Metric" V 4730 1425 50  0001 C CNN
F 3 "~" H 4800 1425 50  0001 C CNN
F 4 "Stackpole Electronics Inc" H 4800 1425 50  0001 C CNN "MFN"
F 5 "RMCF1206ZG0R00 " H 4800 1425 50  0001 C CNN "MFP"
F 6 "RMCF1206ZG0R00CT-ND " H 4800 1425 50  0001 C CNN "S1PN"
F 7 "Digi-Key" H 4800 1425 50  0001 C CNN "S1PL"
F 8 "RMCF1206ZG0R00" H 4800 1425 50  0001 C CNN "S2PN"
F 9 "Arrow" H 4800 1425 50  0001 C CNN "S2PL"
F 10 "Res Thick Film 0 Ohm" H 4800 1425 50  0001 C CNN "Description"
F 11 "1206" H 4800 1425 50  0001 C CNN "Package ID"
	1    4800 1425
	0    1    1    0   
$EndComp
Wire Wire Line
	4500 2800 4650 2800
Wire Wire Line
	4500 4125 4650 4125
$Comp
L Connector_Generic:Conn_02x03_Odd_Even J2
U 1 1 5C5D52C3
P 8600 1525
F 0 "J2" H 8650 1750 50  0000 C CNN
F 1 "~" H 8650 1751 50  0000 C CNN
F 2 "Connector_PinHeader_2.54mm:PinHeader_2x03_P2.54mm_Vertical" H 8600 1525 50  0001 C CNN
F 3 "~" H 8600 1525 50  0001 C CNN
F 4 "Samtec" H 8600 1525 50  0001 C CNN "MFN"
F 5 "HTSW-103-16-G-D" H 8600 1525 50  0001 C CNN "MFP"
F 6 "200-HTSW10316GD" H 8600 1525 50  0001 C CNN "S1PN"
F 7 "Mouser" H 8600 1525 50  0001 C CNN "S1PL"
F 8 "CONN HEADER VERT 6POS 2.54MM" H 8600 1525 50  0001 C CNN "Description"
F 9 "Generic 0.1\" pitch pin header with extended mating length" H 8600 1525 50  0001 C CNN "Notes"
	1    8600 1525
	1    0    0    -1  
$EndComp
Connection ~ 9000 1625
Connection ~ 9000 4325
Wire Wire Line
	4250 1425 4650 1425
Wire Wire Line
	6600 1425 6600 2275
Wire Wire Line
	6600 2275 4500 2275
Wire Wire Line
	4500 2275 4500 2800
Connection ~ 6600 1425
Wire Wire Line
	6600 1425 7700 1425
Wire Wire Line
	6600 2800 6600 3625
Wire Wire Line
	6600 3625 4500 3625
Wire Wire Line
	4500 3625 4500 4125
Connection ~ 6600 2800
Wire Wire Line
	6600 2800 7700 2800
$Comp
L power:PWR_FLAG #FLG0101
U 1 1 5CB49EF3
P 9000 1425
F 0 "#FLG0101" H 9000 1500 50  0001 C CNN
F 1 "PWR_FLAG" H 9000 1599 50  0000 C CNN
F 2 "" H 9000 1425 50  0001 C CNN
F 3 "~" H 9000 1425 50  0001 C CNN
	1    9000 1425
	1    0    0    -1  
$EndComp
Connection ~ 9000 1425
$Comp
L device:Ferrite_Bead_Small FB1
U 1 1 5CD65CC2
P 4150 1425
F 0 "FB1" V 4005 1425 50  0000 C CNN
F 1 "~" V 4004 1425 50  0000 C CNN
F 2 "Inductor_SMD:L_0805_2012Metric" V 4080 1425 50  0001 C CNN
F 3 "~" H 4150 1425 50  0001 C CNN
F 4 "Fair-Rite" H 4150 1425 50  0001 C CNN "MFN"
F 5 "2508056017Y2" H 4150 1425 50  0001 C CNN "MFP"
F 6 "623-2508056017Y2" H 4150 1425 50  0001 C CNN "S1PN"
F 7 "Mouser" H 4150 1425 50  0001 C CNN "S1PL"
F 8 "1838838" H 4150 1425 50  0001 C CNN "S2PN"
F 9 "Element14" H 4150 1425 50  0001 C CNN "S2PL"
F 10 "Ferrite Beads MultLyr Chip Bead 600ohm 0805 2000mA" H 4150 1425 50  0001 C CNN "Description"
F 11 "0805" H 4150 1425 50  0001 C CNN "Package ID"
	1    4150 1425
	0    1    1    0   
$EndComp
$Comp
L device:CP C10
U 1 1 5CD6AB75
P 7700 4375
F 0 "C10" H 7818 4466 50  0000 L CNN
F 1 "33u" H 7818 4375 50  0000 L CNN
F 2 "Capacitor_Tantalum_SMD:CP_EIA-6032-28_Kemet-C" H 7738 4225 50  0001 C CNN
F 3 "~" H 7700 4375 50  0001 C CNN
F 4 "KEMET" H 7700 4375 50  0001 C CNN "MFN"
F 5 "T491C336K016AT" H 7700 4375 50  0001 C CNN "MFP"
F 6 "80-T491C336K016" H 7700 4375 50  0001 C CNN "S1PN"
F 7 "Mouser" H 7700 4375 50  0001 C CNN "S1PL"
F 8 "T491C336K016AT" H 7700 4375 50  0001 C CNN "S2PN"
F 9 "Arrow" H 7700 4375 50  0001 C CNN "S2PL"
F 10 "Tantalum Capacitors - Solid SMD 16V 33uF 2312 10% ESR=1.2ohms" H 7700 4375 50  0001 C CNN "Description"
F 11 "2312 (6032 metric)" H 7700 4375 50  0001 C CNN "Package ID"
F 12 "16V" H 7818 4284 50  0000 L CNN "Voltage"
	1    7700 4375
	1    0    0    -1  
$EndComp
$Comp
L device:C C3
U 1 1 5CD6C87B
P 6150 1675
F 0 "C3" H 6265 1721 50  0000 L CNN
F 1 "DNF" H 6265 1630 50  0000 L CNN
F 2 "Capacitor_SMD:C_0805_2012Metric" H 6188 1525 50  0001 C CNN
F 3 "~" H 6150 1675 50  0001 C CNN
F 4 "Yageo" H 6150 1675 50  0001 C CNN "MFN"
F 5 "CC0805KRX7R9BB104 " H 6150 1675 50  0001 C CNN "MFP"
F 6 "311-1140-1-ND" H 6150 1675 50  0001 C CNN "S1PN"
F 7 "Digi-Key" H 6150 1675 50  0001 C CNN "S1PL"
F 8 " CC0805KRX7R9BB104 " H 6150 1675 50  0001 C CNN "S2PN"
F 9 "Arrow" H 6150 1675 50  0001 C CNN "S2PL"
F 10 "Cap Ceramic 0.1uF 50V X7R 10%" H 6150 1675 50  0001 C CNN "Description"
F 11 "0805" H 6150 1675 50  0001 C CNN "Package ID"
	1    6150 1675
	1    0    0    -1  
$EndComp
$Comp
L device:C C6
U 1 1 5CD6C8E8
P 6175 3050
F 0 "C6" H 6290 3096 50  0000 L CNN
F 1 "DNF" H 6290 3005 50  0000 L CNN
F 2 "Capacitor_SMD:C_0805_2012Metric" H 6213 2900 50  0001 C CNN
F 3 "~" H 6175 3050 50  0001 C CNN
F 4 "Yageo" H 6175 3050 50  0001 C CNN "MFN"
F 5 "CC0805KRX7R9BB104 " H 6175 3050 50  0001 C CNN "MFP"
F 6 "311-1140-1-ND" H 6175 3050 50  0001 C CNN "S1PN"
F 7 "Digi-Key" H 6175 3050 50  0001 C CNN "S1PL"
F 8 " CC0805KRX7R9BB104 " H 6175 3050 50  0001 C CNN "S2PN"
F 9 "Arrow" H 6175 3050 50  0001 C CNN "S2PL"
F 10 "Cap Ceramic 0.1uF 50V X7R 10%" H 6175 3050 50  0001 C CNN "Description"
F 11 "0805" H 6175 3050 50  0001 C CNN "Package ID"
	1    6175 3050
	1    0    0    -1  
$EndComp
$Comp
L device:C C9
U 1 1 5CD6C960
P 6175 4375
F 0 "C9" H 6290 4421 50  0000 L CNN
F 1 "DNF" H 6290 4330 50  0000 L CNN
F 2 "Capacitor_SMD:C_0805_2012Metric" H 6213 4225 50  0001 C CNN
F 3 "~" H 6175 4375 50  0001 C CNN
F 4 "Yageo" H 6175 4375 50  0001 C CNN "MFN"
F 5 "CC0805KRX7R9BB104 " H 6175 4375 50  0001 C CNN "MFP"
F 6 "311-1140-1-ND" H 6175 4375 50  0001 C CNN "S1PN"
F 7 "Digi-Key" H 6175 4375 50  0001 C CNN "S1PL"
F 8 " CC0805KRX7R9BB104 " H 6175 4375 50  0001 C CNN "S2PN"
F 9 "Arrow" H 6175 4375 50  0001 C CNN "S2PL"
F 10 "Cap Ceramic 0.1uF 50V X7R 10%" H 6175 4375 50  0001 C CNN "Description"
F 11 "0805" H 6175 4375 50  0001 C CNN "Package ID"
	1    6175 4375
	1    0    0    -1  
$EndComp
$Comp
L device:C C5
U 1 1 5CD70D62
P 5175 3050
F 0 "C5" H 5290 3096 50  0000 L CNN
F 1 "0.33u" H 5290 3005 50  0000 L CNN
F 2 "Capacitor_SMD:C_0805_2012Metric" H 5213 2900 50  0001 C CNN
F 3 "~" H 5175 3050 50  0001 C CNN
F 4 "KEMET" H 5175 3050 50  0001 C CNN "MFN"
F 5 "C0805C334K5RACTU " H 5175 3050 50  0001 C CNN "MFP"
F 6 "399-11172-1-ND" H 5175 3050 50  0001 C CNN "S1PN"
F 7 "Digi-Key" H 5175 3050 50  0001 C CNN "S1PL"
F 8 "C0805C334K5RACTU " H 5175 3050 50  0001 C CNN "S2PN"
F 9 "Arrow" H 5175 3050 50  0001 C CNN "S2PL"
F 10 "Cap Ceramic 0.33uF 50V X7R 10%" H 5175 3050 50  0001 C CNN "Description"
F 11 "0805" H 5175 3050 50  0001 C CNN "Package ID"
	1    5175 3050
	1    0    0    -1  
$EndComp
$Comp
L device:C C8
U 1 1 5CD70DD1
P 5175 4375
F 0 "C8" H 5290 4421 50  0000 L CNN
F 1 "0.33u" H 5290 4330 50  0000 L CNN
F 2 "Capacitor_SMD:C_0805_2012Metric" H 5213 4225 50  0001 C CNN
F 3 "~" H 5175 4375 50  0001 C CNN
F 4 "KEMET" H 5175 4375 50  0001 C CNN "MFN"
F 5 "C0805C334K5RACTU " H 5175 4375 50  0001 C CNN "MFP"
F 6 "399-11172-1-ND" H 5175 4375 50  0001 C CNN "S1PN"
F 7 "Digi-Key" H 5175 4375 50  0001 C CNN "S1PL"
F 8 "C0805C334K5RACTU " H 5175 4375 50  0001 C CNN "S2PN"
F 9 "Arrow" H 5175 4375 50  0001 C CNN "S2PL"
F 10 "Cap Ceramic 0.33uF 50V X7R 10%" H 5175 4375 50  0001 C CNN "Description"
F 11 "0805" H 5175 4375 50  0001 C CNN "Package ID"
	1    5175 4375
	1    0    0    -1  
$EndComp
$Comp
L device:R R2
U 1 1 5CD73BF8
P 4800 2800
F 0 "R2" V 4593 2800 50  0000 C CNN
F 1 "0" V 4684 2800 50  0000 C CNN
F 2 "Resistor_SMD:R_1206_3216Metric" V 4730 2800 50  0001 C CNN
F 3 "~" H 4800 2800 50  0001 C CNN
F 4 "Stackpole Electronics Inc" H 4800 2800 50  0001 C CNN "MFN"
F 5 "RMCF1206ZG0R00 " H 4800 2800 50  0001 C CNN "MFP"
F 6 "RMCF1206ZG0R00CT-ND " H 4800 2800 50  0001 C CNN "S1PN"
F 7 "Digi-Key" H 4800 2800 50  0001 C CNN "S1PL"
F 8 "RMCF1206ZG0R00" H 4800 2800 50  0001 C CNN "S2PN"
F 9 "Arrow" H 4800 2800 50  0001 C CNN "S2PL"
F 10 "Res Thick Film 0 Ohm" H 4800 2800 50  0001 C CNN "Description"
F 11 "1206" H 4800 2800 50  0001 C CNN "Package ID"
	1    4800 2800
	0    1    1    0   
$EndComp
$Comp
L device:R R3
U 1 1 5CD73C69
P 4800 4125
F 0 "R3" V 4593 4125 50  0000 C CNN
F 1 "0" V 4684 4125 50  0000 C CNN
F 2 "Resistor_SMD:R_1206_3216Metric" V 4730 4125 50  0001 C CNN
F 3 "~" H 4800 4125 50  0001 C CNN
F 4 "Stackpole Electronics Inc" H 4800 4125 50  0001 C CNN "MFN"
F 5 "RMCF1206ZG0R00 " H 4800 4125 50  0001 C CNN "MFP"
F 6 "RMCF1206ZG0R00CT-ND " H 4800 4125 50  0001 C CNN "S1PN"
F 7 "Digi-Key" H 4800 4125 50  0001 C CNN "S1PL"
F 8 "RMCF1206ZG0R00" H 4800 4125 50  0001 C CNN "S2PN"
F 9 "Arrow" H 4800 4125 50  0001 C CNN "S2PL"
F 10 "Res Thick Film 0 Ohm" H 4800 4125 50  0001 C CNN "Description"
F 11 "1206" H 4800 4125 50  0001 C CNN "Package ID"
	1    4800 4125
	0    1    1    0   
$EndComp
$Comp
L Connector_Generic:Conn_02x04_Odd_Even J5
U 1 1 5E07805E
P 1625 2600
F 0 "J5" H 1675 2825 50  0000 C CNN
F 1 "~" H 1675 2275 50  0000 C CNN
F 2 "Connector_PinHeader_2.54mm:PinHeader_2x04_P2.54mm_Vertical" H 1625 2600 50  0001 C CNN
F 3 "~" H 1625 2600 50  0001 C CNN
F 4 "Samtec" H 1625 2600 50  0001 C CNN "MFN"
F 5 "TSW-104-16-G-D" H 1625 2600 50  0001 C CNN "MFP"
F 6 "200-TSW10416GD" H 1625 2600 50  0001 C CNN "S1PN"
F 7 "Mouser" H 1625 2600 50  0001 C CNN "S1PL"
F 8 "CONN HEADER VERT 8POS 2.54MM" H 1625 2600 50  0001 C CNN "Description"
F 9 "Generic 0.1\" pitch pin header with extended mating length" H 1625 2600 50  0001 C CNN "Notes"
	1    1625 2600
	1    0    0    -1  
$EndComp
Wire Wire Line
	1425 2500 1325 2500
Wire Wire Line
	1325 2500 1325 2600
Wire Wire Line
	1325 2800 1425 2800
Wire Wire Line
	1425 2700 1325 2700
Connection ~ 1325 2700
Wire Wire Line
	1325 2700 1325 2800
Wire Wire Line
	1425 2600 1325 2600
Connection ~ 1325 2600
Wire Wire Line
	1325 2600 1325 2700
Wire Wire Line
	1925 2500 2025 2500
Wire Wire Line
	2025 2500 2025 2600
Wire Wire Line
	2025 2800 1925 2800
Wire Wire Line
	1925 2700 2025 2700
Connection ~ 2025 2700
Wire Wire Line
	2025 2700 2025 2800
Wire Wire Line
	1925 2600 2025 2600
Connection ~ 2025 2600
Wire Wire Line
	2025 2600 2025 2700
Wire Wire Line
	1425 3425 1325 3425
Wire Wire Line
	1325 3425 1325 3525
Wire Wire Line
	1325 3725 1425 3725
Wire Wire Line
	1925 3425 2025 3425
Wire Wire Line
	2025 3425 2025 3525
Wire Wire Line
	2025 3725 1925 3725
Wire Wire Line
	1425 3525 1325 3525
Connection ~ 1325 3525
Wire Wire Line
	1325 3525 1325 3625
Wire Wire Line
	1425 3625 1325 3625
Connection ~ 1325 3625
Wire Wire Line
	1325 3625 1325 3725
Wire Wire Line
	1925 3525 2025 3525
Connection ~ 2025 3525
Wire Wire Line
	2025 3525 2025 3625
Wire Wire Line
	1925 3625 2025 3625
Connection ~ 2025 3625
Wire Wire Line
	2025 3625 2025 3725
Wire Wire Line
	1425 4375 1300 4375
Wire Wire Line
	1300 4375 1300 4475
Wire Wire Line
	1300 4675 1425 4675
Wire Wire Line
	1425 4575 1300 4575
Connection ~ 1300 4575
Wire Wire Line
	1300 4575 1300 4675
Wire Wire Line
	1425 4475 1300 4475
Connection ~ 1300 4475
Wire Wire Line
	1300 4475 1300 4575
Wire Wire Line
	1925 4375 2050 4375
Wire Wire Line
	2050 4375 2050 4475
Wire Wire Line
	2050 4675 1925 4675
Wire Wire Line
	1925 4575 2050 4575
Connection ~ 2050 4575
Wire Wire Line
	2050 4575 2050 4675
Wire Wire Line
	1925 4475 2050 4475
Connection ~ 2050 4475
Wire Wire Line
	2050 4475 2050 4575
Text Notes 8600 1800 0    50   ~ 0
10V
Text Notes 8600 3175 0    50   ~ 0
5V
Text Notes 8575 4500 0    50   ~ 0
3.3V
Text Notes 2975 1525 0    50   ~ 0
12-15VDC
Connection ~ 9000 3000
$Comp
L project:78M05 U4
U 1 1 5F4946A5
P 5700 5550
F 0 "U4" H 5700 5887 60  0000 C CNN
F 1 "DNF" H 5700 5781 60  0000 C CNN
F 2 "Package_TO_SOT_SMD:SOT-223-3_TabPin2" H 5700 5550 60  0001 C CNN
F 3 "" H 5700 5550 60  0000 C CNN
F 4 "Microchip Technology" H 5700 5550 50  0001 C CNN "MFN"
F 5 "MIC5209-3.3YS-TR" H 5700 5550 50  0001 C CNN "MFP"
F 6 "576-1274-1-ND" H 5700 5550 50  0001 C CNN "S1PN"
F 7 "Digi-Key" H 5700 5550 50  0001 C CNN "S1PL"
F 8 "MIC5209-3.3YS" H 5700 5550 50  0001 C CNN "S2PN"
F 9 "Arrow" H 5700 5550 50  0001 C CNN "S2PL"
F 10 "LDO Regulator Pos 3.3V 0.5A 4-Pin(3+Tab)" H 5700 5550 50  0001 C CNN "Description"
F 11 "SOT-223" H 5700 5550 50  0001 C CNN "Package ID"
	1    5700 5550
	1    0    0    -1  
$EndComp
Wire Wire Line
	6100 5500 6200 5500
Wire Wire Line
	7725 5500 7725 5600
Wire Wire Line
	6200 5600 6200 5500
Connection ~ 6200 5500
Wire Wire Line
	6200 5500 7725 5500
Wire Wire Line
	5300 5500 5200 5500
Wire Wire Line
	5200 5600 5200 5500
Connection ~ 5200 5500
Wire Wire Line
	5200 5500 4900 5500
$Comp
L power:GND #PWR03
U 1 1 5F4946B8
P 5200 5900
F 0 "#PWR03" H 5200 5650 50  0001 C CNN
F 1 "GND" H 5205 5727 50  0000 C CNN
F 2 "" H 5200 5900 50  0001 C CNN
F 3 "" H 5200 5900 50  0001 C CNN
	1    5200 5900
	1    0    0    -1  
$EndComp
$Comp
L power:GND #PWR02
U 1 1 5F4946C2
P 5700 5800
F 0 "#PWR02" H 5700 5550 50  0001 C CNN
F 1 "GND" H 5705 5627 50  0000 C CNN
F 2 "" H 5700 5800 50  0001 C CNN
F 3 "" H 5700 5800 50  0001 C CNN
	1    5700 5800
	1    0    0    -1  
$EndComp
$Comp
L power:GND #PWR04
U 1 1 5F4946CC
P 6200 5900
F 0 "#PWR04" H 6200 5650 50  0001 C CNN
F 1 "GND" H 6205 5727 50  0000 C CNN
F 2 "" H 6200 5900 50  0001 C CNN
F 3 "" H 6200 5900 50  0001 C CNN
	1    6200 5900
	1    0    0    -1  
$EndComp
$Comp
L power:GND #PWR05
U 1 1 5F4946D6
P 7725 5900
F 0 "#PWR05" H 7725 5650 50  0001 C CNN
F 1 "GND" H 7730 5727 50  0000 C CNN
F 2 "" H 7725 5900 50  0001 C CNN
F 3 "" H 7725 5900 50  0001 C CNN
	1    7725 5900
	1    0    0    -1  
$EndComp
Wire Wire Line
	8925 5500 9025 5500
Wire Wire Line
	9025 5500 9025 5600
Wire Wire Line
	8425 5500 8325 5500
Connection ~ 7725 5500
Connection ~ 8325 5500
Wire Wire Line
	8325 5500 7725 5500
Wire Wire Line
	8425 5600 8325 5600
Connection ~ 8325 5600
Wire Wire Line
	8325 5600 8325 5500
Wire Wire Line
	8425 5700 8325 5700
Wire Wire Line
	8325 5700 8325 5600
Wire Wire Line
	8925 5600 9025 5600
Connection ~ 9025 5600
Wire Wire Line
	9025 5600 9025 5700
Wire Wire Line
	8925 5700 9025 5700
$Comp
L power:GND #PWR01
U 1 1 5F4946EF
P 9025 5700
F 0 "#PWR01" H 9025 5450 50  0001 C CNN
F 1 "GND" H 9030 5527 50  0000 C CNN
F 2 "" H 9025 5700 50  0001 C CNN
F 3 "" H 9025 5700 50  0001 C CNN
	1    9025 5700
	1    0    0    -1  
$EndComp
Connection ~ 9025 5700
$Comp
L device:CP C13
U 1 1 5F494703
P 7725 5750
F 0 "C13" H 7843 5841 50  0000 L CNN
F 1 "DNF" H 7843 5750 50  0000 L CNN
F 2 "Capacitor_Tantalum_SMD:CP_EIA-3216-12_Kemet-S" H 7763 5600 50  0001 C CNN
F 3 "~" H 7725 5750 50  0001 C CNN
F 4 "KEMET" H 7725 5750 50  0001 C CNN "MFN"
F 5 "T491A106M016AT " H 7725 5750 50  0001 C CNN "MFP"
F 6 "399-3687-1-ND" H 7725 5750 50  0001 C CNN "S1PN"
F 7 "Digi-Key" H 7725 5750 50  0001 C CNN "S1PL"
F 8 "T491A106M016AT " H 7725 5750 50  0001 C CNN "S2PN"
F 9 "Arrow" H 7725 5750 50  0001 C CNN "S2PL"
F 10 "Cap Tant Solid 10uF 16V 7 Ohm" H 7725 5750 50  0001 C CNN "Description"
F 11 "3216-18" H 7725 5750 50  0001 C CNN "Package ID"
F 12 "16V" H 7843 5659 50  0000 L CNN "Voltage"
	1    7725 5750
	1    0    0    -1  
$EndComp
$Comp
L device:C C12
U 1 1 5F494715
P 6200 5750
F 0 "C12" H 6315 5796 50  0000 L CNN
F 1 "DNF" H 6315 5705 50  0000 L CNN
F 2 "Capacitor_SMD:C_0805_2012Metric" H 6238 5600 50  0001 C CNN
F 3 "~" H 6200 5750 50  0001 C CNN
F 4 "Yageo" H 6200 5750 50  0001 C CNN "MFN"
F 5 "CC0805KRX7R9BB104 " H 6200 5750 50  0001 C CNN "MFP"
F 6 "311-1140-1-ND" H 6200 5750 50  0001 C CNN "S1PN"
F 7 "Digi-Key" H 6200 5750 50  0001 C CNN "S1PL"
F 8 " CC0805KRX7R9BB104 " H 6200 5750 50  0001 C CNN "S2PN"
F 9 "Arrow" H 6200 5750 50  0001 C CNN "S2PL"
F 10 "Cap Ceramic 0.1uF 50V X7R 10%" H 6200 5750 50  0001 C CNN "Description"
F 11 "0805" H 6200 5750 50  0001 C CNN "Package ID"
	1    6200 5750
	1    0    0    -1  
$EndComp
$Comp
L device:C C11
U 1 1 5F494727
P 5200 5750
F 0 "C11" H 5315 5796 50  0000 L CNN
F 1 "DNF" H 5315 5705 50  0000 L CNN
F 2 "Capacitor_SMD:C_0805_2012Metric" H 5238 5600 50  0001 C CNN
F 3 "~" H 5200 5750 50  0001 C CNN
F 4 "KEMET" H 5200 5750 50  0001 C CNN "MFN"
F 5 "C0805C334K5RACTU " H 5200 5750 50  0001 C CNN "MFP"
F 6 "399-11172-1-ND" H 5200 5750 50  0001 C CNN "S1PN"
F 7 "Digi-Key" H 5200 5750 50  0001 C CNN "S1PL"
F 8 "C0805C334K5RACTU " H 5200 5750 50  0001 C CNN "S2PN"
F 9 "Arrow" H 5200 5750 50  0001 C CNN "S2PL"
F 10 "Cap Ceramic 0.33uF 50V X7R 10%" H 5200 5750 50  0001 C CNN "Description"
F 11 "0805" H 5200 5750 50  0001 C CNN "Package ID"
	1    5200 5750
	1    0    0    -1  
$EndComp
Text Notes 8600 5875 0    50   ~ 0
3.3V
$Comp
L Connector_Generic:Conn_01x02 J8
U 1 1 5F4B59C2
P 4550 5500
F 0 "J8" H 4468 5717 50  0000 C CNN
F 1 "~" H 4468 5626 50  0000 C CNN
F 2 "Connector_PinHeader_2.54mm:PinHeader_2x01_P2.54mm_Vertical" H 4550 5500 50  0001 C CNN
F 3 "~" H 4550 5500 50  0001 C CNN
F 4 "Samtec" H 4550 5500 50  0001 C CNN "MFN"
F 5 "HTSW-101-16-L-D" H 4550 5500 50  0001 C CNN "MFP"
F 6 "200-HTSW10116LD" H 4550 5500 50  0001 C CNN "S1PN"
F 7 "Mouser" H 4550 5500 50  0001 C CNN "S1PL"
F 8 "Headers & Wire Housings .100\" High-Temp Terminal Strip" H 4550 5500 50  0001 C CNN "Description"
	1    4550 5500
	-1   0    0    -1  
$EndComp
Wire Wire Line
	4750 5600 4900 5600
Wire Wire Line
	4900 5600 4900 5500
Connection ~ 4900 5500
Wire Wire Line
	4900 5500 4750 5500
$Comp
L Connector_Generic:Conn_02x03_Odd_Even J3
U 1 1 5F4D3BA9
P 8600 2900
F 0 "J3" H 8650 3125 50  0000 C CNN
F 1 "~" H 8650 3126 50  0000 C CNN
F 2 "Connector_PinHeader_2.54mm:PinHeader_2x03_P2.54mm_Vertical" H 8600 2900 50  0001 C CNN
F 3 "~" H 8600 2900 50  0001 C CNN
F 4 "Samtec" H 8600 2900 50  0001 C CNN "MFN"
F 5 "HTSW-103-16-G-D" H 8600 2900 50  0001 C CNN "MFP"
F 6 "200-HTSW10316GD" H 8600 2900 50  0001 C CNN "S1PN"
F 7 "Mouser" H 8600 2900 50  0001 C CNN "S1PL"
F 8 "CONN HEADER VERT 6POS 2.54MM" H 8600 2900 50  0001 C CNN "Description"
F 9 "Generic 0.1\" pitch pin header with extended mating length" H 8600 2900 50  0001 C CNN "Notes"
	1    8600 2900
	1    0    0    -1  
$EndComp
$Comp
L Connector_Generic:Conn_02x03_Odd_Even J4
U 1 1 5F4DAED3
P 8600 4225
F 0 "J4" H 8650 4450 50  0000 C CNN
F 1 "~" H 8650 4451 50  0000 C CNN
F 2 "Connector_PinHeader_2.54mm:PinHeader_2x03_P2.54mm_Vertical" H 8600 4225 50  0001 C CNN
F 3 "~" H 8600 4225 50  0001 C CNN
F 4 "Samtec" H 8600 4225 50  0001 C CNN "MFN"
F 5 "HTSW-103-16-G-D" H 8600 4225 50  0001 C CNN "MFP"
F 6 "200-HTSW10316GD" H 8600 4225 50  0001 C CNN "S1PN"
F 7 "Mouser" H 8600 4225 50  0001 C CNN "S1PL"
F 8 "CONN HEADER VERT 6POS 2.54MM" H 8600 4225 50  0001 C CNN "Description"
F 9 "Generic 0.1\" pitch pin header with extended mating length" H 8600 4225 50  0001 C CNN "Notes"
	1    8600 4225
	1    0    0    -1  
$EndComp
$Comp
L Connector_Generic:Conn_02x03_Odd_Even J9
U 1 1 5F4E1F3C
P 8625 5600
F 0 "J9" H 8675 5825 50  0000 C CNN
F 1 "~" H 8675 5826 50  0000 C CNN
F 2 "Connector_PinHeader_2.54mm:PinHeader_2x03_P2.54mm_Vertical" H 8625 5600 50  0001 C CNN
F 3 "~" H 8625 5600 50  0001 C CNN
F 4 "Samtec" H 8625 5600 50  0001 C CNN "MFN"
F 5 "HTSW-103-16-G-D" H 8625 5600 50  0001 C CNN "MFP"
F 6 "200-HTSW10316GD" H 8625 5600 50  0001 C CNN "S1PN"
F 7 "Mouser" H 8625 5600 50  0001 C CNN "S1PL"
F 8 "CONN HEADER VERT 6POS 2.54MM" H 8625 5600 50  0001 C CNN "Description"
F 9 "Generic 0.1\" pitch pin header with extended mating length" H 8625 5600 50  0001 C CNN "Notes"
	1    8625 5600
	1    0    0    -1  
$EndComp
$Comp
L Connector_Generic:Conn_02x04_Odd_Even J6
U 1 1 5F4E94DD
P 1625 3525
F 0 "J6" H 1675 3750 50  0000 C CNN
F 1 "~" H 1675 3200 50  0000 C CNN
F 2 "Connector_PinHeader_2.54mm:PinHeader_2x04_P2.54mm_Vertical" H 1625 3525 50  0001 C CNN
F 3 "~" H 1625 3525 50  0001 C CNN
F 4 "Samtec" H 1625 3525 50  0001 C CNN "MFN"
F 5 "TSW-104-16-G-D" H 1625 3525 50  0001 C CNN "MFP"
F 6 "200-TSW10416GD" H 1625 3525 50  0001 C CNN "S1PN"
F 7 "Mouser" H 1625 3525 50  0001 C CNN "S1PL"
F 8 "CONN HEADER VERT 8POS 2.54MM" H 1625 3525 50  0001 C CNN "Description"
F 9 "Generic 0.1\" pitch pin header with extended mating length" H 1625 3525 50  0001 C CNN "Notes"
	1    1625 3525
	1    0    0    -1  
$EndComp
$Comp
L Connector_Generic:Conn_02x04_Odd_Even J7
U 1 1 5F4F06DA
P 1625 4475
F 0 "J7" H 1675 4700 50  0000 C CNN
F 1 "~" H 1675 4150 50  0000 C CNN
F 2 "Connector_PinHeader_2.54mm:PinHeader_2x04_P2.54mm_Vertical" H 1625 4475 50  0001 C CNN
F 3 "~" H 1625 4475 50  0001 C CNN
F 4 "Samtec" H 1625 4475 50  0001 C CNN "MFN"
F 5 "TSW-104-16-G-D" H 1625 4475 50  0001 C CNN "MFP"
F 6 "200-TSW10416GD" H 1625 4475 50  0001 C CNN "S1PN"
F 7 "Mouser" H 1625 4475 50  0001 C CNN "S1PL"
F 8 "CONN HEADER VERT 8POS 2.54MM" H 1625 4475 50  0001 C CNN "Description"
F 9 "Generic 0.1\" pitch pin header with extended mating length" H 1625 4475 50  0001 C CNN "Notes"
	1    1625 4475
	1    0    0    -1  
$EndComp
Text Notes 2675 1350 0    39   ~ 0
Note: The PJ-102AH jack mates\nwith the PP3-002A plug
$Comp
L Connector:Conn_01x02_Male J10
U 1 1 6213B842
P 4225 825
F 0 "J10" H 4197 799 50  0000 R CNN
F 1 "VDC" H 4197 708 50  0000 R CNN
F 2 "Connector_PinHeader_2.54mm:PinHeader_1x02_P2.54mm_Vertical" H 4225 825 50  0001 C CNN
F 3 "~" H 4225 825 50  0001 C CNN
F 4 "Samtec" H 4550 825 50  0001 C CNN "MFN"
F 5 "HTSW-101-16-L-D" H 4550 825 50  0001 C CNN "MFP"
F 6 "200-HTSW10116LD" H 4550 825 50  0001 C CNN "S1PN"
F 7 "Mouser" H 4550 825 50  0001 C CNN "S1PL"
F 8 "Headers & Wire Housings .100\" High-Temp Terminal Strip" H 4550 825 50  0001 C CNN "Description"
	1    4225 825 
	-1   0    0    -1  
$EndComp
Wire Wire Line
	3850 1425 3850 925 
Wire Wire Line
	3850 825  4025 825 
Wire Wire Line
	4025 925  3850 925 
Connection ~ 3850 925 
Wire Wire Line
	3850 925  3850 825 
$EndSCHEMATC
