<?xml version="1.0" encoding="UTF-8" standalone="no"?>
<!-- Created with Inkscape (http://www.inkscape.org/) -->

<svg
   width="256"
   height="256"
   viewBox="0 0 256 256.00001"
   version="1.1"
   id="svg1"
   inkscape:version="1.3.2 (091e20ef0f, 2023-11-25)"
   sodipodi:docname="Strings.svg"
   xmlns:inkscape="http://www.inkscape.org/namespaces/inkscape"
   xmlns:sodipodi="http://sodipodi.sourceforge.net/DTD/sodipodi-0.dtd"
   xmlns:xlink="http://www.w3.org/1999/xlink"
   xmlns="http://www.w3.org/2000/svg"
   xmlns:svg="http://www.w3.org/2000/svg">
  <sodipodi:namedview
     id="namedview1"
     pagecolor="#ffffff"
     bordercolor="#000000"
     borderopacity="0.25"
     inkscape:showpageshadow="2"
     inkscape:pageopacity="0.0"
     inkscape:pagecheckerboard="0"
     inkscape:deskcolor="#d1d1d1"
     inkscape:document-units="px"
     inkscape:zoom="0.84096521"
     inkscape:cx="180.15014"
     inkscape:cy="103.45256"
     inkscape:window-width="1309"
     inkscape:window-height="754"
     inkscape:window-x="0"
     inkscape:window-y="0"
     inkscape:window-maximized="1"
     inkscape:current-layer="layer1"
     showgrid="true">
    <inkscape:grid
       id="grid2"
       units="px"
       originx="0"
       originy="0"
       spacingx="1"
       spacingy="1"
       empcolor="#0099e5"
       empopacity="0.30196078"
       color="#0099e5"
       opacity="0.14901961"
       empspacing="32"
       dotted="false"
       gridanglex="30"
       gridanglez="30"
       visible="true" />
  </sodipodi:namedview>
  <defs
     id="defs1">
    <linearGradient
       id="linearGradient1"
       inkscape:collect="always">
      <stop
         style="stop-color:#b60000;stop-opacity:1;"
         offset="0"
         id="stop1" />
      <stop
         style="stop-color:#760000;stop-opacity:1;"
         offset="1"
         id="stop2" />
    </linearGradient>
    <linearGradient
       inkscape:collect="always"
       xlink:href="#linearGradient1"
       id="linearGradient2"
       x1="34.573116"
       y1="31.075262"
       x2="36.94046"
       y2="32.501892"
       gradientUnits="userSpaceOnUse"
       spreadMethod="reflect"
       gradientTransform="translate(3.2700521,-20.512145)" />
    <linearGradient
       inkscape:collect="always"
       xlink:href="#linearGradient1"
       id="linearGradient3"
       gradientUnits="userSpaceOnUse"
       gradientTransform="translate(3.2700521,9.487855)"
       x1="34.573116"
       y1="31.075262"
       x2="36.94046"
       y2="32.501892"
       spreadMethod="reflect" />
    <linearGradient
       inkscape:collect="always"
       xlink:href="#linearGradient1"
       id="linearGradient4"
       gradientUnits="userSpaceOnUse"
       gradientTransform="translate(3.183349,41.941331)"
       x1="34.573116"
       y1="31.075262"
       x2="36.94046"
       y2="32.501892"
       spreadMethod="reflect" />
    <linearGradient
       inkscape:collect="always"
       xlink:href="#linearGradient1"
       id="linearGradient5"
       gradientUnits="userSpaceOnUse"
       gradientTransform="translate(3.183349,75.941331)"
       x1="34.573116"
       y1="31.075262"
       x2="36.94046"
       y2="32.501892"
       spreadMethod="reflect" />
    <linearGradient
       id="linearGradient4-6"
       inkscape:collect="always"
       gradientTransform="matrix(3.8122556,0,0,0.2623119,-1,129.45348)"
       x1="3.8649578"
       y1="270.26367"
       x2="4.1834979"
       y2="276.58224"
       gradientUnits="userSpaceOnUse"
       spreadMethod="reflect">
      <stop
         style="stop-color:#b60000;stop-opacity:1;"
         offset="0"
         id="stop3" />
      <stop
         style="stop-color:#760000;stop-opacity:1;"
         offset="1"
         id="stop4" />
    </linearGradient>
    <linearGradient
       inkscape:collect="always"
       xlink:href="#linearGradient1"
       id="linearGradient6"
       gradientUnits="userSpaceOnUse"
       gradientTransform="translate(2.270052,108.94133)"
       x1="34.573116"
       y1="31.075262"
       x2="36.94046"
       y2="32.501892"
       spreadMethod="reflect" />
    <linearGradient
       inkscape:collect="always"
       xlink:href="#linearGradient1"
       id="linearGradient7"
       gradientUnits="userSpaceOnUse"
       gradientTransform="translate(2.270052,138.94133)"
       x1="34.573116"
       y1="31.075262"
       x2="36.94046"
       y2="32.501892"
       spreadMethod="reflect" />
    <linearGradient
       inkscape:collect="always"
       xlink:href="#linearGradient1"
       id="linearGradient8"
       gradientUnits="userSpaceOnUse"
       gradientTransform="translate(2.183349,171.39481)"
       x1="34.573116"
       y1="31.075262"
       x2="36.94046"
       y2="32.501892"
       spreadMethod="reflect" />
  </defs>
  <g
     inkscape:label="Layer 1"
     inkscape:groupmode="layer"
     id="layer1">
    <rect
       style="opacity:1;fill:#000000;stroke:none;stroke-width:5.00032;stroke-linecap:round;stroke-linejoin:round;stroke-dasharray:none;stroke-opacity:1;paint-order:markers stroke fill"
       id="rect8"
       width="256"
       height="256"
       x="0"
       y="0" />
    <path
       style="opacity:1;fill:none;stroke:url(#linearGradient2);stroke-width:5.00032;stroke-linecap:round;stroke-linejoin:round;stroke-dasharray:none;paint-order:markers stroke fill"
       d="M 15.586863,10.046684 C 56.417854,26.959915 211.4997,21.397857 240.50825,11.307926"
       id="path1"
       sodipodi:nodetypes="cc" />
    <path
       style="fill:none;stroke:url(#linearGradient3);stroke-width:5.00032;stroke-linecap:round;stroke-linejoin:round;stroke-dasharray:none;paint-order:markers stroke fill"
       d="M 15.586863,40.046684 C 63.255236,35.555938 188.31206,57.343406 240.50825,41.307926"
       id="path1-7"
       sodipodi:nodetypes="cc" />
    <path
       style="fill:none;stroke:url(#linearGradient4);stroke-width:5.00032;stroke-linecap:round;stroke-linejoin:round;stroke-dasharray:none;paint-order:markers stroke fill"
       d="m 15.50016,72.50016 c 40.830991,16.913231 73.137249,-6.485475 224.92139,1.261242"
       id="path1-7-3"
       sodipodi:nodetypes="cc" />
    <path
       style="fill:none;stroke:url(#linearGradient5);stroke-width:5.00032;stroke-linecap:round;stroke-linejoin:round;stroke-dasharray:none;paint-order:markers stroke fill"
       d="m 15.50016,106.50016 c 93.15182,26.12883 92.75756,-21.349351 224.92139,1.26124"
       id="path1-7-3-6"
       sodipodi:nodetypes="cc" />
    <path
       style="fill:none;stroke:url(#linearGradient6);stroke-width:5.00032;stroke-linecap:round;stroke-linejoin:round;stroke-dasharray:none;paint-order:markers stroke fill"
       d="m 14.58686,139.50016 c 140.41894,1.75208 188.18363,10.75662 224.92139,1.26124"
       id="path1-5"
       sodipodi:nodetypes="cc" />
    <path
       style="fill:none;stroke:url(#linearGradient7);stroke-width:5.00032;stroke-linecap:round;stroke-linejoin:round;stroke-dasharray:none;paint-order:markers stroke fill"
       d="m 14.58686,169.50016 c 59.55947,-8.65263 195.91284,11.35117 224.92139,1.26124"
       id="path1-7-0"
       sodipodi:nodetypes="cc" />
    <path
       style="fill:none;stroke:url(#linearGradient4-6);stroke-width:5.00032;stroke-linecap:round;stroke-linejoin:round;stroke-dasharray:none;paint-order:markers stroke fill"
       d="m 14.50016,201.95364 c 40.83099,16.91323 195.91284,11.35117 224.92139,1.26124"
       id="path1-7-3-4"
       sodipodi:nodetypes="cc" />
    <path
       style="fill:none;stroke:url(#linearGradient8);stroke-width:5.00032;stroke-linecap:round;stroke-linejoin:round;stroke-dasharray:none;paint-order:markers stroke fill"
       d="M 15.971608,247.51502 C 62.057771,225.75018 210.413,247.30481 239.42155,237.21488"
       id="path1-7-3-6-8"
       sodipodi:nodetypes="cc" />
  </g>
</svg>
