[gd_scene load_steps=2 format=2]

[ext_resource path="res://Sprites/png/Background/starBackground.png" type="Texture" id=1]

[node name="Sprite" type="Sprite" index="0"]

position = Vector2( 125.229, 127.685 )
texture = ExtResource( 1 )

[node name="Sprite" type="Sprite" parent="." index="0"]

position = Vector2( 254.142, 0 )
texture = ExtResource( 1 )


