{
  "locations": {
    "healing_center": {
      "type": "healingCenter",
      "price": 40
    }
  },

  "connections": {
    "route7": {
      "conditions": []
    },

    "lion-mountain": {
      "conditions": []
    }
  },

  "modules/tuxemon.slug": "sphalian_town"
}
