{
  "characters": {
    "rival": {
      "slug": "spyder_billie",
      "text": [
        "spyder_routea_billie1",
        "spyder_routea_billie2"
      ],
      "monsters": [
        {
          "slug": "cardiwing",
          "level": 17
        },
        {
          "slug": "eyesore",
          "level": 17
        },
        {
          "slug": "viviphyta",
          "level": 17
        },
        {
          "slug": "RIVAL",
          "level": 20
        }
      ]
    }
  }
}
