{
  "requiredEncounters": 10,

  "encounters": [
    {
      "monster": "dollfin",
      "encounter_percent": 5,
      "level_range": [
        2,
        5
      ]
    }
  ],

  "trainers": [
    {
      "name": "Dragonrider Nigel",
      "sprite": "dragonrider.png",
      "monsters": [
        {
          "slug": "agnigon",
          "level": 36
        }
      ]
    }
  ],

  "items": [
    {
      "slug": "super_potion",
      "dropRatio": 1
    },
    {
      "slug": "tuxeball",
      "dropRatio": 1
    }
  ],

  "connections": {
    "candy-town": {
      "conditions": []
    },

    "dragons-cave": {
      "conditions": [
        "encounters",
        "trainers"
      ]
    },

    "paper-town": {
      "conditions": [
        "encounters",
        "trainers"
      ]
    }
  },

  "modules/tuxemon.slug": "routec",
  "modules/tuxemon.encounter": "routec",
  "modules/tuxemon.environment": "sea"
}
