{
  "requiredEncounters": 10,

  "trainers": [
    {
      "name": "Soldier Marshall",
      "sprite": "soldier.png",
      "monsters": [
        {
          "slug": "puparmor",
          "level": 16
        },
        {
          "slug": "puparmor",
          "level": 16
        }
      ]
    }
  ],

  "items": [
    {
      "slug": "potion",
      "dropRatio": 1
    },
    {
      "slug": "tuxeball",
      "dropRatio": 1
    }
  ],

  "events": {
    "onLeave": [
      {
        "type": "story",
        "story": "battle-rival-three"
      }
    ]
  },

  "connections": {
    "route3": {
      "conditions": []
    },

    "flower-city": {
      "conditions": [
        "encounters",
        "trainers"
      ]
    }
  },

  "modules/tuxemon.slug": "route4",
  "modules/tuxemon.encounter": "route4",
  "modules/tuxemon.environment": "forest"
}
