{
  "trainers": [
    {
      "name": "Water Nymph",
      "sprite": "waternymph.png",
      "monsters": [
        {
          "slug": "noctalo",
          "level": 50
        },
        {
          "slug": "nudimind",
          "level": 50
        },
        {
          "slug": "vivisource",
          "level": 50
        }
      ]
    },
    {
      "name": "Fire Nymph",
      "sprite": "firenymph.png",
      "monsters": [
        {
          "slug": "criniotherme",
          "level": 50
        },
        {
          "slug": "masknake",
          "level": 50
        },
        {
          "slug": "vivicinder",
          "level": 50
        }
      ]
    },
    {
      "name": "Earth Nymph",
      "sprite": "earthnymph.png",
      "monsters": [
        {
          "slug": "exapode",
          "level": 50
        },
        {
          "slug": "sumchon",
          "level": 50
        },
        {
          "slug": "vividactil",
          "level": 50
        }
      ]
    },
    {
      "name": "Metal Nymph",
      "sprite": "metalnymph.png",
      "monsters": [
        {
          "slug": "araignee",
          "level": 50
        },
        {
          "slug": "allagon",
          "level": 50
        },
        {
          "slug": "viviteel",
          "level": 50
        }
      ]
    },
    {
      "name": "Wood Nymph",
      "sprite": "woodnymph.png",
      "monsters": [
        {
          "slug": "narcileaf",
          "level": 50
        },
        {
          "slug": "dandylion",
          "level": 50
        },
        {
          "slug": "viviphyta",
          "level": 50
        }
      ]
    }
  ],

  "connections": {
    "cotton-town": {
      "conditions": []
    }
  },

  "modules/tuxemon.slug": "dryadsgrove",
  "modules/tuxemon.encounter": "dryadsgrove",
  "modules/tuxemon.environment": "forest"
}
