{
  "characters": {
    "luzia": {
      "slug": "spyder_hospital1_luzia",
      "text": [
        "spyder_hospital1_luzia2",
        "spyder_hospital1_luzia1"
      ],
      "monsters": [
        {
          "slug": "galnec",
          "level": 36
        },
        {
          "slug": "exclawvate",
          "level": 36
        }
      ]
    },

    "rhizome": {
      "slug": "spyder_hospital1_rhizome",
      "text": [
        "spyder_hospital1_rhizome1",
        "spyder_hospital1_rhizome2"
      ],
      "monsters": [
        {
          "slug": "flacono",
          "level": 33
        },
        {
          "slug": "fancair",
          "level": 33
        }
      ]
    }
  }
}
