{
  "characters": {
    "ceo": {
      "slug": "omnichannel-ceo",
      "text": [
        "spyder_intro00",
        "spyder_intro01"
      ]
    },

    "shopKeeper": {
      "slug": "tuxemart-keeper",
      "text": [
        "spyder_intro_shopkeeper1",
        "spyder_intro_shopkeeper4"
      ]
    }
  },

  "monsters": [
    {
      "slug": "budaye",
      "level": 5
    },
    {
      "slug": "dollfin",
      "level": 5
    },
    {
      "slug": "grintot",
      "level": 5
    },
    {
      "slug": "ignibus",
      "level": 5
    },
    {
      "slug": "memnomnom",
      "level": 5
    }
  ],

  "money": 250,

  "area": "paper-town"
}
