{
  "/proxy/*": {
    "target": "https://c0dieg1c93.execute-api.ap-southeast-2.amazonaws.com",
    "secure": true,
    "logLevel": "debug",
    "changeOrigin": true,
    "pathRewrite": {
      "^/proxy": "/"
    }
  }
}
