"강좌코드","강좌명","기관코드","기관명","난이도코드","난이도명","수강신청 접수시작일","수강신청 접수종료일","수강신청 접수시작시간","수강신청 접수마감시간","교육시작일","교육종료일","교육시작시간","교육종료시간","교육요일(월)","교육요일(화)","교육요일(수)","교육요일(목)","교육요일(금)","교육요일(토)","교육요일(일)","모집정원","예비자모집인원","수강료(원)","접수방법(방문접수여부Y,N)","접수방법(온라인접수여부Y,N)","상세정보 주소"
"C100112212","청소연구소(홈 매니저 양성교육)","21","서초여성인력개발센터","N","관계없음","20200608","20200618","00:00","17:30","20200619","20200619","13:40","18:40","Y","Y","Y","Y","Y","Y","","30","10","0","N","Y","https://seocho.seoulwomanup.or.kr/seocho/edu/selectEduProgram.do?sch_class_code=C100112212"
"C100112245","[국비지원]온라인 무역을 기반으로 한 글로벌셀러 창업과정 2기","21","서초여성인력개발센터","A","초중급","20200601","20200904","09:00","15:00","20200907","20201029","13:30","17:30","Y","Y","Y","Y","Y","Y","","10","20","0","Y","Y","https://seocho.seoulwomanup.or.kr/seocho/edu/selectEduProgram.do?sch_class_code=C100112245"
"C100112244","[국비지원]청년여성 글로벌 무역 마케터 양성과정 2기","21","서초여성인력개발센터","A","초중급","20200601","20200821","09:00","15:00","20200824","20201113","09:30","13:30","Y","Y","Y","Y","Y","Y","","10","20","0","Y","Y","https://seocho.seoulwomanup.or.kr/seocho/edu/selectEduProgram.do?sch_class_code=C100112244"
"C100112224","청소연구소(홈 매니저 양성교육)","21","서초여성인력개발센터","N","관계없음","20200608","20200622","00:00","17:30","20200623","20200623","13:40","18:40","Y","Y","Y","Y","Y","Y","","30","10","0","N","Y","https://seocho.seoulwomanup.or.kr/seocho/edu/selectEduProgram.do?sch_class_code=C100112224"
"C100112218","청소연구소(홈 매니저 양성교육)","21","서초여성인력개발센터","N","관계없음","20200608","20200624","00:00","17:30","20200625","20200625","13:40","18:40","Y","Y","Y","Y","Y","Y","","30","10","0","N","Y","https://seocho.seoulwomanup.or.kr/seocho/edu/selectEduProgram.do?sch_class_code=C100112218"
"C100112217","청소연구소(홈 매니저 양성교육)","21","서초여성인력개발센터","N","관계없음","20200608","20200612","00:00","17:30","20200616","20200616","13:40","18:40","Y","Y","Y","Y","Y","Y","","30","10","0","N","Y","https://seocho.seoulwomanup.or.kr/seocho/edu/selectEduProgram.do?sch_class_code=C100112217"
"C100112215","[통합과정]일식조리기능사 자격 취득과정(실기)","21","서초여성인력개발센터","J","초급","20200601","20200831","09:00","24:00","20200831","20200928","14:00","18:00","Y","Y","Y","Y","Y","Y","","12","5","273420","N","Y","https://seocho.seoulwomanup.or.kr/seocho/edu/selectEduProgram.do?sch_class_code=C100112215"
"C100112214","[통합과정]중식조리기능사 자격 취득과정(실기)","21","서초여성인력개발센터","J","초급","20200601","20200824","09:00","24:00","20200824","20200915","09:30","13:30","Y","Y","Y","Y","Y","Y","","12","6","243040","N","Y","https://seocho.seoulwomanup.or.kr/seocho/edu/selectEduProgram.do?sch_class_code=C100112214"
"C100112213","[사전모집][통합과정]무역영어1급 자격증 취득과정","21","서초여성인력개발센터","J","초급","20200601","20200810","09:00","09:00","20200810","20200910","09:00","13:00","Y","Y","Y","Y","Y","Y","","24","5","518720","N","Y","https://seocho.seoulwomanup.or.kr/seocho/edu/selectEduProgram.do?sch_class_code=C100112213"
"C100112206","[유료]카페브런치 만들기","21","서초여성인력개발센터","N","관계없음","20200101","20200721","09:00","09:00","20200721","20200818","14:00","17:00","Y","Y","Y","Y","Y","Y","","18","6","70000","N","Y","https://seocho.seoulwomanup.or.kr/seocho/edu/selectEduProgram.do?sch_class_code=C100112206"
"C100112205","[취창업동아리]입사지원서 컨설팅 3기","21","서초여성인력개발센터","N","관계없음","20200608","20200625","09:00","12:00","20200625","20200625","13:00","17:00","Y","Y","Y","Y","Y","Y","","10","10","0","Y","Y","https://seocho.seoulwomanup.or.kr/seocho/edu/selectEduProgram.do?sch_class_code=C100112205"
"C100112172","[유료]치매예방을 위한 실버인지놀이지도사1급 자격증반(저녁반)","21","서초여성인력개발센터","N","관계없음","20190101","20200627","09:00","15:00","20200629","20200810","19:00","22:00","Y","Y","Y","Y","Y","Y","","21","10","200000","N","Y","https://seocho.seoulwomanup.or.kr/seocho/edu/selectEduProgram.do?sch_class_code=C100112172"