"키","명칭","행정시","행정구","행정동","대표전화","운영시간"
"BE_IW13-0001","Noeul Park Campground","Seoul","Mapo-gu","Sangam-dong","02-304-3213",""
"BE_IW13-0002","Jungnang Campground","Seoul","Jungnang-gu","Mangubon-dong","02-434-4371",""
"BE_IW13-0003","Gangdong Greenway Family Camp Ground","Seoul","Gangdong-gu","Dunchon2-dong","02-2545-788002-478-4079",""
"BE_IW13-0004","Seoul Grand Park Camping Site","Gyeonggi-do","Gwacheon-si","Munwon-dong","02-500-7870",""
"BE_IW13-0005","Hangang Park Nanji Camp","Seoul","Mapo-gu","Sangam-dong","02-304-0061~3",""
"BE_IW13-0006","Hoengseong Starvill Campground","Gangwon-do","Hoengseong-gun","Gangnim-myeon","033-342-4586",""
"BE_IW13-0007","Pocheon Jayeonmaeul Campground","Gyeonggi-do","Pocheon-si","Gwanin-myeon","031-533-9535",""
"BE_IW13-0008","Citizen's Forest Neighborhood Park","Seoul","Seocho-gu","Yangjae2-dong","02-578-7089","15.7~8 temporary operation"
"BE_IW13-0009","Seoul Forest Neighborhood Park","Seoul","Seongdong-gu","Seongsu1ga2-dong","02-2286-5654~6","15.7~8 temporary operation"
"BE_IW13-0010","Odong Neighborhood Park","Seoul","Gangbuk-gu","Beon2-dong","02-901-6923~7","15.7~8 temporary operation"
"BE_IW13-0011","Choansan Neighborhood Park","Seoul","Nowon-gu","Wolgye2-dong","02-2116-3946","15.7~8 temporary operation"
"BE_IW13-0012","Cheonwangbong  Neighborhood Park","Seoul","Guro-gu","Oryu2-dong","02-860-2396","15.7~8 temporary operation"
"BE_IW13-0013","Culture & Arts Neighborhood Park","Seoul","Seocho-gu","Yangjae2-dong","02-2133-6861","15.7~8 temporary operation"
"BE_IW13-0014","Jangji Neighborhood Park","Seoul","Songpa-gu","Jangji-dong","02-2147-3394","15.7~8 temporary operation"