[
  {
    "model": "main.client",
    "pk": 1,
    "fields": {
      "phone_number": 79224317831,
      "tag": "client 1"
    }
  },
  {
    "model": "main.client",
    "pk": 2,
    "fields": {
      "phone_number": 79118352637,
      "tag": "client 2"
    }
  },
  {
    "model": "main.client",
    "pk": 3,
    "fields": {
      "phone_number": 79058352633,
      "tag": "client 3"
    }
  },
  {
    "model": "main.client",
    "pk": 4,
    "fields": {
      "phone_number": 79088584633,
      "tag": "client 4"
    }
  },
  {
    "model": "main.client",
    "pk": 5,
    "fields": {
      "phone_number": 79228352633,
      "tag": "client 5"
    }
  },
  {
    "model": "main.client",
    "pk": 6,
    "fields": {
      "phone_number": 79158352633,
      "tag": "client 6"
    }
  }
]
