<?xml version="1.0" encoding="UTF-8" standalone="no"?>
<svg
   xmlns:dc="http://purl.org/dc/elements/1.1/"
   xmlns:cc="http://creativecommons.org/ns#"
   xmlns:rdf="http://www.w3.org/1999/02/22-rdf-syntax-ns#"
   xmlns:svg="http://www.w3.org/2000/svg"
   xmlns="http://www.w3.org/2000/svg"
   xmlns:sodipodi="http://sodipodi.sourceforge.net/DTD/sodipodi-0.dtd"
   xmlns:inkscape="http://www.inkscape.org/namespaces/inkscape"
   version="1.1"
   id="Layer_1"
   x="0px"
   y="0px"
   width="1920px"
   height="1200px"
   viewBox="0 0 1920 1200"
   enable-background="new 0 0 1920 1200"
   xml:space="preserve"
   inkscape:version="0.92.4 5da689c313, 2019-01-14"
   sodipodi:docname="background.svg"><metadata
     id="metadata5255"><rdf:RDF><cc:Work
         rdf:about=""><dc:format>image/svg+xml</dc:format><dc:type
           rdf:resource="http://purl.org/dc/dcmitype/StillImage" /></cc:Work></rdf:RDF></metadata><defs
     id="defs5253"><linearGradient
       id="SVGID_14_"
       gradientUnits="userSpaceOnUse"
       x1="1884.0078"
       y1="492.96851"
       x2="2795.1436"
       y2="492.96851"
       gradientTransform="matrix(1,0,0,-1,-370.1396,1414.5581)"><stop
         offset="0"
         style="stop-color:#FFFFFF;stop-opacity:0.5"
         id="stop5176" /><stop
         offset="1"
         style="stop-color:#FFFFFF;stop-opacity:0"
         id="stop5178" /></linearGradient><linearGradient
       id="SVGID_15_"
       gradientUnits="userSpaceOnUse"
       x1="1968.874"
       y1="623.40698"
       x2="2226.1133"
       y2="623.40698"
       gradientTransform="matrix(1,0,0,-1,-370.1396,1414.5581)"><stop
         offset="0"
         style="stop-color:#FFFFFF;stop-opacity:0.5"
         id="stop5183" /><stop
         offset="1"
         style="stop-color:#FFFFFF;stop-opacity:0"
         id="stop5185" /></linearGradient><linearGradient
       id="SVGID_16_"
       gradientUnits="userSpaceOnUse"
       x1="1490.4814"
       y1="559.43768"
       x2="2186.2031"
       y2="559.43768"
       gradientTransform="matrix(1,0,0,-1,-370.1396,1414.5581)"><stop
         offset="0"
         style="stop-color:#FFFFFF;stop-opacity:0.5"
         id="stop5190" /><stop
         offset="1"
         style="stop-color:#FFFFFF;stop-opacity:0"
         id="stop5192" /></linearGradient><linearGradient
       id="SVGID_17_"
       gradientUnits="userSpaceOnUse"
       x1="2133.0742"
       y1="436.4631"
       x2="2139.2012"
       y2="436.4631"
       gradientTransform="matrix(1,0,0,-1,-370.1396,1414.5581)"><stop
         offset="0"
         style="stop-color:#FFFFFF;stop-opacity:0.5"
         id="stop5197" /><stop
         offset="1"
         style="stop-color:#FFFFFF;stop-opacity:0"
         id="stop5199" /></linearGradient><linearGradient
       id="SVGID_18_"
       gradientUnits="userSpaceOnUse"
       x1="1448.4756"
       y1="284.39331"
       x2="2361.0127"
       y2="284.39331"
       gradientTransform="matrix(1,0,0,-1,-370.1396,1414.5581)"><stop
         offset="0"
         style="stop-color:#FFFFFF;stop-opacity:0"
         id="stop5204" /><stop
         offset="1"
         style="stop-color:#FFFFFF;stop-opacity:0.5"
         id="stop5206" /></linearGradient><radialGradient
       id="SVGID_19_"
       cx="1879.1934"
       cy="436.46701"
       r="486.3092"
       gradientTransform="matrix(1,0,0,-1,-370.1396,1414.5581)"
       gradientUnits="userSpaceOnUse"><stop
         offset="0"
         style="stop-color:#FFFFFF;stop-opacity:0.5"
         id="stop5211" /><stop
         offset="1"
         style="stop-color:#FFFFFF;stop-opacity:0"
         id="stop5213" /></radialGradient><radialGradient
       id="SVGID_20_"
       cx="1910.4883"
       cy="503.66379"
       r="466.0838"
       gradientTransform="matrix(1,0,0,-1,-370.1396,1414.5581)"
       gradientUnits="userSpaceOnUse"><stop
         offset="0"
         style="stop-color:#FFFFFF;stop-opacity:0.5"
         id="stop5218" /><stop
         offset="1"
         style="stop-color:#FFFFFF;stop-opacity:0"
         id="stop5220" /></radialGradient><linearGradient
       id="SVGID_21_"
       gradientUnits="userSpaceOnUse"
       x1="1142.0469"
       y1="1043.9666"
       x2="1592.0254"
       y2="1043.9666"
       gradientTransform="matrix(0.5366,0,0,-0.4054,968.6461,1402.0491)"><stop
         offset="0"
         style="stop-color:#FFFFFF;stop-opacity:0.5"
         id="stop5225" /><stop
         offset="1"
         style="stop-color:#FFFFFF;stop-opacity:0"
         id="stop5227" /></linearGradient></defs><sodipodi:namedview
     pagecolor="#ffffff"
     bordercolor="#666666"
     borderopacity="1"
     objecttolerance="10"
     gridtolerance="10"
     guidetolerance="10"
     inkscape:pageopacity="0"
     inkscape:pageshadow="2"
     inkscape:window-width="1366"
     inkscape:window-height="707"
     id="namedview5251"
     showgrid="false"
     inkscape:zoom="0.32291667"
     inkscape:cx="1203.6637"
     inkscape:cy="514.99879"
     inkscape:window-x="0"
     inkscape:window-y="0"
     inkscape:window-maximized="1"
     inkscape:current-layer="Layer_1" /><g
     id="gradient"><radialGradient
       id="SVGID_1_"
       cx="2778.9287"
       cy="1248.3542"
       r="2425.5203"
       fx="2526.0498"
       fy="1262.03"
       gradientTransform="matrix(1.1643 0 0 -1.1024 -973.8126 1394.5897)"
       gradientUnits="userSpaceOnUse"><stop
         offset="0"
         style="stop-color:#073246"
         id="stop5077" /><stop
         offset="0.4409"
         style="stop-color:#489291"
         id="stop5079" /><stop
         offset="0.9891"
         style="stop-color:#063246"
         id="stop5081" /></radialGradient><rect
       x="-196"
       y="-146.776"
       fill="url(#SVGID_1_)"
       width="2731.465"
       height="1496.775"
       id="rect5083" /></g><path
     stroke-miterlimit="10"
     d="m 2424.254,921.587 c 0,177.966 -203.626,322.239 -454.818,322.239 -251.192,0 -454.817,-144.276 -454.817,-322.24 0,-12.026 0.926,-23.896 2.742,-35.582 24.998,-161.223 217.86,-286.654 452.075,-286.65 251.192,-0.001 454.818,144.269 454.818,322.233 z"
     id="path5180"
     style="fill:none;stroke:url(#SVGID_14_);stroke-width:1.5;stroke-miterlimit:10"
     inkscape:connector-curvature="0" /><ellipse
     stroke-miterlimit="10"
     cx="1727.354"
     cy="791.151"
     rx="127.869"
     ry="195.552"
     id="ellipse5187"
     style="fill:none;stroke:url(#SVGID_15_);stroke-width:1.5;stroke-miterlimit:10" /><path
     stroke-miterlimit="10"
     d="m 1765.998,976.282 c 1.418,0 2.563,0.813 2.563,1.812 0,1.003 -1.146,1.814 -2.563,1.814 -1.414,0 -2.563,-0.813 -2.563,-1.814 0,-1 1.149,-1.812 2.563,-1.812 z"
     id="path5201"
     style="fill:none;stroke:url(#SVGID_17_);stroke-miterlimit:10"
     inkscape:connector-curvature="0" /><line
     stroke-miterlimit="10"
     x1="1509.054"
     y1="290.34601"
     x2="1509.054"
     y2="1665.8361"
     id="line5215"
     style="fill:none;stroke:url(#SVGID_19_);stroke-width:1.5;stroke-miterlimit:10" /><line
     stroke-miterlimit="10"
     x1="881.20801"
     y1="910.89398"
     x2="2199.49"
     y2="910.89398"
     id="line5222"
     style="fill:none;stroke:url(#SVGID_20_);stroke-width:1.5;stroke-miterlimit:10" /><path
     stroke-miterlimit="10"
     d="m 1702.2,829.289 c 66.455,0 120.324,66.954 120.324,149.539 0,82.581 -53.869,149.533 -120.324,149.533 -66.454,0 -120.329,-66.952 -120.329,-149.533 0,-82.585 53.875,-149.539 120.329,-149.539 z"
     id="path5229"
     style="fill:none;stroke:url(#SVGID_21_);stroke-width:1.5;stroke-miterlimit:10"
     inkscape:connector-curvature="0" /></svg>