<?xml version="1.0" encoding="UTF-8" standalone="no"?>
<!-- Generator: Adobe Illustrator 10.0, SVG Export Plug-In . SVG Version: 3.0.0 Build 77)  -->

<svg
   xmlns:ns4="http://ns.adobe.com/SaveForWeb/1.0/"
   xmlns:ns3="http://ns.adobe.com/Variables/1.0/"
   xmlns:ns2="http://ns.adobe.com/AdobeIllustrator/10.0/"
   xmlns:dc="http://purl.org/dc/elements/1.1/"
   xmlns:cc="http://creativecommons.org/ns#"
   xmlns:rdf="http://www.w3.org/1999/02/22-rdf-syntax-ns#"
   xmlns:svg="http://www.w3.org/2000/svg"
   xmlns="http://www.w3.org/2000/svg"
   xmlns:sodipodi="http://sodipodi.sourceforge.net/DTD/sodipodi-0.dtd"
   xmlns:inkscape="http://www.inkscape.org/namespaces/inkscape"
   ns2:viewOrigin="262 450"
   ns2:rulerOrigin="0 0"
   ns2:pageBounds="0 792 612 0"
   width="128"
   height="128"
   viewBox="0 0 128 128"
   overflow="visible"
   enable-background="new 0 0 87.041 108.445"
   xml:space="preserve"
   id="svg2"
   version="1.1"
   inkscape:version="0.92.4 5da689c313, 2019-01-14"
   sodipodi:docname="emblem-debian.svg"
   style="overflow:visible"
   inkscape:export-filename="/tmp/emblem-debian.png"
   inkscape:export-xdpi="90"
   inkscape:export-ydpi="90"><defs
     id="defs35" /><sodipodi:namedview
     pagecolor="#ffffff"
     bordercolor="#666666"
     borderopacity="1"
     objecttolerance="10"
     gridtolerance="10"
     guidetolerance="10"
     inkscape:pageopacity="0"
     inkscape:pageshadow="2"
     inkscape:window-width="1366"
     inkscape:window-height="707"
     id="namedview33"
     showgrid="false"
     inkscape:zoom="1.5388188"
     inkscape:cx="31.659836"
     inkscape:cy="27.557756"
     inkscape:window-x="0"
     inkscape:window-y="0"
     inkscape:window-maximized="1"
     inkscape:current-layer="svg2" /><metadata
     id="metadata4"><ns3:variableSets><ns3:variableSet
         varSetName="binding1"
         locked="none"><ns3:variables /><ns3:sampleDataSets /></ns3:variableSet></ns3:variableSets><ns4:sfw><ns4:slices /><ns4:sliceSourceBounds
         y="341.555"
         x="262"
         width="87.041"
         height="108.445"
         bottomLeftOrigin="true" /></ns4:sfw><rdf:RDF><cc:Work
         rdf:about=""><dc:format>image/svg+xml</dc:format><dc:type
           rdf:resource="http://purl.org/dc/dcmitype/StillImage" /><dc:title /></cc:Work></rdf:RDF></metadata><g
     id="g252"
     transform="matrix(0.48722845,0,0,0.48722845,1.9698188,1.2996987)"><path
       inkscape:export-ydpi="96"
       inkscape:export-xdpi="96"
       inkscape:export-filename="/home/dz/Imagens/dz.png"
       d="M 0,127.99003 C 0,198.68876 57.29914,256 127.99436,256 198.69007,256 256,198.68876 256,127.99003 256,57.30173 198.69007,0 127.99436,0 57.29914,0 0,57.30173 0,127.99003"
       style="fill:#0e232e;fill-opacity:1;fill-rule:nonzero;stroke:none;stroke-width:0.44706136"
       id="path22-9"
       inkscape:connector-curvature="0" /><g
       inkscape:export-ydpi="96"
       inkscape:export-xdpi="96"
       inkscape:export-filename="/home/dz/Imagens/dz.png"
       style="opacity:1"
       transform="matrix(0.34627585,0,0,0.34627581,-550.12347,-249.10442)"
       id="g8074-8"><path
         inkscape:connector-curvature="0"
         id="path76-2"
         style="fill:#54c9e8;fill-opacity:1;fill-rule:nonzero;stroke:none"
         d="m 1963.5644,757.2154 8.1813,0.215 -0.975,36.05125 -8.1763,-0.22625 z" /><path
         inkscape:connector-curvature="0"
         id="path80-7"
         style="fill:#54c9e8;fill-opacity:1;fill-rule:nonzero;stroke:none"
         d="m 1981.4684,757.95765 8.1575,0.66125 -2.9025,35.9425 -8.1512,-0.65625 z" /><path
         inkscape:connector-curvature="0"
         id="path84-9"
         style="fill:#54c9e8;fill-opacity:1;fill-rule:nonzero;stroke:none"
         d="m 1999.2914,759.66265 8.12,1.09875 -4.8287,35.7275 -8.1138,-1.09375 z" /><path
         inkscape:connector-curvature="0"
         id="path88-7"
         style="fill:#54c9e8;fill-opacity:1;fill-rule:nonzero;stroke:none"
         d="m 2017.0457,762.32365 8.0463,1.5425 -6.7588,35.4075 -8.0388,-1.5275 z" /><path
         inkscape:connector-curvature="0"
         id="path92-0"
         style="fill:#54c9e8;fill-opacity:1;fill-rule:nonzero;stroke:none"
         d="m 2034.6128,765.94865 7.9338,1.97625 -8.6613,34.9825 -7.9425,-1.96875 z" /><path
         inkscape:connector-curvature="0"
         id="path96-5"
         style="fill:#54c9e8;fill-opacity:1;fill-rule:nonzero;stroke:none"
         d="m 2051.9491,770.51665 7.8275,2.3975 -10.56,34.4775 -7.82,-2.3975 z" /><path
         inkscape:connector-curvature="0"
         id="path100-04"
         style="fill:#54c9e8;fill-opacity:1;fill-rule:nonzero;stroke:none"
         d="m 2069.0419,776.0314 7.6675,2.82 -12.41,33.845 -7.6837,-2.825 z" /><path
         inkscape:connector-curvature="0"
         id="path104-1"
         style="fill:#54c9e8;fill-opacity:1;fill-rule:nonzero;stroke:none"
         d="m 2085.7871,782.45865 7.5263,3.23875 -14.245,33.1225 -7.5175,-3.2375 z" /><path
         inkscape:connector-curvature="0"
         id="path108-3"
         style="fill:#54c9e8;fill-opacity:1;fill-rule:nonzero;stroke:none"
         d="m 2102.1561,789.78903 7.3238,3.63125 -16.0125,32.30125 -7.33,-3.63375 z" /><path
         inkscape:connector-curvature="0"
         id="path112-3"
         style="fill:#0baced;fill-opacity:1;fill-rule:nonzero;stroke:none"
         d="m 2118.1008,797.98678 7.1188,4.03625 -17.7325,31.39 -7.1263,-4.03125 z" /><path
         inkscape:connector-curvature="0"
         id="path116-79"
         style="fill:#0baced;fill-opacity:1;fill-rule:nonzero;stroke:none"
         d="m 2133.5809,807.04928 6.8975,4.41375 -19.41,30.37875 -6.9,-4.41 z" /><path
         inkscape:connector-curvature="0"
         id="path120-2"
         style="fill:#0baced;fill-opacity:1;fill-rule:nonzero;stroke:none"
         d="m 2148.5431,816.9244 6.65,4.7725 -21.0238,29.3 -6.645,-4.78125 z" /><path
         inkscape:connector-curvature="0"
         id="path124-7"
         style="fill:#0baced;fill-opacity:1;fill-rule:nonzero;stroke:none"
         d="m 2162.9452,827.58428 6.3763,5.12625 -22.5613,28.11125 -6.3875,-5.12375 z" /><path
         inkscape:connector-curvature="0"
         id="path128-6"
         style="fill:#0baced;fill-opacity:1;fill-rule:nonzero;stroke:none"
         d="m 2176.7685,839.01078 6.0863,5.46375 -24.0463,26.85625 -6.0925,-5.45 z" /><path
         inkscape:connector-curvature="0"
         id="path132-7"
         style="fill:#0baced;fill-opacity:1;fill-rule:nonzero;stroke:none"
         d="m 2189.9401,851.15865 5.7962,5.7775 -25.4662,25.53125 -5.7912,-5.77 z" /><path
         inkscape:connector-curvature="0"
         id="path136-5"
         style="fill:#0baced;fill-opacity:1;fill-rule:nonzero;stroke:none"
         d="m 2202.4376,863.98977 5.4788,6.08625 -26.7863,24.1275 -5.4812,-6.08125 z" /><path
         inkscape:connector-curvature="0"
         id="path140-2"
         style="fill:#0baced;fill-opacity:1;fill-rule:nonzero;stroke:none"
         d="m 2214.2519,877.48527 5.1338,6.36875 -28.045,22.66 -5.1425,-6.36875 z" /><path
         inkscape:connector-curvature="0"
         id="path144-57"
         style="fill:#0baced;fill-opacity:1;fill-rule:nonzero;stroke:none"
         d="m 2225.2988,891.58765 4.7863,6.6375 -29.225,21.12 -4.785,-6.6425 z" /><path
         inkscape:connector-curvature="0"
         id="path148-3"
         style="fill:#0baced;fill-opacity:1;fill-rule:nonzero;stroke:none"
         d="m 2235.5831,906.26865 4.4313,6.88 -30.3176,19.51875 -4.4387,-6.8775 z" /><path
         inkscape:connector-curvature="0"
         id="path152-2"
         style="fill:#0baced;fill-opacity:1;fill-rule:nonzero;stroke:none"
         d="m 2245.0669,921.49878 4.045,7.10625 -31.3288,17.84625 -4.0575,-7.11875 z" /><path
         inkscape:connector-curvature="0"
         id="path156-7"
         style="fill:#0baced;fill-opacity:1;fill-rule:nonzero;stroke:none"
         d="m 2253.7008,937.20627 3.6613,7.315 -32.245,16.1225 -3.6613,-7.31 z" /><path
         inkscape:connector-curvature="0"
         id="path160-69"
         style="fill:#6bcdf4;fill-opacity:1;fill-rule:nonzero;stroke:none"
         d="m 2261.4938,953.3769 3.265,7.5075 -33.0875,14.345 -3.2537,-7.50875 z" /><path
         inkscape:connector-curvature="0"
         id="path164-5"
         style="fill:#6bcdf4;fill-opacity:1;fill-rule:nonzero;stroke:none"
         d="m 2268.3867,969.94377 2.8438,7.67375 -33.8088,12.52625 -2.8475,-7.675 z" /><path
         inkscape:connector-curvature="0"
         id="path168-0"
         style="fill:#6bcdf4;fill-opacity:1;fill-rule:nonzero;stroke:none"
         d="m 2274.3611,986.86165 2.425,7.81875 -34.4312,10.6725 -2.4225,-7.83 z" /><path
         inkscape:connector-curvature="0"
         id="path172-0"
         style="fill:#6bcdf4;fill-opacity:1;fill-rule:nonzero;stroke:none"
         d="m 2279.4212,1004.0633 1.99,7.94 -34.9825,8.78 -1.97,-7.9413 z" /><path
         inkscape:connector-curvature="0"
         id="path176-8"
         style="fill:#6bcdf4;fill-opacity:1;fill-rule:nonzero;stroke:none"
         d="m 2283.5316,1021.5317 1.5537,8.03 -35.4025,6.86 -1.5562,-8.035 z" /><path
         inkscape:connector-curvature="0"
         id="path180-71"
         style="fill:#6bcdf4;fill-opacity:1;fill-rule:nonzero;stroke:none"
         d="m 2286.6777,1039.1827 1.1263,8.105 -35.7175,4.9488 -1.1238,-8.1138 z" /><path
         inkscape:connector-curvature="0"
         id="path184-9"
         style="fill:#6bcdf4;fill-opacity:1;fill-rule:nonzero;stroke:none"
         d="m 2288.8771,1056.9709 0.6788,8.1563 -35.93,3.0037 -0.6825,-8.1575 z" /><path
         inkscape:connector-curvature="0"
         id="path188-4"
         style="fill:#6bcdf4;fill-opacity:1;fill-rule:nonzero;stroke:none"
         d="m 2290.1125,1074.8527 0.245,8.1875 -36.0487,1.0738 -0.2425,-8.1801 z" /><path
         inkscape:connector-curvature="0"
         id="path192-50"
         style="fill:#6bcdf4;fill-opacity:1;fill-rule:nonzero;stroke:none"
         d="m 2290.3823,1092.7563 -0.19,8.1788 -36.0437,-0.8413 0.185,-8.1737 z" /><path
         inkscape:connector-curvature="0"
         id="path196-0"
         style="fill:#6bcdf4;fill-opacity:1;fill-rule:nonzero;stroke:none"
         d="m 2289.7053,1110.6553 -0.625,8.1562 -35.9475,-2.7512 0.6162,-8.165 z" /><path
         inkscape:connector-curvature="0"
         id="path200-5"
         style="fill:#6bcdf4;fill-opacity:1;fill-rule:nonzero;stroke:none"
         d="m 2288.0799,1128.5059 -1.0725,8.12 -35.7412,-4.6862 1.065,-8.12 z" /><path
         inkscape:connector-curvature="0"
         id="path204-6"
         style="fill:#6bcdf4;fill-opacity:1;fill-rule:nonzero;stroke:none"
         d="m 2285.4859,1146.269 -1.505,8.0313 -35.44,-6.6075 1.4988,-8.0488 z" /><path
         inkscape:connector-curvature="0"
         id="path208-8"
         style="fill:#6bcdf4;fill-opacity:1;fill-rule:nonzero;stroke:none"
         d="m 2281.9264,1163.8592 -1.9338,7.94 -35.0274,-8.53 1.9312,-7.9525 z" /><path
         inkscape:connector-curvature="0"
         id="path212-2"
         style="fill:#6bcdf4;fill-opacity:1;fill-rule:nonzero;stroke:none"
         d="m 2277.4293,1181.209 -2.3613,7.8263 -34.525,-10.4188 2.3663,-7.8412 z" /><path
         inkscape:connector-curvature="0"
         id="path216-5"
         style="fill:#6bcdf4;fill-opacity:1;fill-rule:nonzero;stroke:none"
         d="m 2271.9807,1198.3219 -2.7887,7.685 -33.9025,-12.2838 2.795,-7.6999 z" /><path
         inkscape:connector-curvature="0"
         id="path220-7"
         style="fill:#6bcdf4;fill-opacity:1;fill-rule:nonzero;stroke:none"
         d="m 2265.6259,1215.0744 -3.2025,7.5288 -33.1812,-14.1175 3.205,-7.5201 z" /><path
         inkscape:connector-curvature="0"
         id="path224-04"
         style="fill:#0baced;fill-opacity:1;fill-rule:nonzero;stroke:none"
         d="m 2258.3538,1231.4899 -3.6075,7.3388 -32.3688,-15.89 3.6113,-7.35 z" /><path
         inkscape:connector-curvature="0"
         id="path228-9"
         style="fill:#0baced;fill-opacity:1;fill-rule:nonzero;stroke:none"
         d="m 2250.2004,1247.4687 -3.9887,7.1412 -31.4588,-17.6325 4.0013,-7.125 z" /><path
         inkscape:connector-curvature="0"
         id="path232-02"
         style="fill:#0baced;fill-opacity:1;fill-rule:nonzero;stroke:none"
         d="m 2241.2141,1262.9764 -4.375,6.9175 -30.4525,-19.2962 4.3713,-6.9275 z" /><path
         inkscape:connector-curvature="0"
         id="path236-2"
         style="fill:#0baced;fill-opacity:1;fill-rule:nonzero;stroke:none"
         d="m 2231.4011,1277.9727 -4.7525,6.6638 -29.3675,-20.9138 4.7475,-6.66 z" /><path
         inkscape:connector-curvature="0"
         id="path240-2"
         style="fill:#0baced;fill-opacity:1;fill-rule:nonzero;stroke:none"
         d="m 2220.7909,1292.4134 -5.095,6.415 -28.2113,-22.4575 5.1013,-6.4162 z" /><path
         inkscape:connector-curvature="0"
         id="path244-1"
         style="fill:#0baced;fill-opacity:1;fill-rule:nonzero;stroke:none"
         d="m 2209.4289,1306.2663 -5.4313,6.1338 -26.9612,-23.955 5.435,-6.1113 z" /><path
         inkscape:connector-curvature="0"
         id="path248-5"
         style="fill:#0baced;fill-opacity:1;fill-rule:nonzero;stroke:none"
         d="m 2197.3167,1319.5122 -5.7463,5.8225 -25.6425,-25.3737 5.7525,-5.8113 z" /><path
         inkscape:connector-curvature="0"
         id="path252-4"
         style="fill:#0baced;fill-opacity:1;fill-rule:nonzero;stroke:none"
         d="m 2184.5273,1332.0564 -6.055,5.5025 -24.2362,-26.705 6.0637,-5.4788 z" /><path
         inkscape:connector-curvature="0"
         id="path256-5"
         style="fill:#0baced;fill-opacity:1;fill-rule:nonzero;stroke:none"
         d="m 2171.0814,1343.9172 -6.345,5.1663 -22.765,-27.965 6.3538,-5.155 z" /><path
         inkscape:connector-curvature="0"
         id="path260-4"
         style="fill:#0baced;fill-opacity:1;fill-rule:nonzero;stroke:none"
         d="m 2157.0145,1355.0294 -6.6025,4.8087 -21.2325,-29.1274 6.62,-4.8376 z" /><path
         inkscape:connector-curvature="0"
         id="path264-9"
         style="fill:#0baced;fill-opacity:1;fill-rule:nonzero;stroke:none"
         d="m 2142.3817,1365.3585 -6.855,4.4513 -19.6375,-30.245 6.865,-4.4513 z" /><path
         inkscape:connector-curvature="0"
         id="path268-6"
         style="fill:#0baced;fill-opacity:1;fill-rule:nonzero;stroke:none"
         d="m 2127.2043,1374.903 -7.1025,4.0738 -17.96,-31.2588 7.0925,-4.08 z" /><path
         inkscape:connector-curvature="0"
         id="path272-8"
         style="fill:#0baced;fill-opacity:1;fill-rule:nonzero;stroke:none"
         d="m 2111.5168,1383.6162 -7.3125,3.67 -16.2388,-32.1862 7.2988,-3.6863 z" /><path
         inkscape:connector-curvature="0"
         id="path276-4"
         style="fill:#54c9e8;fill-opacity:1;fill-rule:nonzero;stroke:none"
         d="m 2095.3848,1391.4497 -7.4963,3.2938 -14.4762,-33.0188 7.5,-3.3 z" /><path
         inkscape:connector-curvature="0"
         id="path280-1"
         style="fill:#54c9e8;fill-opacity:1;fill-rule:nonzero;stroke:none"
         d="m 2078.8519,1398.4143 -7.66,2.8712 -12.6537,-33.7774 7.655,-2.8676 z" /><path
         inkscape:connector-curvature="0"
         id="path284-2"
         style="fill:#54c9e8;fill-opacity:1;fill-rule:nonzero;stroke:none"
         d="m 2061.9664,1404.4587 -7.815,2.46 -10.7875,-34.41 7.7962,-2.4525 z" /><path
         inkscape:connector-curvature="0"
         id="path288-8"
         style="fill:#54c9e8;fill-opacity:1;fill-rule:nonzero;stroke:none"
         d="m 2044.7581,1409.5764 -7.93,2.0313 -8.9012,-34.9426 7.925,-2.0224 z" /><path
         inkscape:connector-curvature="0"
         id="path292-3"
         style="fill:#54c9e8;fill-opacity:1;fill-rule:nonzero;stroke:none"
         d="m 2027.3252,1413.7582 -8.0275,1.5988 -7.0062,-35.375 8.03,-1.5875 z" /><path
         inkscape:connector-curvature="0"
         id="path296-6"
         style="fill:#54c9e8;fill-opacity:1;fill-rule:nonzero;stroke:none"
         d="m 2009.6722,1416.9762 -8.0975,1.16 -5.0812,-35.7012 8.1112,-1.1438 z" /><path
         inkscape:connector-curvature="0"
         id="path300-11"
         style="fill:#54c9e8;fill-opacity:1;fill-rule:nonzero;stroke:none"
         d="m 1991.8914,1419.2488 -8.1512,0.7088 -3.1488,-35.9088 8.1588,-0.7262 z" /><path
         inkscape:connector-curvature="0"
         id="path304-9"
         style="fill:#54c9e8;fill-opacity:1;fill-rule:nonzero;stroke:none"
         d="m 1974.0248,1420.5465 -8.1737,0.2813 -1.2288,-36.04 8.1863,-0.2751 z" /><path
         inkscape:connector-curvature="0"
         id="path308-31"
         style="fill:#54c9e8;fill-opacity:1;fill-rule:nonzero;stroke:none"
         d="m 1956.1256,1420.8882 -8.1787,-0.1425 0.685,-36.0487 8.1887,0.1512 z" /><path
         inkscape:connector-curvature="0"
         id="path312-5"
         style="fill:#54c9e8;fill-opacity:1;fill-rule:nonzero;stroke:none"
         d="m 1938.2191,1420.2877 -8.155,-0.5875 2.615,-35.965 8.1588,0.6038 z" /><path
         inkscape:connector-curvature="0"
         id="path316-1"
         style="fill:#54c9e8;fill-opacity:1;fill-rule:nonzero;stroke:none"
         d="m 1920.3604,1418.72 -8.125,-1.015 4.555,-35.7825 8.1188,1.0438 z" /><path
         inkscape:connector-curvature="0"
         id="path320-7"
         style="fill:#54c9e8;fill-opacity:1;fill-rule:nonzero;stroke:none"
         d="m 1902.6131,1416.2087 -8.0475,-1.4725 6.47,-35.47 8.0513,1.47 z" /><path
         inkscape:connector-curvature="0"
         id="path324-1"
         style="fill:#54c9e8;fill-opacity:1;fill-rule:nonzero;stroke:none"
         d="m 1885.0203,1412.7242 -7.9613,-1.9 8.3963,-35.0675 7.955,1.8938 z" /><path
         inkscape:connector-curvature="0"
         id="path328-4"
         style="fill:#54c9e8;fill-opacity:1;fill-rule:nonzero;stroke:none"
         d="m 1867.6184,1408.2849 -7.8387,-2.3362 10.2862,-34.5588 7.8488,2.3413 z" /><path
         inkscape:connector-curvature="0"
         id="path332-3"
         style="fill:#54c9e8;fill-opacity:1;fill-rule:nonzero;stroke:none"
         d="m 1850.5108,1402.9128 -7.7037,-2.7562 12.1562,-33.9388 7.7013,2.7563 z" /><path
         inkscape:connector-curvature="0"
         id="path336-7"
         style="fill:#54c9e8;fill-opacity:1;fill-rule:nonzero;stroke:none"
         d="m 1833.7087,1396.6252 -7.5375,-3.1737 13.98,-33.2363 7.5388,3.175 z" /><path
         inkscape:connector-curvature="0"
         id="path340-9"
         style="fill:#54c9e8;fill-opacity:1;fill-rule:nonzero;stroke:none"
         d="m 1817.2788,1389.4203 -7.365,-3.5862 15.7713,-32.4188 7.3637,3.5813 z" /><path
         inkscape:connector-curvature="0"
         id="path344-0"
         style="fill:#54c9e8;fill-opacity:1;fill-rule:nonzero;stroke:none"
         d="m 1801.2607,1381.3404 -7.1537,-3.9725 17.5037,-31.535 7.1475,3.9738 z" /><path
         inkscape:connector-curvature="0"
         id="path348-2"
         style="fill:#54c9e8;fill-opacity:1;fill-rule:nonzero;stroke:none"
         d="m 1785.7112,1372.398 -6.9225,-4.335 19.1687,-30.5438 6.9351,4.3425 z" /><path
         inkscape:connector-curvature="0"
         id="path352-4"
         style="fill:#67bb49;fill-opacity:1;fill-rule:nonzero;stroke:none"
         d="m 1770.6843,1362.6538 -6.685,-4.7275 20.7938,-29.45 6.6875,4.7275 z" /><path
         inkscape:connector-curvature="0"
         id="path356-1"
         style="fill:#67bb49;fill-opacity:1;fill-rule:nonzero;stroke:none"
         d="m 1756.1832,1352.0938 -6.4225,-5.0675 22.3513,-28.295 6.4275,5.07 z" /><path
         inkscape:connector-curvature="0"
         id="path360-3"
         style="fill:#67bb49;fill-opacity:1;fill-rule:nonzero;stroke:none"
         d="m 1742.2864,1340.7789 -6.1325,-5.4175 23.83,-27.05 6.1412,5.4213 z" /><path
         inkscape:connector-curvature="0"
         id="path364-7"
         style="fill:#67bb49;fill-opacity:1;fill-rule:nonzero;stroke:none"
         d="m 1729.0183,1328.7339 -5.8325,-5.74 25.2462,-25.725 5.8476,5.7375 z" /><path
         inkscape:connector-curvature="0"
         id="path368-9"
         style="fill:#67bb49;fill-opacity:1;fill-rule:nonzero;stroke:none"
         d="m 1716.4162,1315.9995 -5.5238,-6.0475 26.6063,-24.3175 5.5187,6.0312 z" /><path
         inkscape:connector-curvature="0"
         id="path372-2"
         style="fill:#67bb49;fill-opacity:1;fill-rule:nonzero;stroke:none"
         d="m 1704.5114,1302.6005 -5.19,-6.3362 27.8713,-22.8638 5.19,6.3238 z" /><path
         inkscape:connector-curvature="0"
         id="path376-6"
         style="fill:#67bb49;fill-opacity:1;fill-rule:nonzero;stroke:none"
         d="m 1693.3459,1288.5794 -4.8387,-6.5912 29.06,-21.3388 4.8387,6.595 z" /><path
         inkscape:connector-curvature="0"
         id="path380-0"
         style="fill:#67bb49;fill-opacity:1;fill-rule:nonzero;stroke:none"
         d="m 1682.9496,1273.9779 -4.4875,-6.855 30.175,-19.735 4.48,6.8438 z" /><path
         inkscape:connector-curvature="0"
         id="path384-6"
         style="fill:#67bb49;fill-opacity:1;fill-rule:nonzero;stroke:none"
         d="m 1673.3439,1258.8258 -4.105,-7.0925 31.1875,-18.0737 4.1063,7.08 z" /><path
         inkscape:connector-curvature="0"
         id="path388-84"
         style="fill:#f9ae40;fill-opacity:1;fill-rule:nonzero;stroke:none"
         d="m 1664.5737,1243.1824 -3.7137,-7.305 32.1237,-16.3575 3.7112,7.2825 z" /><path
         inkscape:connector-curvature="0"
         id="path392-7"
         style="fill:#f9ae40;fill-opacity:1;fill-rule:nonzero;stroke:none"
         d="m 1656.6683,1227.0788 -3.3137,-7.475 32.9725,-14.6075 3.315,7.4825 z" /><path
         inkscape:connector-curvature="0"
         id="path396-5"
         style="fill:#f9ae40;fill-opacity:1;fill-rule:nonzero;stroke:none"
         d="m 1649.6488,1210.5713 -2.91,-7.6475 33.715,-12.7925 2.9087,7.6425 z" /><path
         inkscape:connector-curvature="0"
         id="path400-8"
         style="fill:#f9ae40;fill-opacity:1;fill-rule:nonzero;stroke:none"
         d="m 1643.5343,1193.7157 -2.4825,-7.795 34.35,-10.945 2.4863,7.8063 z" /><path
         inkscape:connector-curvature="0"
         id="path404-3"
         style="fill:#f9ae40;fill-opacity:1;fill-rule:nonzero;stroke:none"
         d="m 1638.3469,1176.539 -2.055,-7.9213 34.9013,-9.0525 2.0462,7.9226 z" /><path
         inkscape:connector-curvature="0"
         id="path408-5"
         style="fill:#f9ae40;fill-opacity:1;fill-rule:nonzero;stroke:none"
         d="m 1634.0972,1159.1189 -1.6188,-8.0162 35.3401,-7.1526 1.6174,8.0251 z" /><path
         inkscape:connector-curvature="0"
         id="path412-7"
         style="fill:#f9ae40;fill-opacity:1;fill-rule:nonzero;stroke:none"
         d="m 1630.8003,1141.4585 -1.1775,-8.0812 35.6725,-5.2338 1.19,8.1025 z" /><path
         inkscape:connector-curvature="0"
         id="path416-2"
         style="fill:#f9ae40;fill-opacity:1;fill-rule:nonzero;stroke:none"
         d="m 1628.4699,1123.7094 -0.74,-8.1512 35.9025,-3.2838 0.7388,8.155 z" /><path
         inkscape:connector-curvature="0"
         id="path420-36"
         style="fill:#f9ae40;fill-opacity:1;fill-rule:nonzero;stroke:none"
         d="m 1627.0982,1105.8245 -0.3075,-8.1875 36.0288,-1.3575 0.3112,8.1838 z" /><path
         inkscape:connector-curvature="0"
         id="path424-4"
         style="fill:#ef5a28;fill-opacity:1;fill-rule:nonzero;stroke:none"
         d="m 1626.6769,1087.9053 0.14,-8.1813 36.0413,0.5776 -0.1313,8.1849 z" /><path
         inkscape:connector-curvature="0"
         id="path428-43"
         style="fill:#ef5a28;fill-opacity:1;fill-rule:nonzero;stroke:none"
         d="m 1627.2174,1070.0188 0.5613,-8.1662 35.9662,2.4787 -0.5562,8.1613 z" /><path
         inkscape:connector-curvature="0"
         id="path432-8"
         style="fill:#ef5a28;fill-opacity:1;fill-rule:nonzero;stroke:none"
         d="m 1628.7079,1052.1572 1,-8.1237 35.785,4.3987 -1,8.13 z" /><path
         inkscape:connector-curvature="0"
         id="path436-9"
         style="fill:#ef5a28;fill-opacity:1;fill-rule:nonzero;stroke:none"
         d="m 1631.1568,1034.3942 1.4375,-8.0563 35.4962,6.3263 -1.4299,8.06 z" /><path
         inkscape:connector-curvature="0"
         id="path440-2"
         style="fill:#ef5a28;fill-opacity:1;fill-rule:nonzero;stroke:none"
         d="m 1634.5698,1016.7883 1.8763,-7.9687 35.0987,8.2525 -1.87,7.9675 z" /><path
         inkscape:connector-curvature="0"
         id="path444-9"
         style="fill:#ef5a28;fill-opacity:1;fill-rule:nonzero;stroke:none"
         d="m 1638.9358,999.3854 2.3013,-7.855 34.6037,10.1575 -2.3087,7.8462 z" /><path
         inkscape:connector-curvature="0"
         id="path448-4"
         style="fill:#ef5a28;fill-opacity:1;fill-rule:nonzero;stroke:none"
         d="m 1644.2386,982.23828 2.7313,-7.7075 33.9974,12.01625 -2.7287,7.70875 z" /><path
         inkscape:connector-curvature="0"
         id="path452-3"
         style="fill:#ef5a28;fill-opacity:1;fill-rule:nonzero;stroke:none"
         d="m 1650.4655,965.42803 3.1488,-7.5575 33.2937,13.84625 -3.14,7.56125 z" /><path
         inkscape:connector-curvature="0"
         id="path456-2"
         style="fill:#ef5a28;fill-opacity:1;fill-rule:nonzero;stroke:none"
         d="m 1657.6072,948.96415 3.5475,-7.38375 32.4838,15.64 -3.5451,7.37 z" /><path
         inkscape:connector-curvature="0"
         id="path460-6"
         style="fill:#ef5a28;fill-opacity:1;fill-rule:nonzero;stroke:none"
         d="m 1665.6211,932.9199 3.9363,-7.17375 31.6,17.37875 -3.9425,7.17125 z" /><path
         inkscape:connector-curvature="0"
         id="path464-8"
         style="fill:#f8eb31;fill-opacity:1;fill-rule:nonzero;stroke:none"
         d="m 1674.4904,917.33253 4.3275,-6.945 30.6075,19.055 -4.3225,6.945 z" /><path
         inkscape:connector-curvature="0"
         id="path468-3"
         style="fill:#f8eb31;fill-opacity:1;fill-rule:nonzero;stroke:none"
         d="m 1684.1936,902.24903 4.6888,-6.69875 29.54,20.67375 -4.6913,6.70875 z" /><path
         inkscape:connector-curvature="0"
         id="path472-8"
         style="fill:#f8eb31;fill-opacity:1;fill-rule:nonzero;stroke:none"
         d="m 1694.6858,887.7194 5.0513,-6.44375 28.3775,22.24 -5.0476,6.445 z" /><path
         inkscape:connector-curvature="0"
         id="path476-7"
         style="fill:#f8eb31;fill-opacity:1;fill-rule:nonzero;stroke:none"
         d="m 1705.9464,873.78078 5.385,-6.1625 27.1513,23.7375 -5.39,6.1575 z" /><path
         inkscape:connector-curvature="0"
         id="path480-7"
         style="fill:#f8eb31;fill-opacity:1;fill-rule:nonzero;stroke:none"
         d="m 1717.9442,860.45053 5.7125,-5.85875 25.8225,25.155 -5.7025,5.85375 z" /><path
         inkscape:connector-curvature="0"
         id="path484-83"
         style="fill:#f8eb31;fill-opacity:1;fill-rule:nonzero;stroke:none"
         d="m 1730.6281,847.8034 6.015,-5.54875 24.45,26.51 -6.0237,5.54 z" /><path
         inkscape:connector-curvature="0"
         id="path488-1"
         style="fill:#54c9e8;fill-opacity:1;fill-rule:nonzero;stroke:none"
         d="m 1761.9319,835.65565 c 0,-6.18875 5.0225,-11.21375 11.2063,-11.21375 6.1912,0 11.2162,5.025 11.2162,11.21375 0,6.19125 -5.025,11.2125 -11.2162,11.2125 -6.1838,0 -11.2063,-5.02125 -11.2063,-11.2125" /><path
         inkscape:connector-curvature="0"
         id="path492-6"
         style="fill:#fef000;fill-opacity:1;fill-rule:nonzero;stroke:none"
         d="m 1934.1316,786.47753 c -6.19,0 -11.2113,-5.02625 -11.2113,-11.2025 0,-6.19625 5.0213,-11.22125 11.2113,-11.22125 6.1875,0 11.2062,5.025 11.2062,11.22125 0,6.17625 -5.0187,11.2025 -11.2062,11.2025" /></g><g
       inkscape:export-ydpi="96"
       inkscape:export-xdpi="96"
       inkscape:export-filename="/home/dz/Imagens/dz.png"
       transform="matrix(0.51111095,0,0,0.51111089,-56.46484,-74.856789)"
       id="g9529-6"><g
         id="g4848-4"
         transform="matrix(1.0612032,0,0,-1.0612032,490.83444,392.57336)"><path
           d="m 0,0 c -8.91,16.698 -29.688,23.005 -46.385,14.094 -10.521,-5.617 -16.898,-15.919 -17.983,-26.958 -2.785,-22.713 -16.184,-43.765 -37.898,-55.352 -35.419,-18.909 -79.493,-5.51 -98.397,29.91 -18.906,35.418 -5.504,79.48 29.917,98.387 21.691,11.576 46.636,11.002 67.029,0.686 0.37,-0.181 0.766,-0.346 1.119,-0.536 0.141,-0.076 0.279,-0.144 0.409,-0.201 9.466,-4.522 20.889,-4.667 30.86,0.654 16.658,8.89 22.954,29.624 14.06,46.282 -3.488,6.536 -8.792,11.454 -14.945,14.51 l 0.018,0.06 c -39.747,20.305 -88.408,21.52 -130.77,-1.091 -68.775,-36.709 -94.758,-122.202 -58.053,-190.967 36.698,-68.755 122.193,-94.759 190.968,-58.049 41.359,22.071 67.166,61.824 73.23,104.96 C 4.917,-15.883 4.023,-7.529 0,0"
           style="fill:#009bb6;fill-opacity:1;fill-rule:nonzero;stroke:none"
           id="path4850-1"
           inkscape:connector-curvature="0" /></g><g
         transform="matrix(0.82257295,0,0,0.82257295,1359.4811,232.93176)"
         id="g9469-5-1"><path
           inkscape:connector-curvature="0"
           id="path4854-4-5-6-2"
           style="fill:#fbad3b;fill-opacity:1;fill-rule:nonzero;stroke:none"
           d="m -55.829,-84.017 c -15.366,-8.195 -32.882,-8.327 -47.692,-1.877 -15.311,10.074 -35.505,11.687 -52.813,2.454 -25.192,-13.45 -34.724,-44.778 -21.271,-69.981 13.446,-25.195 44.782,-34.709 69.974,-21.265 16.226,8.66 25.914,24.784 27.168,41.894 2.192,17.013 12.262,32.749 28.546,41.441"
           sodipodi:nodetypes="ccccccc"
           transform="matrix(-0.89934223,0.02647463,0.02647463,0.89934223,-1175.4992,228.04854)" /><g
           transform="matrix(1.3186666,0,0,-1.3186666,-1057.0233,31.521227)"
           id="g4852-5-85-1"><path
             inkscape:connector-curvature="0"
             id="path4854-4-7-9"
             style="fill:#fbad3b;fill-opacity:1;fill-rule:nonzero;stroke:none"
             d="m -55.43403,-85.201909 c -15.366,-8.195 -33.27697,-7.142091 -48.08697,-0.692091 -15.311,10.074 -35.505,11.687 -52.813,2.454 -25.192,-13.45 -34.724,-44.778 -21.271,-69.981 13.446,-25.195 44.782,-34.709 69.974,-21.265 16.226,8.66 25.914,24.784 27.168,41.894 2.192,17.013 10.731493,33.499442 27.015493,42.191442"
             sodipodi:nodetypes="ccccccc" /></g></g></g></g></svg>