<?xml version="1.0" encoding="UTF-8" standalone="no"?>
<!-- Generator: Adobe Illustrator 16.0.0, SVG Export Plug-In . SVG Version: 6.00 Build 0)  -->

<svg
   xmlns:dc="http://purl.org/dc/elements/1.1/"
   xmlns:cc="http://creativecommons.org/ns#"
   xmlns:rdf="http://www.w3.org/1999/02/22-rdf-syntax-ns#"
   xmlns:svg="http://www.w3.org/2000/svg"
   xmlns="http://www.w3.org/2000/svg"
   xmlns:sodipodi="http://sodipodi.sourceforge.net/DTD/sodipodi-0.dtd"
   xmlns:inkscape="http://www.inkscape.org/namespaces/inkscape"
   version="1.1"
   id="root"
   x="0px"
   y="0px"
   width="1280"
   height="720"
   viewBox="0 0 1280 720"
   enable-background="new 0 0 1920 1080"
   xml:space="preserve"
   inkscape:version="0.92.4 5da689c313, 2019-01-14"
   sodipodi:docname="1280x720.svg"><metadata
     id="metadata190"><rdf:RDF><cc:Work
         rdf:about=""><dc:format>image/svg+xml</dc:format><dc:type
           rdf:resource="http://purl.org/dc/dcmitype/StillImage" /><dc:title /></cc:Work></rdf:RDF></metadata><defs
     id="defs188" /><sodipodi:namedview
     pagecolor="#ffffff"
     bordercolor="#666666"
     borderopacity="1"
     objecttolerance="10"
     gridtolerance="10"
     guidetolerance="10"
     inkscape:pageopacity="0"
     inkscape:pageshadow="2"
     inkscape:window-width="1366"
     inkscape:window-height="707"
     id="namedview186"
     showgrid="false"
     inkscape:zoom="0.43703704"
     inkscape:cx="-175.17016"
     inkscape:cy="358.90653"
     inkscape:window-x="0"
     inkscape:window-y="0"
     inkscape:window-maximized="1"
     inkscape:current-layer="root"
     fit-margin-top="0"
     fit-margin-left="0"
     fit-margin-right="0"
     fit-margin-bottom="0" /><g
     id="background"
     transform="matrix(0.66667,0,0,0.66667,-9.7791138e-6,6.3175354e-6)"><g
       id="background_1_"><linearGradient
         id="SVGID_1_"
         gradientUnits="userSpaceOnUse"
         x1="-1423.4111"
         y1="-3714.9932"
         x2="-1423.4116"
         y2="-2611.604"
         gradientTransform="translate(2381.0391,3709.0381)"><stop
           offset="0"
           style="stop-color:#133356"
           id="stop6" /><stop
           offset="0.5025"
           style="stop-color:#7C9999"
           id="stop8" /><stop
           offset="1"
           style="stop-color:#333333"
           id="stop10" /></linearGradient><rect
         style="fill:url(#SVGID_1_)"
         x="-9.3599997"
         y="-8.6099997"
         width="1933.976"
         height="1105.453"
         id="rect12" /></g><g
       id="Layer_4"><radialGradient
         id="SVGID_2_"
         cx="-1527.168"
         cy="-2837.2524"
         r="916.00623"
         gradientTransform="matrix(1.0299,0,0,1.0518,2440.2478,3498.9629)"
         gradientUnits="userSpaceOnUse"><stop
           offset="0"
           style="stop-color:#E4C8A5;stop-opacity:0.5"
           id="stop16" /><stop
           offset="0.1429"
           style="stop-color:#AEAB93;stop-opacity:0.4372"
           id="stop18" /><stop
           offset="0.3797"
           style="stop-color:#587E77;stop-opacity:0.3331"
           id="stop20" /><stop
           offset="0.4877"
           style="stop-color:#366C6C;stop-opacity:0.2857"
           id="stop22" /></radialGradient><rect
         style="fill:url(#SVGID_2_)"
         x="-9.3599997"
         y="-7.921"
         width="1933.976"
         height="1104.42"
         id="rect24" /></g></g><g
     id="glows"
     transform="matrix(0.66667,0,0,0.66667,-9.7791138e-6,6.3175354e-6)"><radialGradient
       id="SVGID_3_"
       cx="-880.3291"
       cy="-3202.9609"
       r="271.4404"
       gradientTransform="translate(2381.0391,3709.0381)"
       gradientUnits="userSpaceOnUse"><stop
         offset="0"
         style="stop-color:#FFFCDD"
         id="stop28" /><stop
         offset="1"
         style="stop-color:#FEF9C8;stop-opacity:0"
         id="stop30" /></radialGradient><circle
       style="opacity:0.2;fill:url(#SVGID_3_)"
       enable-background="new    "
       cx="1500.71"
       cy="506.077"
       r="271.44101"
       id="circle32" /><radialGradient
       id="SVGID_4_"
       cx="-1031.0767"
       cy="-3296.374"
       r="214.85229"
       gradientTransform="translate(2381.0391,3709.0381)"
       gradientUnits="userSpaceOnUse"><stop
         offset="0"
         style="stop-color:#99CCCC"
         id="stop35" /><stop
         offset="1"
         style="stop-color:#FEF9C8;stop-opacity:0"
         id="stop37" /></radialGradient><circle
       style="opacity:0.2;fill:url(#SVGID_4_)"
       enable-background="new    "
       cx="1349.963"
       cy="412.664"
       r="214.853"
       id="circle39" /><radialGradient
       id="SVGID_5_"
       cx="-1958.4556"
       cy="-3333.3179"
       r="284.84991"
       gradientTransform="translate(2381.0391,3709.0381)"
       gradientUnits="userSpaceOnUse"><stop
         offset="0"
         style="stop-color:#FFFCDD"
         id="stop42" /><stop
         offset="1"
         style="stop-color:#FEF9C8;stop-opacity:0"
         id="stop44" /></radialGradient><circle
       style="opacity:0.1;fill:url(#SVGID_5_)"
       enable-background="new    "
       cx="422.58301"
       cy="375.72"
       r="284.85001"
       id="circle46" /><radialGradient
       id="SVGID_6_"
       cx="-1775.687"
       cy="-3149.5332"
       r="284.84961"
       gradientTransform="translate(2381.0391,3709.0381)"
       gradientUnits="userSpaceOnUse"><stop
         offset="0"
         style="stop-color:#FFFCDD"
         id="stop49" /><stop
         offset="1"
         style="stop-color:#FEF9C8;stop-opacity:0"
         id="stop51" /></radialGradient><circle
       style="opacity:0.1;fill:url(#SVGID_6_)"
       enable-background="new    "
       cx="605.35199"
       cy="559.505"
       r="284.85001"
       id="circle53" /><radialGradient
       id="SVGID_7_"
       cx="-1682.0327"
       cy="-3059.2822"
       r="364.40259"
       gradientTransform="translate(2381.0391,3709.0381)"
       gradientUnits="userSpaceOnUse"><stop
         offset="0"
         style="stop-color:#FFFCDD"
         id="stop56" /><stop
         offset="1"
         style="stop-color:#FEF9C8;stop-opacity:0"
         id="stop58" /></radialGradient><circle
       style="opacity:0.1;fill:url(#SVGID_7_)"
       enable-background="new    "
       cx="699.00598"
       cy="649.75598"
       r="364.40302"
       id="circle60" /><radialGradient
       id="SVGID_8_"
       cx="-1087.5537"
       cy="-3134.8853"
       r="364.40161"
       gradientTransform="translate(2381.0391,3709.0381)"
       gradientUnits="userSpaceOnUse"><stop
         offset="0"
         style="stop-color:#FFFCDD"
         id="stop63" /><stop
         offset="1"
         style="stop-color:#FEF9C8;stop-opacity:0"
         id="stop65" /></radialGradient><path
       inkscape:connector-curvature="0"
       style="opacity:0.1;fill:url(#SVGID_8_)"
       enable-background="new    "
       d="m 1293.485,209.751 c 201.253,0 364.401,163.145 364.401,364.402 0,201.259 -163.148,364.401 -364.401,364.401 -201.253,0 -364.402,-163.146 -364.402,-364.399 0,-201.257 163.149,-364.404 364.402,-364.404 z"
       id="path67" /><radialGradient
       id="SVGID_9_"
       cx="-1716.2007"
       cy="-3280.7095"
       r="364.40231"
       gradientTransform="translate(2381.0391,3709.0381)"
       gradientUnits="userSpaceOnUse"><stop
         offset="0"
         style="stop-color:#99CCCC"
         id="stop70" /><stop
         offset="1"
         style="stop-color:#FEF9C8;stop-opacity:0"
         id="stop72" /></radialGradient><circle
       style="opacity:0.2;fill:url(#SVGID_9_)"
       enable-background="new    "
       cx="664.83899"
       cy="428.32901"
       r="364.40201"
       id="circle74" /><radialGradient
       id="SVGID_10_"
       cx="-807.90039"
       cy="-3263.2104"
       r="364.40259"
       gradientTransform="translate(2381.0391,3709.0381)"
       gradientUnits="userSpaceOnUse"><stop
         offset="0"
         style="stop-color:#FFFCDD"
         id="stop77" /><stop
         offset="1"
         style="stop-color:#FEF9C8;stop-opacity:0"
         id="stop79" /></radialGradient><circle
       style="opacity:0.2;fill:url(#SVGID_10_)"
       enable-background="new    "
       cx="1573.139"
       cy="445.828"
       r="364.40302"
       id="circle81" /><radialGradient
       id="SVGID_11_"
       cx="-914.67383"
       cy="-3006.5586"
       r="364.40231"
       gradientTransform="translate(2381.0391,3709.0381)"
       gradientUnits="userSpaceOnUse"><stop
         offset="0"
         style="stop-color:#99CCCC"
         id="stop84" /><stop
         offset="1"
         style="stop-color:#FEF9C8;stop-opacity:0"
         id="stop86" /></radialGradient><circle
       style="opacity:0.2;fill:url(#SVGID_11_)"
       enable-background="new    "
       cx="1466.365"
       cy="702.47998"
       r="364.40201"
       id="circle88" /></g><g
     id="octopus_1_"
     transform="matrix(0.66667,0,0,0.66667,-9.7791138e-6,6.3175354e-6)"><radialGradient
       id="SVGID_12_"
       cx="13584.957"
       cy="3721.3525"
       r="684.92249"
       gradientTransform="matrix(-1,0,0,-1,14686.324,4480.377)"
       gradientUnits="userSpaceOnUse"><stop
         offset="0"
         style="stop-color:#BCCCB3"
         id="stop92" /><stop
         offset="1"
         style="stop-color:#FEF9C8;stop-opacity:0"
         id="stop94" /></radialGradient><path
       inkscape:connector-curvature="0"
       style="opacity:0.1;fill:url(#SVGID_12_)"
       enable-background="new    "
       d="m 383.459,270.992 c 0,0 -161.611,198.069 -107.826,408.315 90.922,355.392 366.209,412.201 812.128,311.096 785.779,-178.168 812.933,219.711 807.101,256.653 l 42.657,-61.847 C 1943.352,1148.267 1916.192,750.395 1130.42,928.555 684.498,1029.661 409.211,972.856 318.292,617.46 264.508,407.218 383.459,270.992 383.459,270.992"
       id="path96" /><radialGradient
       id="SVGID_13_"
       cx="13381.236"
       cy="3981.4307"
       r="1372.6528"
       gradientTransform="matrix(-1,0,0,-1,14686.324,4480.377)"
       gradientUnits="userSpaceOnUse"><stop
         offset="0"
         style="stop-color:#BCCCB3"
         id="stop99" /><stop
         offset="1"
         style="stop-color:#FEF9C8;stop-opacity:0"
         id="stop101" /></radialGradient><path
       inkscape:connector-curvature="0"
       style="opacity:0.5;fill:url(#SVGID_13_)"
       enable-background="new    "
       d="m 235.482,169.127 c 0,0 -161.611,198.072 -107.828,408.317 90.921,355.39 366.207,412.199 812.131,311.095 785.769,-178.168 812.931,219.709 807.098,256.652 l 55.174,-5.571 C 1829.435,1077.132 1768.213,648.53 982.444,826.692 536.521,927.798 261.235,870.987 170.316,515.596 116.531,305.353 235.482,169.127 235.482,169.127"
       id="path103" /><radialGradient
       id="SVGID_14_"
       cx="13519.34"
       cy="3746.4355"
       r="684.92102"
       gradientTransform="matrix(-1,0,0,-1,14686.324,4480.377)"
       gradientUnits="userSpaceOnUse"><stop
         offset="0"
         style="stop-color:#BCCCB3"
         id="stop106" /><stop
         offset="1"
         style="stop-color:#FEF9C8;stop-opacity:0"
         id="stop108" /></radialGradient><path
       inkscape:connector-curvature="0"
       style="opacity:0.2;fill:url(#SVGID_14_)"
       enable-background="new    "
       d="m 449.079,245.911 c 0,0 -161.611,198.073 -107.828,408.314 90.922,355.394 366.208,412.199 812.128,311.096 785.771,-178.162 812.933,219.709 807.1,256.651 l 42.658,-61.839 C 2008.97,1123.191 1981.81,725.311 1196.038,903.479 750.117,1004.585 474.83,947.774 383.911,592.384 330.127,382.135 449.079,245.911 449.079,245.911"
       id="path110" /><linearGradient
       id="SVGID_15_"
       gradientUnits="userSpaceOnUse"
       x1="12747.42"
       y1="3910.3242"
       x2="14452.203"
       y2="3910.3242"
       gradientTransform="matrix(-1,0,0,-1,14686.324,4480.377)"><stop
         offset="0"
         style="stop-color:#ABCCB3;stop-opacity:0.7"
         id="stop113" /><stop
         offset="0.33"
         style="stop-color:#B4CFB5;stop-opacity:0.05"
         id="stop115" /><stop
         offset="0.803"
         style="stop-color:#C1D4B7;stop-opacity:0.5"
         id="stop117" /><stop
         offset="1"
         style="stop-color:#FEF9C8;stop-opacity:0"
         id="stop119" /></linearGradient><path
       inkscape:connector-curvature="0"
       style="opacity:0.4;fill:url(#SVGID_15_)"
       enable-background="new    "
       d="m 234.122,395.557 c 0,0 46.072,-174.883 250.301,-248.261 380.134,-155.523 599.966,158.606 731.945,472.082 11.666,27.705 40.83,97.698 88.949,231.851 63.561,177.193 150.193,179.351 342.267,143.215 296.29,-67.183 276.379,82.848 274.173,96.779 l 16.085,-23.315 c 2.208,-13.928 22.115,-163.959 -274.173,-96.784 -183.259,39.2 -272.41,-1.188 -323.818,-135.941 C 1288.439,700.437 1285.274,695.391 1236.78,571.259 1070.404,145.353 879.534,-23.687 511.697,77.291 307.473,150.671 234.122,395.557 234.122,395.557"
       id="path121" /></g><g
     id="rounds"
     transform="matrix(0.66667,0,0,0.66667,-9.7791138e-6,6.3175354e-6)"><path
       style="fill:none;stroke:#ffffff;stroke-width:2;stroke-miterlimit:10"
       inkscape:connector-curvature="0"
       stroke-miterlimit="10"
       d="M 1234.628,684.753"
       id="path124" /><circle
       style="opacity:0.3;fill:#ffffff"
       enable-background="new    "
       cx="1166.981"
       cy="722.20801"
       r="12.742"
       id="circle126" /><circle
       style="opacity:0.2;fill:#ffffff"
       enable-background="new    "
       cx="1501.709"
       cy="542.349"
       r="12.744"
       id="circle128" /><circle
       style="opacity:0.1;fill:#ffffff"
       enable-background="new    "
       cx="1728.585"
       cy="285.548"
       r="12.742"
       id="circle130" /><circle
       style="opacity:0.4;fill:#ffffff"
       enable-background="new    "
       cx="779.93103"
       cy="800.89203"
       r="12.743"
       id="circle132" /></g></svg>