<?xml version="1.0" encoding="UTF-8" standalone="no"?>
<svg xmlns:rdf="http://www.w3.org/1999/02/22-rdf-syntax-ns#" xmlns="http://www.w3.org/2000/svg" version="1.1" xmlns:cc="http://creativecommons.org/ns#" xmlns:xlink="http://www.w3.org/1999/xlink" viewBox="0 0 15.999989 16.000096" xmlns:dc="http://purl.org/dc/elements/1.1/">
<metadata>
<rdf:RDF>
<cc:Work rdf:about="">
<dc:format>image/svg+xml</dc:format>
<dc:type rdf:resource="http://purl.org/dc/dcmitype/StillImage"/>
</cc:Work>
</rdf:RDF>
</metadata>
<defs>
<linearGradient id="c" y2="182.083" gradientUnits="userSpaceOnUse" x2="979.2319" gradientTransform="translate(0,-7)" y1="178.0314" x1="968.2573">
<stop stop-color="#e7eaf0" offset="0"/>
<stop stop-color="#bacadd" offset="1"/>
</linearGradient>
<linearGradient id="b" y2="184.715" xlink:href="#a" gradientUnits="userSpaceOnUse" x2="974.5747" gradientTransform="translate(0,-7)" y1="178.9373" x1="967.739"/>
<linearGradient id="e" y2="184.8026" gradientUnits="userSpaceOnUse" x2="979.8044" y1="182.4686" x1="974.1975">
<stop stop-color="#fff" offset="0"/>
<stop stop-color="#aaa" offset="1"/>
</linearGradient>
<linearGradient id="a">
<stop stop-color="#5a5a5a" offset="0"/>
<stop offset="1"/>
</linearGradient>
<linearGradient id="d" y2="184.6266" xlink:href="#a" gradientUnits="userSpaceOnUse" x2="977.4031" y1="180.7934" x1="967.6506"/>
</defs>
<g transform="translate(-964.95901 -169.96083)" fill-rule="evenodd">
<path d="m973.5 180 2.5-3h-2v-5l-1 1v4h-2l2.5 3z"/>
<path stroke-linejoin="round" style="color:#000000" d="m969.5 175.5h11l-4-5h-11l4 5z" transform="translate(-.0410002 9.96088)" stroke="url(#b)" stroke-linecap="square" stroke-miterlimit="0" stroke-width="1.0000962" fill="url(#c)"/>
<path opacity=".4809384" stroke-linejoin="round" style="color:#000000" d="m969.5 185.5h11l-4-5h-11l4 5z" transform="translate(-.0409998 -10.03912)" stroke="url(#d)" stroke-linecap="square" stroke-miterlimit="0" stroke-width="1.0000962" fill="url(#e)"/>
</g>
</svg>
