<?xml version="1.0" encoding="UTF-8" standalone="no"?>
<svg xmlns:rdf="http://www.w3.org/1999/02/22-rdf-syntax-ns#" xmlns="http://www.w3.org/2000/svg" version="1.1" xmlns:cc="http://creativecommons.org/ns#" xmlns:xlink="http://www.w3.org/1999/xlink" viewBox="0 0 15.99917 16.00001" xmlns:dc="http://purl.org/dc/elements/1.1/">
<metadata>
<rdf:RDF>
<cc:Work rdf:about="">
<dc:format>image/svg+xml</dc:format>
<dc:type rdf:resource="http://purl.org/dc/dcmitype/StillImage"/>
</cc:Work>
</rdf:RDF>
</metadata>
<defs>
<linearGradient id="a" y2="215.9465" gradientUnits="userSpaceOnUse" x2="143.2251" gradientTransform="translate(158,-105)" y1="214.8174" x1="148">
<stop offset="0"/>
<stop stop-color="#7f7f7f" offset=".35076979"/>
<stop stop-color="#bfbfbf" offset=".59668732"/>
<stop stop-color="#dfdfdf" offset=".78382427"/>
<stop stop-color="#fff" offset="1"/>
</linearGradient>
</defs>
<g transform="translate(-281,-110)">
<rect stroke-linejoin="round" style="color:#000000" height="15.00001" width="14.99917" stroke="#c00" stroke-linecap="square" stroke-dasharray="1.0000001, 2.0000002" y="110.5" x="281.5" stroke-width="1.0000001" fill="none"/>
<g transform="matrix(.5 0 0 .5 133.9992 61.99999)" fill-rule="evenodd">
<path d="m302 115 2-2v-11h-3l-2 2h-1v-4h16v4h-1l-2-2h-3v11l2 2v1h-8v-1z"/>
<path fill="url(#a)" d="m304 115 1-1v-12h2v12l1 1h-4z"/>
</g>
<path fill-rule="evenodd" fill="#c80000" d="m290 119h1l1.5 1.5 1.5-1.5h1v1l-1.5 1.5 1.5 1.5v1h-1l-1.5-1.5-1.5 1.5h-1v-1l1.5-1.5-1.5-1.5v-1z"/>
</g>
</svg>
