<?xml version="1.0" encoding="UTF-8" standalone="no"?>
<!-- Created with Inkscape (http://www.inkscape.org/) -->

<svg
   xmlns:dc="http://purl.org/dc/elements/1.1/"
   xmlns:cc="http://creativecommons.org/ns#"
   xmlns:rdf="http://www.w3.org/1999/02/22-rdf-syntax-ns#"
   xmlns:svg="http://www.w3.org/2000/svg"
   xmlns="http://www.w3.org/2000/svg"
   xmlns:xlink="http://www.w3.org/1999/xlink"
   xmlns:sodipodi="http://sodipodi.sourceforge.net/DTD/sodipodi-0.dtd"
   xmlns:inkscape="http://www.inkscape.org/namespaces/inkscape"
   width="210mm"
   height="297mm"
   id="svg2"
   version="1.1"
   inkscape:version="0.92.3 (11504fc, 2018-09-15)"
   sodipodi:docname="text.svg">
  <defs
     id="defs4">
    <linearGradient
       id="linearGradient10403">
      <stop
         style="stop-color:#729fff;stop-opacity:1"
         offset="0"
         id="stop10405" />
      <stop
         id="stop10413"
         offset="0.68393415"
         style="stop-color:#729f00;stop-opacity:1;" />
      <stop
         style="stop-color:#729f00;stop-opacity:1;"
         offset="0.75"
         id="stop10415" />
      <stop
         id="stop10417"
         offset="0.875"
         style="stop-color:#ff9f00;stop-opacity:1;" />
      <stop
         style="stop-color:#ff9f00;stop-opacity:1;"
         offset="1"
         id="stop10407" />
    </linearGradient>
    <linearGradient
       inkscape:collect="always"
       xlink:href="#linearGradient4562"
       id="linearGradient4564"
       x1="65.8984222412109"
       y1="51.2172775268555"
       x2="88.7668762207031"
       y2="64.2290954589844"
       gradientUnits="userSpaceOnUse" />
    <linearGradient
       inkscape:collect="always"
       id="linearGradient4562">
      <stop
         style="stop-color:#cc0000;stop-opacity:1"
         offset="0"
         id="stop4558" />
      <stop
         id="stop4566"
         offset="0.5327826738"
         style="stop-color:#ff9900;stop-opacity:1" />
      <stop
         style="stop-color:#99cc33;stop-opacity:1"
         offset="1"
         id="stop4560" />
    </linearGradient>
    <pattern
       inkscape:collect="always"
       xlink:href="#Polkadots-large"
       id="pattern6141"
       patternTransform="scale(0.545214929397272)" />
    <pattern
       inkscape:stockid="Polka dots, large"
       id="Polkadots-large"
       patternTransform="translate(0,0) scale(10,10)"
       height="10"
       width="10"
       patternUnits="userSpaceOnUse"
       inkscape:collect="always">
      <circle
         id="circle5734"
         r="0.45"
         cy="0.810"
         cx="2.567"
         style="fill:black;stroke:none" />
      <circle
         id="circle5736"
         r="0.45"
         cy="2.33"
         cx="3.048"
         style="fill:black;stroke:none" />
      <circle
         id="circle5738"
         r="0.45"
         cy="2.415"
         cx="4.418"
         style="fill:black;stroke:none" />
      <circle
         id="circle5740"
         r="0.45"
         cy="3.029"
         cx="1.844"
         style="fill:black;stroke:none" />
      <circle
         id="circle5742"
         r="0.45"
         cy="1.363"
         cx="6.08"
         style="fill:black;stroke:none" />
      <circle
         id="circle5744"
         r="0.45"
         cy="4.413"
         cx="5.819"
         style="fill:black;stroke:none" />
      <circle
         id="circle5746"
         r="0.45"
         cy="4.048"
         cx="4.305"
         style="fill:black;stroke:none" />
      <circle
         id="circle5748"
         r="0.45"
         cy="3.045"
         cx="5.541"
         style="fill:black;stroke:none" />
      <circle
         id="circle5750"
         r="0.45"
         cy="5.527"
         cx="4.785"
         style="fill:black;stroke:none" />
      <circle
         id="circle5752"
         r="0.45"
         cy="5.184"
         cx="2.667"
         style="fill:black;stroke:none" />
      <circle
         id="circle5754"
         r="0.45"
         cy="1.448"
         cx="7.965"
         style="fill:black;stroke:none" />
      <circle
         id="circle5756"
         r="0.45"
         cy="5.049"
         cx="7.047"
         style="fill:black;stroke:none" />
      <circle
         id="circle5758"
         r="0.45"
         cy="0.895"
         cx="4.340"
         style="fill:black;stroke:none" />
      <circle
         id="circle5760"
         r="0.45"
         cy="0.340"
         cx="7.125"
         style="fill:black;stroke:none" />
      <circle
         id="circle5762"
         r="0.45"
         cy="1.049"
         cx="9.553"
         style="fill:black;stroke:none" />
      <circle
         id="circle5764"
         r="0.45"
         cy="2.689"
         cx="7.006"
         style="fill:black;stroke:none" />
      <circle
         id="circle5766"
         r="0.45"
         cy="2.689"
         cx="8.909"
         style="fill:black;stroke:none" />
      <circle
         id="circle5768"
         r="0.45"
         cy="4.407"
         cx="9.315"
         style="fill:black;stroke:none" />
      <circle
         id="circle5770"
         r="0.45"
         cy="3.870"
         cx="7.820"
         style="fill:black;stroke:none" />
      <circle
         id="circle5772"
         r="0.45"
         cy="5.948"
         cx="8.270"
         style="fill:black;stroke:none" />
      <circle
         id="circle5774"
         r="0.45"
         cy="7.428"
         cx="7.973"
         style="fill:black;stroke:none" />
      <circle
         id="circle5776"
         r="0.45"
         cy="8.072"
         cx="9.342"
         style="fill:black;stroke:none" />
      <circle
         id="circle5778"
         r="0.45"
         cy="9.315"
         cx="8.206"
         style="fill:black;stroke:none" />
      <circle
         id="circle5780"
         r="0.45"
         cy="9.475"
         cx="9.682"
         style="fill:black;stroke:none" />
      <circle
         id="circle5782"
         r="0.45"
         cy="6.186"
         cx="9.688"
         style="fill:black;stroke:none" />
      <circle
         id="circle5784"
         r="0.45"
         cy="6.296"
         cx="3.379"
         style="fill:black;stroke:none" />
      <circle
         id="circle5786"
         r="0.45"
         cy="8.204"
         cx="2.871"
         style="fill:black;stroke:none" />
      <circle
         id="circle5788"
         r="0.45"
         cy="8.719"
         cx="4.59"
         style="fill:black;stroke:none" />
      <circle
         id="circle5790"
         r="0.45"
         cy="9.671"
         cx="3.181"
         style="fill:black;stroke:none" />
      <circle
         id="circle5792"
         r="0.45"
         cy="7.315"
         cx="5.734"
         style="fill:black;stroke:none" />
      <circle
         id="circle5794"
         r="0.45"
         cy="6.513"
         cx="6.707"
         style="fill:black;stroke:none" />
      <circle
         id="circle5796"
         r="0.45"
         cy="9.670"
         cx="5.730"
         style="fill:black;stroke:none" />
      <circle
         id="circle5798"
         r="0.45"
         cy="8.373"
         cx="6.535"
         style="fill:black;stroke:none" />
      <circle
         id="circle5800"
         r="0.45"
         cy="7.154"
         cx="4.37"
         style="fill:black;stroke:none" />
      <circle
         id="circle5802"
         r="0.45"
         cy="7.25"
         cx="0.622"
         style="fill:black;stroke:none" />
      <circle
         id="circle5804"
         r="0.45"
         cy="5.679"
         cx="0.831"
         style="fill:black;stroke:none" />
      <circle
         id="circle5806"
         r="0.45"
         cy="8.519"
         cx="1.257"
         style="fill:black;stroke:none" />
      <circle
         id="circle5808"
         r="0.45"
         cy="6.877"
         cx="1.989"
         style="fill:black;stroke:none" />
      <circle
         id="circle5810"
         r="0.45"
         cy="3.181"
         cx="0.374"
         style="fill:black;stroke:none" />
      <circle
         id="circle5812"
         r="0.45"
         cy="1.664"
         cx="1.166"
         style="fill:black;stroke:none" />
      <circle
         id="circle5814"
         r="0.45"
         cy="0.093"
         cx="1.151"
         style="fill:black;stroke:none" />
      <circle
         id="circle5816"
         r="0.45"
         cy="10.093"
         cx="1.151"
         style="fill:black;stroke:none" />
      <circle
         id="circle5818"
         r="0.45"
         cy="4.451"
         cx="1.302"
         style="fill:black;stroke:none" />
      <circle
         id="circle5820"
         r="0.45"
         cy="3.763"
         cx="3.047"
         style="fill:black;stroke:none" />
    </pattern>
    <pattern
       inkscape:collect="always"
       xlink:href="#Polkadots-large"
       id="pattern7007"
       patternTransform="scale(0.545214929397272)" />
  </defs>
  <sodipodi:namedview
     id="base"
     pagecolor="#ffffff"
     bordercolor="#666666"
     borderopacity="1.0"
     inkscape:pageopacity="0.0"
     inkscape:pageshadow="2"
     inkscape:zoom="0.289809434275981"
     inkscape:cx="436.951699682481"
     inkscape:cy="676.767541084954"
     inkscape:document-units="px"
     inkscape:current-layer="layer1"
     showgrid="false"
     inkscape:window-width="1280"
     inkscape:window-height="964"
     inkscape:window-x="0"
     inkscape:window-y="0"
     inkscape:window-maximized="1" />
  <metadata
     id="metadata7">
    <rdf:RDF>
      <cc:Work
         rdf:about="">
        <dc:format>image/svg+xml</dc:format>
        <dc:type
           rdf:resource="http://purl.org/dc/dcmitype/StillImage" />
        <dc:title />
      </cc:Work>
    </rdf:RDF>
  </metadata>
  <g
     inkscape:label="Calque 1"
     inkscape:groupmode="layer"
     id="layer1">
    <text
       xml:space="preserve"
       style="color:#000000;font-style:normal;font-variant:normal;font-weight:normal;font-stretch:normal;line-height:0%;font-family:Kleptocracy;-inkscape-font-specification:Kleptocracy;text-indent:0;text-align:start;text-decoration:none;text-decoration-line:none;letter-spacing:normal;word-spacing:normal;text-transform:none;writing-mode:lr-tb;direction:ltr;baseline-shift:baseline;text-anchor:start;display:inline;overflow:visible;visibility:visible;fill:#555753;fill-opacity:1;fill-rule:nonzero;stroke:none;stroke-width:10;marker:none;enable-background:accumulate"
       x="100"
       y="438.076477050781"
       id="text3069"><tspan
         sodipodi:role="line"
         id="tspan3071"
         x="100"
         y="438.076477050781"
         style="font-size:41.248752594px;line-height:1.3999999762">J'écris mon texte directement sur le canevas</tspan><tspan
         sodipodi:role="line"
         x="100"
         y="495.824737548828"
         id="tspan3073"
         style="font-size:41.248752594px;line-height:1.3999999762">je tape Entrée si j'ai besoin d'aller à la ligne</tspan></text>
    <flowRoot
       xml:space="preserve"
       id="flowRoot3075"
       style="color:#000000;font-style:normal;font-variant:normal;font-weight:normal;font-stretch:normal;line-height:0.0099999997%;font-family:Kleptocracy;-inkscape-font-specification:Kleptocracy;text-indent:0;text-align:start;text-decoration:none;text-decoration-line:none;letter-spacing:normal;word-spacing:normal;text-transform:none;writing-mode:lr-tb;direction:ltr;baseline-shift:baseline;text-anchor:start;clip-rule:nonzero;display:inline;overflow:visible;visibility:visible;opacity:1;color-interpolation:sRGB;color-interpolation-filters:linearRGB;fill:#555753;fill-opacity:1;fill-rule:nonzero;stroke:none;stroke-width:10;stroke-linecap:round;stroke-linejoin:round;stroke-miterlimit:4;stroke-dasharray:none;stroke-dashoffset:0;stroke-opacity:1;marker:none;enable-background:accumulate"><flowRegion
         id="flowRegion3077"><rect
           id="rect3079"
           width="161.64079284668"
           height="208.317810058594"
           x="28.524845123291"
           y="592.507080078125" /></flowRegion><flowPara
         id="flowPara3081"
         style="font-size:41.248752594px;line-height:1.3999999762"> </flowPara></flowRoot>    <flowRoot
       xml:space="preserve"
       id="flowRoot3083"
       style="color:#000000;font-style:normal;font-variant:normal;font-weight:normal;font-stretch:normal;line-height:0.0099999997%;font-family:Kleptocracy;-inkscape-font-specification:Kleptocracy;text-indent:0;text-align:start;text-decoration:none;text-decoration-line:none;letter-spacing:normal;word-spacing:normal;text-transform:none;writing-mode:lr-tb;direction:ltr;baseline-shift:baseline;text-anchor:start;display:inline;overflow:visible;visibility:visible;fill:#555753;fill-opacity:1;fill-rule:nonzero;stroke:none;stroke-width:10;marker:none;enable-background:accumulate"><flowRegion
         id="flowRegion3085"><rect
           id="rect3087"
           width="363.043487548828"
           height="141.759826660156"
           x="10.3726711273193"
           y="580.405639648438" /></flowRegion><flowPara
         id="flowPara3089"
         style="font-size:41.248752594px;line-height:1.3999999762">Ou alors je créé un cadre dans lequel le texte doit entréer</flowPara></flowRoot>    <text
       id="text4251"
       y="157.597793579102"
       x="116.753929138184"
       style="color:#000000;font-style:normal;font-variant:normal;font-weight:normal;font-stretch:normal;line-height:0%;font-family:Andika;-inkscape-font-specification:'Andika, Normal';text-indent:0;text-align:start;text-decoration:none;text-decoration-line:none;text-decoration-color:currentColor;letter-spacing:0px;word-spacing:normal;text-transform:none;writing-mode:lr-tb;direction:ltr;baseline-shift:baseline;text-anchor:start;clip-rule:nonzero;display:inline;overflow:visible;visibility:visible;opacity:1;color-interpolation:sRGB;color-interpolation-filters:linearRGB;fill:#2e3436;fill-opacity:1;fill-rule:nonzero;stroke:none;stroke-width:1;stroke-linecap:round;stroke-linejoin:round;stroke-miterlimit:4;stroke-dasharray:none;stroke-dashoffset:0;stroke-opacity:1;marker:none;enable-background:accumulate"
       xml:space="preserve"><tspan
         y="157.597793579102"
         x="116.753929138184"
         sodipodi:role="line"
         id="tspan4263"
         style="font-size:35px;line-height:1.25;letter-spacing:0px;writing-mode:lr-tb"><tspan
           dx="0 0 0 0 0 0 0 0"
           id="tspan4269"
           style="letter-spacing:0px;writing-mode:lr-tb"
           dy="0 0 0 0 0 0 0 0 0 0 0 4.45000028610229 -4.45000028610229">Régler la h<tspan
   style="writing-mode:lr-tb;fill:#888a85"
   id="tspan4389">a</tspan>uteur</tspan></tspan><tspan
         y="201.347793579102"
         x="116.753929138184"
         sodipodi:role="line"
         style="font-size:35px;line-height:1.25;letter-spacing:2.7300000191px;writing-mode:lr-tb"
         id="tspan4277"
         dy="0 -5.3600001335144 5.3600001335144 -2.80999994277954 2.80999994277954 0 3.84999990463257 -3.84999990463257 0 2.1800000667572 0 0 0 -2.89999985694885 2.89999985694885">p<tspan
   style="writing-mode:lr-tb;fill:#888a85"
   id="tspan4391">o</tspan>u<tspan
   style="writing-mode:lr-tb;fill:#888a85"
   id="tspan4393">r</tspan> d<tspan
   style="writing-mode:lr-tb;fill:#888a85"
   id="tspan4403">e</tspan>s e<tspan
   style="letter-spacing:-1.2799999714px;writing-mode:lr-tb;fill:#888a85"
   id="tspan4387"
   dy="-2.1800000667572">ff</tspan><tspan
   style="letter-spacing:1.2099999189px;writing-mode:lr-tb;fill:#888a85"
   id="tspan4283">e</tspan><tspan
   style="writing-mode:lr-tb;fill:#888a85"
   id="tspan4407">t</tspan>s</tspan><tspan
         y="245.097793579102"
         x="116.753929138184"
         sodipodi:role="line"
         style="font-size:35px;line-height:1.25;letter-spacing:2.3900001049px;writing-mode:lr-tb"
         id="tspan4279"
         dy="0 2.25 -2.25 -3.6800000667572 3.6800000667572 -1.62000000476837 1.62000000476837 1.92000007629395 -1.92000007629395 -3.46000003814697 8.86999988555908 -5.40999746322632 4.01000022888184 -6.50999975204468"
         rotate="0 11 0 0 0 352.399993896484 0 0 0 11.1999998092651 0 0 0 346.399993896484 0">t<tspan
   style="writing-mode:lr-tb;fill:#888a85"
   id="tspan4419">y</tspan>p<tspan
   style="writing-mode:lr-tb;fill:#888a85"
   id="tspan4417">o</tspan>g<tspan
   style="writing-mode:lr-tb;fill:#888a85"
   id="tspan4415">r</tspan>aph<tspan
   style="writing-mode:lr-tb;fill:#888a85"
   id="tspan4413">i</tspan>q<tspan
   style="writing-mode:lr-tb;fill:#888a85"
   id="tspan4411">u</tspan>e<tspan
   style="writing-mode:lr-tb;fill:#888a85"
   id="tspan4409">s</tspan></tspan></text>
    <g
       transform="matrix(3.77952755905512,0,0,3.77952755905512,-50.765128261819,831.190633504993)"
       id="g6936">
      <text
         xml:space="preserve"
         style="font-style:normal;font-variant:normal;font-weight:normal;font-stretch:normal;font-size:19.7555561066px;line-height:1.25;font-family:Boogaloo;-inkscape-font-specification:'Boogaloo, Normal';font-variant-ligatures:normal;font-variant-position:normal;font-variant-caps:normal;font-variant-numeric:normal;font-variant-alternates:normal;font-feature-settings:normal;text-indent:0;text-align:start;text-decoration:none;text-decoration-line:none;text-decoration-style:solid;text-decoration-color:#000000;letter-spacing:0px;word-spacing:0px;text-transform:none;writing-mode:lr-tb;direction:ltr;text-orientation:mixed;dominant-baseline:auto;baseline-shift:baseline;text-anchor:start;white-space:normal;shape-padding:0;opacity:1;vector-effect:none;fill:#808080;fill-opacity:1;stroke:none;stroke-width:0.2645832896;stroke-linecap:butt;stroke-linejoin:miter;stroke-miterlimit:4;stroke-dasharray:none;stroke-dashoffset:0;stroke-opacity:1"
         x="24.9970035552979"
         y="33.3537979125977"
         id="text821"><tspan
           sodipodi:role="line"
           id="tspan819"
           x="24.9970035552979"
           y="33.3537979125977"
           style="font-style:normal;font-variant:normal;font-weight:normal;font-stretch:normal;font-size:19.7555561066px;font-family:Boogaloo;-inkscape-font-specification:'Boogaloo, Normal';font-variant-ligatures:normal;font-variant-caps:normal;font-variant-numeric:normal;font-feature-settings:normal;text-align:start;writing-mode:lr-tb;text-anchor:start;fill:#808080;stroke-width:0.2645832896">Text</tspan></text>
      <text
         xml:space="preserve"
         style="font-style:normal;font-variant:normal;font-weight:normal;font-stretch:normal;font-size:19.7555561066px;line-height:1.25;font-family:Boogaloo;-inkscape-font-specification:'Boogaloo, Normal';font-variant-ligatures:normal;font-variant-position:normal;font-variant-caps:normal;font-variant-numeric:normal;font-variant-alternates:normal;font-feature-settings:normal;text-indent:0;text-align:start;text-decoration:none;text-decoration-line:none;text-decoration-style:solid;text-decoration-color:#000000;letter-spacing:0px;word-spacing:0px;text-transform:none;writing-mode:lr-tb;direction:ltr;text-orientation:mixed;dominant-baseline:auto;baseline-shift:baseline;text-anchor:start;white-space:normal;shape-padding:0;opacity:1;vector-effect:none;fill:#669900;fill-opacity:1;stroke:none;stroke-width:0.2645832896;stroke-linecap:butt;stroke-linejoin:miter;stroke-miterlimit:4;stroke-dasharray:none;stroke-dashoffset:0;stroke-opacity:1"
         x="101.637367248535"
         y="33.3537979125977"
         id="text825"><tspan
           sodipodi:role="line"
           id="tspan823"
           x="101.637367248535"
           y="33.3537979125977"
           style="font-style:normal;font-variant:normal;font-weight:normal;font-stretch:normal;font-size:19.7555561066px;font-family:Boogaloo;-inkscape-font-specification:'Boogaloo, Normal';font-variant-ligatures:normal;font-variant-caps:normal;font-variant-numeric:normal;font-feature-settings:normal;text-align:start;writing-mode:lr-tb;text-anchor:start;fill:#669900;stroke-width:0.2645832896">Te<tspan
   id="tspan4550"
   style="fill:#cc0000">x</tspan>t</tspan></text>
      <text
         xml:space="preserve"
         style="font-style:normal;font-variant:normal;font-weight:normal;font-stretch:normal;font-size:19.7555561066px;line-height:1.25;font-family:Boogaloo;-inkscape-font-specification:'Boogaloo, Normal';font-variant-ligatures:normal;font-variant-position:normal;font-variant-caps:normal;font-variant-numeric:normal;font-variant-alternates:normal;font-feature-settings:normal;text-indent:0;text-align:start;text-decoration:none;text-decoration-line:none;text-decoration-style:solid;text-decoration-color:#000000;letter-spacing:0px;word-spacing:0px;text-transform:none;writing-mode:lr-tb;direction:ltr;text-orientation:mixed;dominant-baseline:auto;baseline-shift:baseline;text-anchor:start;white-space:normal;shape-padding:0;opacity:1;vector-effect:none;fill:#669900;fill-opacity:1;stroke:none;stroke-width:0.2645832896;stroke-linecap:butt;stroke-linejoin:miter;stroke-miterlimit:4;stroke-dasharray:none;stroke-dashoffset:0;stroke-opacity:1"
         x="63.3171844482422"
         y="33.3537979125977"
         id="text829"><tspan
           sodipodi:role="line"
           id="tspan827"
           x="63.3171844482422"
           y="33.3537979125977"
           style="font-style:normal;font-variant:normal;font-weight:normal;font-stretch:normal;font-size:19.7555561066px;font-family:Boogaloo;-inkscape-font-specification:'Boogaloo, Normal';font-variant-ligatures:normal;font-variant-caps:normal;font-variant-numeric:normal;font-feature-settings:normal;text-align:start;writing-mode:lr-tb;text-anchor:start;fill:#669900;stroke-width:0.2645832896">Text</tspan></text>
      <text
         xml:space="preserve"
         style="font-style:normal;font-variant:normal;font-weight:normal;font-stretch:normal;font-size:19.7555561066px;line-height:1.25;font-family:Boogaloo;-inkscape-font-specification:'Boogaloo, Normal';font-variant-ligatures:normal;font-variant-position:normal;font-variant-caps:normal;font-variant-numeric:normal;font-variant-alternates:normal;font-feature-settings:normal;text-indent:0;text-align:start;text-decoration:none;text-decoration-line:none;text-decoration-style:solid;text-decoration-color:#000000;letter-spacing:0px;word-spacing:0px;text-transform:none;writing-mode:lr-tb;direction:ltr;text-orientation:mixed;dominant-baseline:auto;baseline-shift:baseline;text-anchor:start;white-space:normal;shape-padding:0;opacity:1;vector-effect:none;fill:none;fill-opacity:1;stroke:#000000;stroke-width:0.5;stroke-linecap:butt;stroke-linejoin:miter;stroke-miterlimit:4;stroke-dasharray:none;stroke-dashoffset:0;stroke-opacity:1"
         x="24.9970035552979"
         y="64.5741271972656"
         id="text833"><tspan
           sodipodi:role="line"
           id="tspan831"
           x="24.9970035552979"
           y="64.5741271972656"
           style="font-style:normal;font-variant:normal;font-weight:normal;font-stretch:normal;font-size:19.7555561066px;font-family:Boogaloo;-inkscape-font-specification:'Boogaloo, Normal';font-variant-ligatures:normal;font-variant-caps:normal;font-variant-numeric:normal;font-feature-settings:normal;text-align:start;writing-mode:lr-tb;text-anchor:start;fill:none;stroke:#000000;stroke-width:0.5">Text</tspan></text>
      <text
         xml:space="preserve"
         style="font-style:normal;font-variant:normal;font-weight:normal;font-stretch:normal;font-size:19.7555561066px;line-height:1.25;font-family:Boogaloo;-inkscape-font-specification:'Boogaloo, Normal';font-variant-ligatures:normal;font-variant-position:normal;font-variant-caps:normal;font-variant-numeric:normal;font-variant-alternates:normal;font-feature-settings:normal;text-indent:0;text-align:start;text-decoration:none;text-decoration-line:none;text-decoration-style:solid;text-decoration-color:#000000;letter-spacing:0px;word-spacing:0px;text-transform:none;writing-mode:lr-tb;direction:ltr;text-orientation:mixed;dominant-baseline:auto;baseline-shift:baseline;text-anchor:start;white-space:normal;shape-padding:0;opacity:1;vector-effect:none;fill:url(#linearGradient4564);fill-opacity:1;stroke:none;stroke-width:0.2645832896;stroke-linecap:butt;stroke-linejoin:miter;stroke-miterlimit:4;stroke-dasharray:none;stroke-dashoffset:0;stroke-opacity:1"
         x="64.3125152587891"
         y="64.5741271972656"
         id="text837"><tspan
           sodipodi:role="line"
           id="tspan835"
           x="64.3125152587891"
           y="64.5741271972656"
           style="font-style:normal;font-variant:normal;font-weight:normal;font-stretch:normal;font-size:19.7555561066px;font-family:Boogaloo;-inkscape-font-specification:'Boogaloo, Normal';font-variant-ligatures:normal;font-variant-caps:normal;font-variant-numeric:normal;font-feature-settings:normal;text-align:start;writing-mode:lr-tb;text-anchor:start;fill:url(#linearGradient4564);fill-opacity:1;stroke-width:0.2645832896">Text</tspan></text>
      <text
         id="text817"
         y="64.5741271972656"
         x="103.628021240234"
         style="font-style:normal;font-variant:normal;font-weight:normal;font-stretch:normal;font-size:19.7555561066px;line-height:1.25;font-family:Boogaloo;-inkscape-font-specification:'Boogaloo, Normal';font-variant-ligatures:normal;font-variant-position:normal;font-variant-caps:normal;font-variant-numeric:normal;font-variant-alternates:normal;font-feature-settings:normal;text-indent:0;text-align:start;text-decoration:none;text-decoration-line:none;text-decoration-style:solid;text-decoration-color:#000000;letter-spacing:0px;word-spacing:0px;text-transform:none;writing-mode:lr-tb;direction:ltr;text-orientation:mixed;dominant-baseline:auto;baseline-shift:baseline;text-anchor:start;white-space:normal;shape-padding:0;opacity:1;vector-effect:none;fill:url(#pattern6141);fill-opacity:1;stroke:none;stroke-width:0.2645832896;stroke-linecap:butt;stroke-linejoin:miter;stroke-miterlimit:4;stroke-dasharray:none;stroke-dashoffset:0;stroke-opacity:1"
         xml:space="preserve"><tspan
           style="font-style:normal;font-variant:normal;font-weight:normal;font-stretch:normal;font-size:19.7555561066px;font-family:Boogaloo;-inkscape-font-specification:'Boogaloo, Normal';font-variant-ligatures:normal;font-variant-caps:normal;font-variant-numeric:normal;font-feature-settings:normal;text-align:start;writing-mode:lr-tb;text-anchor:start;fill:url(#pattern6141);fill-opacity:1;stroke-width:0.2645832896"
           y="64.5741271972656"
           x="103.628021240234"
           id="tspan815"
           sodipodi:role="line">Text</tspan></text>
    </g>
  </g>
</svg>
