<?xml version="1.0" encoding="UTF-8" standalone="no"?>
<svg xmlns:rdf="http://www.w3.org/1999/02/22-rdf-syntax-ns#" xmlns="http://www.w3.org/2000/svg" version="1.1" xmlns:cc="http://creativecommons.org/ns#" viewBox="0 0 11.98896 11.88748" xmlns:dc="http://purl.org/dc/elements/1.1/">
<metadata>
<rdf:RDF>
<cc:Work rdf:about="">
<dc:format>image/svg+xml</dc:format>
<dc:type rdf:resource="http://purl.org/dc/dcmitype/StillImage"/>
</cc:Work>
</rdf:RDF>
</metadata>
<g clip-path="url(#clipPath5905)" transform="translate(-375.8356,-138.7635)" stroke="#fff" stroke-width=".138679">
<circle style="color:#000000" transform="matrix(2.361086,0,0,2.361086,-503.8152,-187.3038)" cy="137.9821" cx="375.0941" r="1.111868"/>
<circle style="color:#000000" transform="matrix(2.176368,0,0,2.176368,-434.5286,-155.763)" cy="137.9821" cx="375.0941" r="1.111868"/>
<circle style="color:#000000" transform="matrix(2.363946,0,0,2.363946,-504.888,-175.5924)" cy="137.9821" cx="375.0941" r="1.111868"/>
<circle style="color:#000000" transform="matrix(0,2.361086,-2.361086,0,713.6548,-741.0926)" cy="137.9821" cx="375.0941" r="1.111868"/>
<circle style="color:#000000" transform="matrix(0,2.363946,-2.363946,0,701.94,-742.1654)" cy="137.9821" cx="375.0941" r="1.111868"/>
<circle style="color:#000000" transform="matrix(0,2.361086,-2.361086,0,713.6548,-747.1456)" cy="137.9821" cx="375.0941" r="1.111868"/>
<circle style="color:#000000" transform="matrix(0,2.363946,-2.363946,0,701.94,-748.2184)" cy="137.9821" cx="375.0941" r="1.111868"/>
<circle style="color:#000000" transform="matrix(0,2.361086,-2.361086,0,713.6548,-735.0396)" cy="137.9821" cx="375.0941" r="1.111868"/>
<circle style="color:#000000" transform="matrix(0,2.363946,-2.363946,0,701.94,-736.1123)" cy="137.9821" cx="375.0941" r="1.111868"/>
<circle style="color:#000000" transform="matrix(2.176368,0,0,2.176368,-433.9294,-155.2869)" cy="137.9821" cx="375.0941" r="1.111868"/>
<circle style="color:#000000" transform="matrix(2.176368,0,0,2.176368,-433.3154,-154.7343)" cy="137.9821" cx="375.0941" r="1.111868"/>
</g>
</svg>
