<?xml version="1.0" encoding="UTF-8" standalone="no"?>
<svg xmlns:rdf="http://www.w3.org/1999/02/22-rdf-syntax-ns#" xmlns="http://www.w3.org/2000/svg" version="1.1" xmlns:cc="http://creativecommons.org/ns#" xmlns:xlink="http://www.w3.org/1999/xlink" viewBox="0 0 12 12.000007" xmlns:dc="http://purl.org/dc/elements/1.1/">
<metadata>
<rdf:RDF>
<cc:Work rdf:about="">
<dc:format>image/svg+xml</dc:format>
<dc:type rdf:resource="http://purl.org/dc/dcmitype/StillImage"/>
</cc:Work>
</rdf:RDF>
</metadata>
<defs>
<linearGradient id="b" y2="251.9159" xlink:href="#a" gradientUnits="userSpaceOnUse" x2="678.7324" y1="256.0717" x1="671.7674"/>
<linearGradient id="a">
<stop stop-color="#fff" offset="0"/>
<stop stop-color="#98b6d3" offset="1"/>
</linearGradient>
<linearGradient id="c" y2="246.8192" xlink:href="#a" gradientUnits="userSpaceOnUse" x2="683.847" y1="252.3578" x1="673.6465"/>
</defs>
<g transform="translate(-675,-245.961)">
<path opacity=".9" style="color:#000000" d="m675 245.961h12v6h-12v-6z" fill-rule="evenodd" stroke-width=".7" fill="url(#c)"/>
<path opacity=".9" style="color:#000000" d="m675 248.961h8v4h-8v-4z" fill-rule="evenodd" stroke-width=".7" fill="url(#b)"/>
<path d="m675.5 246.461h11v5" stroke="#000" stroke-linecap="square" stroke-width="1px" fill="none"/>
<path d="m675.5 249.461h7v3" stroke="#000" stroke-linecap="square" stroke-width="1px" fill="none"/>
<g transform="matrix(.695835 0 0 .741921 209.1801 64.671)">
<path fill-rule="evenodd" d="m682.3742 253.7871v2.6957h-2.8742v1.3479h2.8742v2.6957l4.3114-3.3696-4.3114-3.3697z"/>
<path d="m505.9072 37.19576h1.4371" transform="translate(170,219.961)" stroke="#000" stroke-linecap="square" stroke-width="1.391772px" fill="none"/>
<path d="m672.3144 257.1568h1.4371" stroke="#000" stroke-width="1.391772px" fill="none"/>
</g>
</g>
</svg>
