id,sku,type_id
6867,PHD-XX-MM-V2C,configurable
6866,MF-AUS2PC7-XXRBLK,simple
6865,HDMI-XX-MM-V4B,configurable
6864,HDAS-V2XXCO,configurable
6863,DVI-DL-XXB-MM,configurable
6862,C6S-XXBLUR,configurable
4933,C6-XXB-Blue,configurable
6796,WCG2X40-US,simple
6861,WC1X20-UK,simple
6860,WC1X20-US,simple
6856,WC1X20-ANZ,simple
6071,DUPRDX2-100,simple
6658,ACMXRBK,configurable
6839,ULQC10W-XXX,configurable
6837,WCCA17MXX,configurable
6834,WC2A17MXX,configurable
6836,WCC2A45XX,configurable
6835,QC10MXXX,configurable
4531,ULDWAV-XXX,configurable
4486,U3XABRBK,configurable
4485,U3XAARBK,configurable
5568,U2XMCABRBK,configurable
5652,U2XABRBK,configurable
5584,U2XAARBK,configurable
6070,SULC8PXX,simple
6069,SULA8PXX,simple
4488,SULCC2G2XX,configurable
4487,SULCA2G2XX,configurable
6662,SSULHDXX-SGR,configurable
6661,SULHDXX-SGR,configurable
6815,ULQC10W-XXX-AUNZ,simple
4602,ULCAMN-XXX,configurable
6657,ULHDXX-SGR,configurable
5432,ELPCA2XX-XX,configurable
5431,ELPCC2XX-XX,configurable
4601,ELPC35A-XX,configurable
4600,ULCAA-XXX,configurable
4599,ULCC2XX-YYY,configurable
4598,ULCA2XX-YYY,configurable
4530,ULDNAMN-UA-XXX,configurable
6067,P10QC10P18-XX,simple
6656,ULDPXX-SGR,configurable
6655,ULDPHDXX-SGR,configurable
6654,ULMDPHDXX-SGR,configurable
6653,ULMDPDPXX-SGR,configurable
4597,ULA8PXXX-YYY,configurable
6065,P27QC10P60-XX,simple
6814,UL2QC10CA-XXX,configurable
4596,ULCDPXX-SGR,configurable
4529,SPDPBL-XX,configurable
4528,ULDNAG2-XXX,configurable
4527,ULDPLS-XXX,configurable
4526,ULDUNI-XXX,configurable
6813,ULDNA-XXX,configurable
6061,WCCA17MXX-IN,configurable
6060,WC2A17MXX-IN,simple
6059,UW2-534XXX,simple
5756,EMS-XX-EMS,configurable
5188,STST-XX-OM4,configurable
5771,IMS-XX-8484-8087,configurable
5769,IMS-XX-8482-8087,configurable
5750,IMS-XX-8087S,configurable
5748,IMS-XX-8087,configurable
5768,EMS-XX-SAS,configurable
5216,LCALCA-XX-OS2,configurable
5215,SCASCA-XX-OS2,configurable
5213,SCALC-XX-OS2,configurable
5212,SCASC-XX-OS2,configurable
5210,STST-XX-OS2,configurable
5208,SCST-XX-OS2,configurable
5206,LCST-XX-OS2,configurable
5204,LCSC-XX-OS2,configurable
5203,LCLC-XX-OS2,configurable
4525,TB3D2HDPBL-XXX,configurable
6651,HDVG-MM-XX,configurable
4524,TB3D2DPBL-XXX,configurable
5416,ELUCDV-XXRBLK,configurable
5201,MTST-XX-OM4,configurable
5198,MTSC-XX-OM4,configurable
5195,MTLC-XX-OM4,configurable
5192,MTMT-XX-OM4,configurable
5189,STSC-XX-OM4,configurable
4523,UCPD1O-XXX,configurable
5507,MU31CC-EXT-XXBLK,configurable
5185,SCSC-XX-OM4,configurable
6650,RJ12XXR,configurable
5512,U3-TCCXX-MM,configurable
5420,U2-TCBXX-MM,configurable
5182,LCST-XX-OM4,configurable
6812,UCSLD3O-XXX,configurable
5429,U3-TCMCBXX-MM,configurable
5178,LCSC-XX-OM4,configurable
5414,ELUCVG-XXRBLK,configurable
4522,TB3D2D24K-XXX,configurable
5427,U3-TCBXX-MM,configurable
6063,WCC60XX,simple
6062,MP2CA156XXX,simple
6649,HDMI-XX-MM,configurable
5433,MU28P-XXYYY,configurable
5425,U2-TCMNBXX-MM,simple
5543,U28P3T1-XXYYY,configurable
5514,U3-TCAXX-MM,configurable
5790,C6S-XXYEL,configurable
5786,C6S-XXBLK,configurable
5175,SCSC-XX-OS2,configurable
6648,DP-DVI-XX-MM,configurable
5793,C6S-XXGRN,configurable
5707,C6S-XXBLU,configurable
6806,TB-XX-MM-BK,configurable
6045,MF-AUS2PC7-XX,simple
6805,MF-C19C20-XX,configurable
5789,C6S-XXPNK,configurable
6804,MF-C14C15-XX,simple
6803,MF-AUS3PC13-XX-MC,simple
5788,C6S-XXPUR,configurable
6802,MFF-C14C13-XX,simple
6039,MF-PEXT-XX-BLK,simple
6647,DVI-DL-XX-MF,configurable
6801,MF-AUS3P2C13-XX,simple
6800,MF-3PC13RT-XX,simple
6799,MF-3PC15-XX,simple
5791,C6S-XXORN,configurable
6798,MF-3PC19-XX,simple
6058,MF-AUS3PC5-XX,simple
5794,C6S-XXRED,configurable
6810,MF-C14AUS3P-XX,simple
6056,MF-3PC13-XX,simple
5410,ELUCHD-XXRBLK,configurable
6809,MF-C13C14-XX,simple
6054,MF-3PC19-XX-10A,simple
5787,C6S-XXWHT,configurable
5792,C6S-XXGRY,configurable
5171,LCLC-XX-OM4,configurable
5617,USB3-XX-AM-AM,configurable
5167,MTST-XX-OM3,configurable
5205,STST-XX-OM3,configurable
5521,USB3-XX-MCAB,configurable
5214,MTSC-XX-OM3,configurable
5202,SCSC-XX-OM3,configurable
5632,USB3-XX-AA,configurable
5211,MTLC-XX-OM3,configurable
5200,LCST-XX-OM3,configurable
5614,USB3-XX-AB,configurable
5209,MTMT-XX-OM3,configurable
5197,LCSC-XX-OM3,configurable
5430,U2MCAB-XXRR,configurable
5207,STSC-XX-OM3,configurable
5194,STST-XX-OM1,configurable
5611,USB2-XX-MAB,configurable
5190,SCST-XX-OM1,configurable
5634,USB2-XX-AM-AM,configurable
5186,SCSC-XX-OM1,configurable
5424,USB2-XX-MCAB,configurable
5181,LCLC-XX-OM1,configurable
5621,USB2-XX-AB,configurable
5177,LCST-XX-OM1,configurable
6808,USB2-XX-AA,configurable
5173,LCSC-XX-OM1,configurable
6859,30P-USB-XX,configurable
5620,U28P-XXWH,configurable
5733,C6A-XX-Orange-SH,configurable
5731,C6A-XX-Pink-SH,configurable
5729,C6A-XX-White-SH,configurable
5728,C6A-XX-Yellow-SH,configurable
5727,C6A-XX-Green-SH,configurable
5726,C6A-XX-Red-SH,configurable
5725,C6A-XX-Purple-SH,configurable
5724,C6A-XX-Black-SH,configurable
5722,C6A-XX-Grey-SH,configurable
5721,C6A-XX-Blue-SH,configurable
4931,C6-XX-Red-CSV,configurable
4930,C6-XX-Pink,configurable
4929,C6-XX-Purple,configurable
4928,C6-XX-Orange,configurable
4927,C6-XX-Red,configurable
4926,C6-XX-White,configurable
4925,C6-XX-Grey,configurable
4924,C6-XX-Yellow,configurable
4923,C6-XX-Black,configurable
4922,C6-XX-Blue,configurable
5713,C5-XX-Pink,configurable
5711,C5-XX-Purple,configurable
5708,C5-XX-Orange,configurable
5706,C5-XX-Red,configurable
5705,C5-XX-White,configurable
5703,C5-XX-Grey,configurable
5702,C5-XX-Yellow,configurable
5699,C5-XX-Black,configurable
5696,C5-XX-Green,configurable
6628,HDMI-XX-MM-V4,configurable
6627,TL-AD-XX,configurable
6797,VPLUCMDHD-XXX,configurable
5519,MU2CC-XXX,configurable
5513,MU23T1-XXXXX,configurable
5497,U2-TCMCBXX-MM,configurable
5816,ELUCDP-XXRBLK,configurable
5551,MU31CC-XXX,configurable
5498,MU31CAF-XXX,configurable
5511,MU31CA-XXXXX,configurable
5534,MU2CA-XXXXX,configurable
6626,TV-MM-XX,configurable
6625,PAR-FTR-XX,configurable
6624,3RCA-3RCA-XX,configurable
6623,AD-SPL-XX,configurable
6622,MM-AD-XX,configurable
6621,AD-EXT-XX,configurable
6620,DVI-DL-XX-MM,configurable
6619,VGA-MF-XX,configurable
6618,VGA-MM-XX-APS,configurable
6617,VGA-MM-XX,configurable
6616,DVI-HDMI-XX-MM,simple
6615,HDC-DVI-XX-MM,configurable
6614,HDC-MM-XX-V2,configurable
6613,HDD-MM-XX-V2,configurable
6612,HDD-DVI-XX-MM,configurable
6611,PAOHD-XXMM,configurable
6610,HDMI-XX-MM-V4F,configurable
6609,HDAS-V2XX,configurable
6608,MDP-VGA-XX-MM,configurable
6607,MDP-DVI-XX-MM,configurable
6606,MDP-DV4K-XX-ACTV,configurable
6605,MDP-HD4K-XX-MM,configurable
6604,MDP-HDMI-XX-MM,configurable
6603,ELMDPHD-XX,configurable
6597,DP-HD4K-XX-MM,configurable
6596,ELDP-XX,configurable
6025,WCG2X32-ANZ,simple
6602,MDP-DP-XX-MM,configurable
6595,DP-HDMI-XX-MM,configurable
6725,PHD-XX-MM-V2,configurable
5848,WC1X20-IND,simple
6599,ELMDPDP-XX,configurable
6024,WC1X20-EU,simple
6033,VPMCA052XXX,simple
6593,DP-DV4K-XX-ACTV,configurable
5415,VPLUCGE3ACH-XXX,configurable
6601,DP-VGA-XX-MM,configurable
4521,DUPRMX3-WW,simple
6600,ELDPDV-XX,configurable
5412,VPLUCCR2ACH-XXX,configurable
5418,VPLU3AGEXXX,configurable
4520,DUPRMX2-WW,simple
6598,ELDPHD-XX,configurable
5411,VPLUCHDACH-XXX,configurable
4519,DUPRDX3-WW,simple
6594,DP-XX-MM,configurable
4594,ULCHDXX-SGR,configurable
4518,DUPRDX2-WW,simple
5170,LCLC-XX-OM3,configurable
5267,ALDHDLR,simple
4934,C6-XX-Green,configurable
4588,SULCC2G202-SGR,simple
5692,C5-XX-Blue,configurable
4604,SULCC2G201-SGR,simple
4595,ULC8P1.5-XXX,configurable
4587,SULCA2G202-SGR,simple
4591,AALNBSS-SGR,simple
4603,SULCA2G201-SGR,simple
4590,AALNBS-SGR,simple
6021,SULC8P02-SGR,simple
6020,SULC8P01-SGR,simple
6019,SULA8P02-SGR,simple
6018,SULA8P01-SGR,simple
4589,AAL6APNS-SGR,simple
6031,WCG2X40-EU,simple
6030,WCG2X40-ANZ,simple
6795,WCG2X32-US,simple
6589,WCG2X32-UK,simple
5408,ELPCC202-WH,simple
6203,WCG2X32-IND,simple
6026,WCG2X32-EU,simple
6588,SSULHD02-SGR,simple
6592,SSULHD01-SGR,simple
6023,UP2QC10AWM-SGR,simple
5734,C6-7.5B-Blue,simple
5688,C6-50B-Blue,simple
5684,C6-30B-Blue,simple
5682,C6-25B-Blue,simple
5679,C6-20B-Blue,simple
5676,C6-15B-Blue,simple
5700,C6-10B-Blue,simple
5698,C6-05B-Blue,simple
5695,C6-04B-Blue,simple
5693,C6-03B-Blue,simple
5691,C6-2.5B-Blue,simple
5690,C6-02B-Blue,simple
6022,UP2QC10A-SGR,simple
5686,C6-1.5B-Blue,simple
4515,DCAP-SPL,simple
5685,C6-01B-Blue,simple
4484,ULCVGMN-SGR,simple
5680,C6-0.5B-Blue,simple
5677,C6-0.3B-Blue,simple
4483,ULCDPMN-SGR,simple
6793,WCG4X100-US,simple
6792,WCG1X100-US,simple
6791,WCG2X68-US,simple
6794,WCG1X65-US,simple
4482,ULCSDMN-SGR,simple
6202,WCG1X65-UK,simple
6200,WCG1X100-UK,simple
4481,ULCGEMN-SGR,simple
6017,WCCA30WHCCWH,simple
6587,SULHD03-SGR,simple
4585,ULAGE-SGR,simple
6586,SULHD02-SGR,simple
4584,ULCGE-SGR,simple
6585,SULHD01-SGR,simple
6199,WCG4X100-UK,simple
4480,ULCHDMN-SGR,simple
6790,WCG2X63-UK,simple
6748,ULQC10W-SGR-AUNZ,simple
6015,ULQC10W-SLV-AUNZ,simple
6009,WCG1X65-EU,simple
6014,UP2QC10AWA-SGR,simple
6008,WCG2X63-EU,simple
6007,WCG1X100-EU,simple
4583,ULCAMN-SLV,simple
6006,WCG4X100-EU,simple
6005,WCG2X68-ANZ,simple
4582,UCFUPRGV-SGR,simple
6004,WCG1X65-ANZ,simple
6003,WCG1X100-ANZ,simple
5394,ELPCC202-BK,simple
4517,SP7PBLH-BLK,simple
4581,ULA8P030-SGR,simple
5815,WCG4X100-ANZ,simple
5266,U2CSH-SGR,simple
4516,DUCMA3,simple
5998,CO-C18C8PWH,simple
6000,ULQC10W-SLV,simple
5999,ULQC10W-SGR,simple
4580,UCFUHD-SGR,simple
4573,ULCA203-SLV,simple
4512,ULDWAV-SLV,simple
4579,UCFUPRGE-SGR,simple
4572,ULCA21.5-SLV,simple
4577,UCANCHD,simple
4578,UCFUUA-SGR,simple
4571,ULCA2030-SLV,simple
4570,ULCA203-SGR,simple
4576,UCANCCR,simple
4514,DUTHDPR,simple
4569,ULCA21.5-SGR,simple
5407,ELPCA201-BK,simple
4513,DUTHD,simple
6002,RA05BK,simple
6001,R2A10BK,simple
4568,ULCA2030-SGR,simple
5405,ELPCA201-WH,simple
4567,ULCC203-SLV,simple
5403,ELPCC201-BK,simple
4566,ULCC21.5-SLV,simple
5401,ELPCC201-WH,simple
4565,ULCC2030-SLV,simple
4511,ULDNAMN-UA-SLV,simple
4564,ULCC203-SGR,simple
4563,ULCC21.5-SGR,simple
6581,ULHD02-SGR,simple
4562,ULCC2030-SGR,simple
4575,ELPC35A-BK,simple
6580,ULMDPDP03-SGR,simple
4574,ELPC35A-WH,simple
5995,CRCA57,simple
6579,ULMDPDP02-SGR,simple
5993,CRC60,simple
6578,ULMDPDP01-SGR,simple
4509,TB3DTRG2,simple
5991,QC10AWRDWH,simple
6577,ULDP03-SGR,simple
6576,ULDP02-SGR,simple
5397,ULA8P1.5-SGR,simple
5997,P27QC10P60-BK,simple
5996,UL2QC10CA-SGR,simple
6575,ULDP01-SGR,simple
6574,ULMDPHDA-SGR,simple
6789,ULDNAMN-SLV,simple
6788,ULDNAMN-SGR,simple
6573,ULDPHDA-SGR,simple
4556,ULC35APW-SGR,simple
6572,ULMDPHD02-SGR,simple
6787,ULDNA-SLV,simple
6571,ULDPHD02-SGR,simple
6786,ULDNA-SGR,simple
4561,ULCAA-SLV,simple
5994,WCCA30WH,simple
5992,WCC18WH,simple
4560,ULCAA-SGR,simple
5990,QC10RCMBK,simple
4508,SPDPBL-SLV,simple
4506,ULDNAG2-SLV,simple
4559,UL2CAPW-SGR,simple
5986,P10QC10P18-WH,simple
5985,P10QC10P18-BK,simple
4505,ULDNAG2-SGR,simple
6195,WCCA17MBK-IN,simple
4507,ULDWAV-SGR,simple
5988,WCCA17MWH-IN,simple
6747,WC2A17MBK-IN,simple
4558,ULC8P1.5-SLV,simple
6746,WC2A17MWH-IN,simple
5987,QC10AWNQH,simple
4557,ULC8P1.5-SGR,simple
4504,TB3D2HDPBL-SGR,simple
5400,ULA8P1.5-SLV,simple
4503,ULDPLS-SLV,simple
4502,ULDPLS-SGR,simple
4501,ULDUNI-SLV,simple
4500,ULDUNI-SGR,simple
4555,ULC35A1.5-SGR,simple
4554,ULCDP02-SGR,simple
4553,ULCDP01-SGR,simple
4552,ULCHD02-SGR,simple
4551,ULCHD01-SGR,simple
4550,ULUCDP-ADP,simple
4549,ULUCHD-ADP,simple
4499,TB3D2DPBL-SGR,simple
5393,ULC35A-SGR,simple
6570,ACM5RBK,simple
6569,ACM2RBK,simple
4479,U25ABRBK,simple
4478,U22ABRBK,simple
5409,U22MCABRBK,simple
4477,U22AARBK,simple
4476,U32ABRBK,simple
4475,U32AARBK,simple
5984,WCC60WH,simple
5983,WCCA17MBK,simple
5982,WCCA17MWH,simple
5404,MU28P-02BLK,simple
5981,WC2A17MBK,simple
5402,MU28P-03SLV,simple
5980,WC2A17MWH,simple
5399,MU28P-02SLV,simple
5972,MF-3PC13-02RBLK,simple
6566,HDVG-MM-03,simple
5971,MF-AUS3PC5-02RBLK,simple
5970,MF-AUS2PC7-02RBLK,simple
6565,HDVG-MM-02,simple
4496,UCPD1O-BLK,simple
6564,HDVG-MM-01,simple
4466,SB-M10G2,simple
4498,UCTDPRO1,simple
5969,WCC45,simple
6785,UCSLD3O-BLK,simple
4497,UCTDHDES,simple
5979,QC10PCMBLK,simple
6561,DP2HD-ADP,simple
5811,PAW8PM067-SGR,simple
6559,DP2DP-ADP,simple
5978,QC10MCGD,simple
5977,QC10MSLV,simple
6558,MDP2HD-ADP,simple
5976,QC10MSGR,simple
6557,MDP2DP-ADP,simple
5810,MP2A15SGR,simple
5814,MP2CA156SGR,simple
5975,WCC2A45BK,simple
6780,UCSLD3O-SGR,simple
5974,WCC2A45WH,simple
4495,UCPD1O-SGR,simple
5406,MU28P-03BLK,simple
6782,HD4KSPL04,simple
6781,HD4KSPL02-ADP,simple
6098,CRCICA27,simple
6556,RJ12IFR,simple
6555,RJ12MSR,simple
6553,RJ1215R,simple
6551,RJ1210R,simple
6563,RJ1205R,simple
6562,RJ1202R,simple
6097,WCC60,simple
5398,MP-UC2HVGECH,simple
5813,MP2CA201SGR,simple
5968,CRCA27,simple
6560,DPMDP-15MF,simple
6784,HD4KSW05,simple
6783,HD4KSW03,simple
4921,C6S-05BLUR,simple
4920,C6S-03BLUR,simple
4919,C6S-02BLUR,simple
4918,C6S-01BLUR,simple
5973,MF-PEXT-02R,simple
4548,UC2DP-ADP,simple
4547,UC2HD-ADP,simple
6779,MH211HD-ADP,simple
6554,HDANGR,simple
6552,HDSPLR,simple
6550,HDMNR,simple
6549,HDMCR,simple
6548,HDFFR,simple
6547,PHD-0.5-MM-V2C,simple
4917,C5-20-Grey,simple
4916,C5-1.5-Yellow,simple
4915,C5-1.5-Red,simple
4914,C6-7.5-White,simple
4913,C6-7.5-Black,simple
5744,GLC-LH-SM20-ALG,simple
5396,ELUCDV-02RBLK,simple
5395,ELUCDV-01RBLK,simple
5392,ELUCVG-02RBLK,simple
5391,ELUCVG-01RBLK,simple
5812,VPM2CA102SGRC2,simple
5390,U2MCAB-05EPR1,simple
6691,MF-AUS3P2C13-04,simple
6833,SB-CL05BD,simple
4912,C6-7.5-Yellow,simple
4494,UCD3D34K-H,simple
4493,TB3D2D24K-H,simple
4474,SB-CT42B156,simple
4468,SB-CT32B156,simple
4470,SB-CT24B156,simple
5540,MU23T1-030SGR,simple
5562,MU23T1-030SLV,simple
5554,MU23T1-030BLK,simple
5389,U28P3T1-030BLK,simple
5386,U28P3T1-01BLK,simple
5385,U28P3T1-030WH,simple
5382,U28P3T1-01WH,simple
6828,SB-DCS8BC,simple
4492,U3D2D14K-H,simple
4911,C6S-05PNK,simple
4910,C6S-03PNK,simple
4909,C6S-02PNK,simple
4908,C6S-1.5PNK,simple
4907,C6S-01PNK,simple
4906,C6S-0.50PNK,simple
4905,C6S-0.30PNK,simple
4904,C6S-05PUR,simple
4903,C6S-03PUR,simple
4902,C6S-02PUR,simple
4901,C6S-1.5PUR,simple
4900,C6S-01PUR,simple
4899,C6S-0.50PUR,simple
4898,C6S-0.30PUR,simple
4897,C6S-05ORN,simple
4896,C6S-03ORN,simple
4895,C6S-02ORN,simple
4894,C6S-1.5ORN,simple
4893,C6S-01ORN,simple
4892,C6S-0.50ORN,simple
4891,C6S-0.30ORN,simple
4890,C6S-05RED,simple
4889,C6S-03RED,simple
4888,C6S-02RED,simple
4887,C6S-1.5RED,simple
4886,C6S-01RED,simple
4885,C6S-0.50RED,simple
4884,C6S-0.30RED,simple
4883,C6S-05WHT,simple
4882,C6S-02WHT,simple
4881,C6S-1.5WHT,simple
4880,C6S-0.50WHT,simple
4879,C6S-0.30WHT,simple
4878,C6S-0.50GRY,simple
4877,C6S-0.30GRY,simple
4876,C6S-05YEL,simple
4875,C6S-03YEL,simple
4874,C6S-02YEL,simple
4873,C6S-1.5YEL,simple
4872,C6S-01YEL,simple
4871,C6S-0.50YEL,simple
4870,C6S-0.30YEL,simple
4869,C6S-05BLK,simple
4868,C6S-1.5BLK,simple
4867,C6S-01BLK,simple
4866,C6S-0.50BLK,simple
4865,C6S-0.30BLK,simple
4864,C6S-05GRN,simple
4863,C6S-02GRN,simple
4862,C6S-1.5GRN,simple
4861,C6S-0.50GRN,simple
4860,C6S-0.30GRN,simple
4859,C6S-1.5BLU,simple
4858,C6S-0.50BLU,simple
4857,C6S-0.30BLU,simple
5522,MU31CC-EXT-050BLK,simple
5501,MU31CC-EXT-01BLK,simple
4546,UCH2C2A,simple
5379,MP-UCVG3A,simple
5377,MP-UCHD3A,simple
5375,MP-UCVGCHG2,simple
5371,MP-UCVGGECH,simple
6545,U2-TCMNB02-MM,simple
6544,U2-TCMNB01-MM,simple
5965,U2-TCMCB02-MM,simple
6543,U2-TCB02-MM,simple
5387,U3-TCMCB02-MM,simple
5966,U3-TCMCB01-MM,simple
6542,U3-TCB02-MM,simple
5383,U3-TCC03-MM,simple
5380,U3-TCC02-MM,simple
5374,U3-TCC01-MM,simple
5370,ELUCDP-01RBLK,simple
5366,ELUCDP-02RBLK,simple
5363,ELUCHD-01RBLK,simple
5361,MU23T1-01SGR,simple
5539,MU23T1-01BLK,simple
5358,ELUCHD-02RBLK,simple
5354,U3-TCB01-MM,simple
6541,VPB4P4A18,simple
5350,VPLUCGE3ACH-SGR,simple
5372,VPLUCCR2ACH-SGR,simple
5368,VPLUCHDACH-SGR,simple
6778,DP-VGHD4K-ADP,simple
6540,MDP-VGHD4K-ADP,simple
4544,UCVGHD-ADP,simple
4543,UCVGDVHD-ADP,simple
6777,VPLUCMDHD-BLK,simple
6776,VPLUCMDHD-SGR,simple
5166,SCALC-1.5-OS2,simple
5362,VPLUCMCR,simple
4542,VPLU3AMCR,simple
6775,ASM34,simple
5356,VPLU3H10AP,simple
6539,HDVG-AD-ADPG2,simple
6538,DVDPU-ACTV,simple
6537,HDDPU-ACTV,simple
5355,MU28P-030SLV,simple
5352,MU28P-01BLK,simple
5349,MU28P-01SLV,simple
5532,MU31CA-030BLK,simple
5347,MU31CC-01SGR,simple
5345,MU31CA-01SGR,simple
5343,MU31CA-01BLK,simple
5341,MU2CA-03BLK,simple
5339,MU31CAF-BLK,simple
5337,MU31CC-01BLK,simple
5336,MU2CC-02SLV,simple
5351,MU2CC-03BLK,simple
5348,MU2CC-02BLK,simple
5346,MU2CC-01BLK,simple
5344,MU2CC-03SGR,simple
5342,MU2CC-02SGR,simple
5340,MU2CC-01SGR,simple
6721,VELUC4A36,simple
5338,VELU3H7AP,simple
5335,VPLU3H7AP,simple
5334,MU28P-030BLK,simple
6774,VPM2CA102,simple
4541,UC3AGE,simple
5333,UCG31G2,simple
6773,VPMCA052RGD,simple
5327,VPLUCAGE,simple
6532,ELDP-03,simple
4540,UCMDP-ADP,simple
6536,ELMDPDP-02,simple
4539,VPLUC3AGE,simple
6531,ELDP-02,simple
6535,ELMDPDP-01,simple
5808,C6-305-SL/PVYEL,simple
6530,ELDP-01,simple
5549,MU23T1-01SLV,simple
4473,VPLUC10A100,simple
6534,ELMDPHD-02,simple
5324,ELUCHD-02,simple
5331,USB2-03-MCAB,simple
4491,UCDHP1,simple
6533,ELMDPHD-01,simple
5809,VPMCA052SGR,simple
5329,VTWUHC4A,simple
6529,ELDPDV-02,simple
4854,C6A-0.3-White-SH,simple
6528,ELDPDV-01,simple
4849,C6A-0.3-Black-SH,simple
6523,PAR-FTR-1.5,simple
4853,C6A-0.3-Red-SH,simple
6527,ELDPHD-02,simple
4848,C6A-0.3-Blue-SH,simple
6522,PAR-FTR-0.75,simple
4852,C6A-0.3-Orange-SH,simple
6526,ELDPHD-01,simple
4847,C6S-05BLU,simple
6520,DP-DV4K-01-ACTV,simple
4851,C6A-0.3-Grey-SH,simple
4856,C6A-0.3-Purple-SH,simple
4846,C6S-02BLU,simple
6519,MDP-DV4K-01-ACTV,simple
5805,VPCA104,simple
4855,C6A-0.3-Yellow-SH,simple
4850,C6A-0.3-Green-SH,simple
5251,MTMT-0.5-OM3,simple
6770,VPMCA052,simple
5161,STST-0.5-OM3,simple
6525,HDMI-1.5-MM-V4,simple
6769,VC2A24,simple
5157,SCSC-0.5-OM3,simple
6772,NC136WHT,simple
6768,VCCA20,simple
5153,LCLC-0.5-OM1,simple
6771,NC125WHT,simple
5369,MU2CC-03SLV,simple
5388,USB3GE-ADPDF,simple
5381,VELU3H4A,simple
5367,MU2CC-01SLV,simple
5378,VPLU3H4A,simple
5384,U33HGHEDF,simple
5365,MU2CA-03SLV,simple
5376,VPLU33AGE,simple
5364,MU2CA-01SLV,simple
5373,VPLU3AGE,simple
5199,LCALCA-20-OS2,simple
5807,C6-305-SL/PVPUR,simple
5196,LCALCA-15-OS2,simple
5806,C6-305-ST/PVBLU,simple
5193,LCALCA-10-OS2,simple
6524,PAR-FTR-03,simple
5191,LCALCA-05-OS2,simple
5187,LCALCA-03-OS2,simple
5183,LCALCA-02-OS2,simple
5179,LCALCA-0.5-OS2,simple
6521,DP-DV4K-02-ACTV,simple
6517,DP-HD4K-02-ACTV,simple
6516,MDP-HD4K-02-ACTV,simple
4538,U2CMC-01BLK,simple
6515,MDP-DV4K-02-ACTV,simple
5176,SCASCA-20-OS2,simple
5172,SCASCA-15-OS2,simple
5168,SCASCA-10-OS2,simple
5165,SCASCA-05-OS2,simple
5162,SCASCA-03-OS2,simple
5159,SCASCA-02-OS2,simple
5155,SCASCA-0.5-OS2,simple
5151,SCALC-20-OS2,simple
5148,SCALC-15-OS2,simple
5144,SCALC-10-OS2,simple
5140,SCALC-05-OS2,simple
5137,SCALC-03-OS2,simple
5134,SCALC-02-OS2,simple
5163,SCALC-01-OS2,simple
5158,SCALC-0.5-OS2,simple
5154,SCASC-20-OS2,simple
5150,SCASC-15-OS2,simple
5147,SCASC-10-OS2,simple
5143,SCASC-05-OS2,simple
5139,SCASC-03-OS2,simple
5136,SCASC-02-OS2,simple
5133,SCASC-01-OS2,simple
5130,SCASC-0.5-OS2,simple
5235,MTST-10-OM4,simple
5261,MTST-05-OM4,simple
5256,MTST-03-OM4,simple
5224,MTST-02-OM4,simple
5241,MTST-01-OM4,simple
5226,MTSC-10-OM4,simple
5262,MTSC-05-OM4,simple
5257,MTSC-03-OM4,simple
5249,MTSC-02-OM4,simple
5255,MTSC-01-OM4,simple
5263,MTLC-10-OM4,simple
5245,MTLC-05-OM4,simple
5258,MTLC-03-OM4,simple
5246,MTLC-02-OM4,simple
5252,MTLC-01-OM4,simple
5265,MTMT-10-OM4,simple
5250,MTMT-05-OM4,simple
5233,MTMT-03-OM4,simple
5231,MTMT-02-OM4,simple
5238,MTMT-01-OM4,simple
5146,STSC-10-OM4,simple
5142,STSC-05-OM4,simple
5138,STSC-03-OM4,simple
5132,STSC-02-OM4,simple
5129,STSC-01-OM4,simple
5126,LCSC-30-OS2,simple
5360,MP-UCDVCH,simple
5259,MTSC-20-OM3,simple
5247,MTSC-15-OM3,simple
5244,MTSC-10-OM3,simple
5239,MTSC-05-OM3,simple
5229,MTSC-03-OM3,simple
5254,MTSC-01-OM3,simple
5218,MTST-20-OM3,simple
5253,MTST-15-OM3,simple
5219,MTST-10-OM3,simple
5221,MTST-05-OM3,simple
5260,MTST-03-OM3,simple
5234,MTST-02-OM3,simple
5220,MTST-01-OM3,simple
5240,MTLC-20-OM3,simple
5242,MTLC-15-OM3,simple
5230,MTLC-10-OM3,simple
5225,MTLC-05-OM3,simple
5227,MTLC-03-OM3,simple
5243,MTLC-02-OM3,simple
5232,MTLC-01-OM3,simple
5223,MTMT-20-OM3,simple
5217,MTMT-15-OM3,simple
5222,MTMT-10-OM3,simple
5228,MTMT-05-OM3,simple
5248,MTMT-03-OM3,simple
5264,MTMT-02-OM3,simple
5236,MTMT-01-OM3,simple
4845,C6S-03BLK,simple
4844,C6S-02BLK,simple
5184,STSC-20-OM3,simple
5180,STSC-15-OM3,simple
5174,STSC-10-OM3,simple
5169,STSC-05-OM3,simple
5164,STSC-03-OM3,simple
5160,STSC-02-OM3,simple
5156,STSC-01-OM3,simple
6838,VWCA60,simple
6507,DP-VGA-ADPC,simple
6504,DP-HDMI-ADPC,simple
6513,MDP-VGBK-ACO,simple
6512,MDP-DVBK-ACO,simple
6509,MDP-HDBK-ACO,simple
6506,HDAS-V203CO,simple
6503,HDAS-V202CO,simple
6514,HDAS-V201CO,simple
6511,HDAS-V203,simple
6508,HDAS-V202,simple
6505,HDAS-V201,simple
5359,TB34K2DP,simple
5357,TB34K2HD,simple
6502,HDMI-40-MM,simple
4843,C6S-01BLU,simple
4842,C6S-03BLU,simple
4841,C6S-03WHT,simple
4840,C6S-03GRN,simple
4839,C6S-01GRN,simple
4838,C6S-01WHT,simple
6501,DP-7.5-MM,simple
5353,U3-TCA02-MM,simple
4472,CASW-CT14BD,simple
4471,WMB-CT14BD,simple
5152,SCSC-1.5-OS2,simple
4837,C6S-05GRY,simple
4836,C6S-03GRY,simple
4835,C6S-02GRY,simple
4834,C6S-1.5GRY,simple
4833,C6S-01GRY,simple
6500,DPLC-HD4KAC,simple
6499,MDP-HD4KAC,simple
5332,U30AS25,simple
6826,UW2-534-WHT,simple
5330,MU31CA-01SLV,simple
5328,MU31CAF-SGR,simple
5326,MU31CAF-SLV,simple
5325,MU31CC-01SLV,simple
4832,C5-0.3-Pink,simple
4831,C5-0.3-Blue,simple
4830,C6-20-Grey,simple
4829,C6-04-Grey,simple
4828,C6-2.5-Grey,simple
4827,C6-15-White,simple
4826,C6-04-White,simple
4825,C6-2.5-White,simple
4824,C6-15-Yellow,simple
4823,C6-04-Yellow,simple
4822,C6-2.5-Yellow,simple
4821,C6-04-Green,simple
4820,C6-2.5-Green,simple
4819,C6-20-Black,simple
4818,C6-04-Black,simple
4817,C6-2.5-Black,simple
4816,C6-04-Blue,simple
4644,C6-2.5-Blue,simple
5237,MTSC-02-OM3,simple
6488,DP02-MMCO,simple
6487,DVI-HD02-MMCO,simple
6486,DVI-HD10-MMCO,simple
5742,J9XXXA-HP-ALG,simple
5740,SFP-10G-ER-ALG,simple
6498,PAOHD-70MM,simple
6497,PAOHD-50MM,simple
5961,MF-AUS3PC5-03,simple
6496,PAOHD-40MM,simple
5316,MP-UCHDGECH,simple
6491,MDP-VGA-ACTV,simple
6495,PAOHD-30MM,simple
5305,U3-TC25-AC,simple
6745,MF-C19C20-05-BLU,simple
6843,MF-C19C20-05-RD,simple
6744,MF-C19C20-1.5-BLU,simple
6490,HDMI-10-MM,simple
4537,MP-UCHDCH,simple
6476,U2-TCB01-MM,simple
6489,PAOHD-20MM,simple
6492,VGA-01-MMCO,simple
4536,UCHD4KCH-ADP,simple
5804,U3-TCA-MF,simple
6845,MF-C19C20-1.5-RD,simple
4462,SB-DCS8,simple
5323,USB3-20A-AA,simple
4535,UCVGA-ADP,simple
6485,DP-HD4K-02-MM,simple
5318,UC314CA,simple
5320,USB3-10A-AA,simple
5312,UCDP-ADP,simple
6484,DP-HD4K-01-MM,simple
5310,UCDVI-ADP,simple
6830,UW2-534UC,simple
6482,MDP-HD4K-02-MM,simple
4534,UCHD4K-ADP,simple
5962,UW2-534MCAB,simple
6481,MDP-HD4K-01-MM,simple
6483,PAOHD-100MM,simple
6827,UW2-534,simple
5301,U3-TCA01-MM,simple
5303,U3-TCA03-MM,simple
5149,SCASCA-01-OS2,simple
5960,U2-TCMCB01-MM,simple
6832,UW2-534U8P,simple
4643,C5-1.5-Pink,simple
5803,C6-305-SL/PVGRY,simple
5145,LCSC-1.5-OS2,simple
5802,U3-TCA015-MF,simple
5141,LCALCA-01-OS2,simple
4642,C5-1.5-Green,simple
6480,VGHD35,simple
6479,VGDV-MF,simple
6767,C5-305-SL/PVBLU,simple
6477,DVVG-MF,simple
6478,HDMI-7.5-MM-V4,simple
4641,C6-50-Green,simple
4640,C6-30-Green,simple
4639,C6-25-Green,simple
4638,C6-15-Green,simple
5738,SFP-10GSR-ALG300-HP,simple
6475,DP-DPDVIHD-ADP,simple
4465,WMB-10APT-10,simple
6469,HDD-DVI-03-MM,simple
6474,DP-VGDVHD-ADP,simple
6473,MF-3PC15-05,simple
4631,C6A-02-Pink-SH,simple
4464,WMB-M10,simple
6468,HDD-DVI-01-MM,simple
6472,DVHD-MF,simple
4630,C6A-1.5-Pink-SH,simple
5297,U2MCAB-02RR,simple
6467,HDC-DVI-03-MM,simple
4467,SB-CT14BD,simple
6461,HDC-DVI-01-MM,simple
6460,MF-AUS3PC13-05-MC,simple
5952,MF-AUS3PC13RT-02-MC,simple
5296,U2MCAB-01RR,simple
5737,SFP-10G-LR-ALG-HP,simple
6466,MF-AUS3PC13-03-MC,simple
6465,MF-AUS3PC13-01-MC,simple
5949,MF-AUS3PC13-02-MC,simple
4469,CASW-M10,simple
6470,3RCA-3RCA-15,simple
4637,C6A-1.5-Orange-SH,simple
5556,USB2-0.25-MCAB,simple
4636,C6A-01-Orange-SH,simple
6822,MF-C14C15-0.5-BLU,simple
5942,MF-PEXT-20-BLK,simple
5941,MF-PEXT-15-BLK,simple
6464,30P-USB-0.25,simple
5940,MF-PEXT-10-BLK,simple
6829,MF-3PC19-03-10A,simple
4635,C6A-0.5-Orange-SH,simple
5939,MF-PEXT-05-BLK,simple
6849,MF-C19C20-03-RD,simple
5827,MF-PEXT-03-BLK,simple
6743,MF-C19C20-03-BLU,simple
4634,C6A-10-Pink-SH,simple
5636,USB3-01-AM-AM,simple
5135,LCLC-07-OM4,simple
4633,C6A-05-Pink-SH,simple
6741,USB2-01-AM-AM,simple
6766,VU34PCH,simple
4632,C6A-03-Pink-SH,simple
4490,VU3DUP,simple
4621,C6A-10-White-SH,simple
5131,LCLC-50-OS2,simple
4626,C6A-0.5-Red-SH,simple
4620,C6A-1.5-White-SH,simple
6462,SB-CST32T,simple
6459,HDC-DVI-02-MM,simple
5291,USB2-0.5-MCAB,simple
5932,MF-AUS3PC5-0.5,simple
4629,C6A-0.5-Pink-SH,simple
5294,UL-025WH,simple
6458,VGA-HDUP,simple
4628,C6A-10-Red-SH,simple
4625,C6A-10-Orange-SH,simple
6457,HDD-DVI-02-MM,simple
4627,C6A-1.5-Red-SH,simple
4624,C6A-05-Orange-SH,simple
6825,SB-CT36BNT,simple
4623,C6A-03-Orange-SH,simple
6852,MF-C19C20-01-RD,simple
6740,MF-C19C20-01-BLU,simple
6455,MF-C19C20-0.5-BLU,simple
6841,MF-C19C20-0.5-RD,simple
4622,C6A-02-Orange-SH,simple
6454,MF-C14C15-1.5-BLU,simple
6855,MF-C14C15-03-RD,simple
6848,MF-C14C15-1.5-RD,simple
6453,MF-C14C15-03-BLU,simple
6853,MF-C14C15-01-RD,simple
6850,MF-C14C15-0.5-RD,simple
6820,MF-C14C15-01-BLU,simple
6452,MF-C14C15-02-BLU,simple
6854,MF-C14C15-02-RD,simple
6451,DP-VGA-03-MM,simple
6446,DP-VGA-01-MM,simple
6445,MDP-VGA-03-MM,simple
6444,MDP-VGA-01-MM,simple
4463,SB-M10,simple
6443,MDP-VGDVHD-ADP,simple
6819,SB-10APT-10,simple
5290,U34BHBK,simple
4619,C6A-01-Pink-SH,simple
5288,U32HDDVVG,simple
5736,GLC-ZX-SM-ALG,simple
6442,MDP-SPL-ADP,simple
5944,MF-AUS3PC5-01,simple
6441,MDP-DPDVIHD-ADP,simple
4618,C6A-10-Yellow-SH,simple
4617,C6A-1.5-Yellow-SH,simple
4616,C6A-0.5-Yellow-SH,simple
4615,C6A-10-Green-SH,simple
4614,C6A-10-Black-SH,simple
6437,VGA-MM-15-APS,simple
6726,PHD-02-MM-V2C,simple
4613,C6A-0.5-Black-SH,simple
6436,VGA-MM-10-APS,simple
6723,PHD-01-MM-V2C,simple
6440,MF-C13C14-1.5-BLU,simple
5933,MF-AUS2PC7-03,simple
6719,PHD-05-MM-V2C,simple
5526,USB3-03-AM-AM,simple
6439,VGA-MM-30-APS,simple
6717,PHD-05-MM-V2,simple
4612,C6A-01-Black-SH,simple
6438,VGA-MM-20-APS,simple
6715,PHD-03-MM-V2C,simple
6435,HDC-MM-03-V2,simple
6434,HDC-MM-01-V2,simple
4607,C6A-1.5-Purple-SH,simple
4611,C6A-05-Black-SH,simple
6423,MDP-HDMI-01-MM,simple
6433,HDD-MM-03-V2,simple
4606,C6A-01-Purple-SH,simple
6765,USB37PH,simple
6422,MDP-DP-03-MM,simple
6432,HDD-MM-01-V2,simple
4610,C6A-10-Purple-SH,simple
4605,C6A-0.5-Purple-SH,simple
6421,MDP-DP-01-MM,simple
5930,MF-AUS2PC7-01,simple
5929,MF-AUS2PC7-0.5,simple
6431,MDP-DVBK-ADP,simple
4609,C6A-05-Purple-SH,simple
5309,U28P-01BK,simple
6420,DVI-DL-01-MM,simple
6430,MDP-VGBK-ADP,simple
6429,HMJ-ADP,simple
4608,C6A-02-Purple-SH,simple
6419,TL-AD-10,simple
5928,MF-3PC13-10,simple
6428,AD-SPL-03,simple
6418,HDMI-MINI-ADPCL,simple
5125,LCSC-02-OS2,simple
6427,AD-SPL-01,simple
6742,MF-C19C20-02-BLU,simple
6851,MF-C19C20-02-RD,simple
4815,C6-20-Green,simple
6426,MDP-DVI-03-MM,simple
6409,MF-C13C14-01-BLU,simple
4814,C6-20-White,simple
6425,MDP-DVI-01-MM,simple
6408,MF-C13C14-0.5-BLU,simple
6417,DVID-VGA-ADP,simple
6424,MDP-HDMI-03-MM,simple
6407,DVI-FF-ADP,simple
5307,30P-USB-02,simple
5302,AU60EXT2,simple
5128,LCLC-100-OM3,simple
5924,MF-3PC19-02-10A,simple
6415,HDMI-MICRO-ADPCL,simple
4813,C6A-03-Black-SH,simple
5605,AU100EXT2,simple
4812,C6A-02-Black-SH,simple
4811,C6A-1.5-Black-SH,simple
6413,MF-C13C14-03-BLU,simple
6840,MF-C13C14-03-RD,simple
6720,PHD-03-MM-V2,simple
6718,PHD-02-MM-V2,simple
6716,PHD-01-MM-V2,simple
5298,U3DVVG-ADP,simple
6416,HDC-MM-02-V2,simple
4810,C6A-0.5-Green-SH,simple
6414,VGA-MF-25,simple
4809,C6A-25-Blue-SH,simple
6847,MF-C13C14-0.5-RD,simple
6411,MF-C13C14-0.5-WH,simple
5122,STST-20-OS2,simple
5118,STST-15-OS2,simple
5114,STST-10-OS2,simple
5110,STST-05-OS2,simple
5107,STST-03-OS2,simple
5103,STST-02-OS2,simple
5099,STST-01-OS2,simple
5095,STST-0.5-OS2,simple
5091,SCST-20-OS2,simple
5087,SCST-15-OS2,simple
5084,SCST-10-OS2,simple
5081,SCST-05-OS2,simple
5077,SCST-03-OS2,simple
5073,SCST-02-OS2,simple
5070,SCST-01-OS2,simple
5066,SCST-0.5-OS2,simple
5062,SCSC-05-OS2,simple
5058,SCSC-03-OS2,simple
5054,SCSC-01-OS2,simple
5050,SCSC-0.5-OS2,simple
6406,MF-C13C14-03-WH,simple
6844,MF-C13C14-1.5-RD,simple
6842,MF-C13C14-01-RD,simple
6405,HDD-MM-02-V2,simple
5048,LCST-20-OS2,simple
5119,LCST-15-OS2,simple
5115,LCST-10-OS2,simple
5111,LCST-05-OS2,simple
5108,LCST-03-OS2,simple
5104,LCST-02-OS2,simple
5100,LCST-01-OS2,simple
5096,LCST-0.5-OS2,simple
5093,LCSC-20-OS2,simple
5089,LCSC-15-OS2,simple
5086,LCSC-10-OS2,simple
5082,LCSC-05-OS2,simple
5078,LCSC-03-OS2,simple
5074,SCSC-02-OS2,simple
5069,LCSC-01-OS2,simple
5065,LCSC-0.5-OS2,simple
5061,LCLC-20-OS2,simple
5059,LCLC-10-OS2,simple
5055,LCLC-05-OS2,simple
5052,LCLC-01-OS2,simple
5047,SCSC-20-OS2,simple
5124,LCLC-0.5-OS2,simple
5121,SCSC-15-OS2,simple
5117,SCSC-10-OS2,simple
5674,LCLC-1.5-OM4,simple
4808,C6-15-Grey,simple
6404,DP-DVI-ADPC,simple
6403,MF-C13C14-02-WH,simple
6402,MF-C13C14-1.5-WH,simple
6401,MF-C13C14-01-WH,simple
5917,MF-PEXT-02-BLK,simple
5113,LCLC-03-OS2,simple
5109,LCLC-15-OS2,simple
6400,DMCHD-VGA-AD-ADP,simple
5106,LCLC-02-OS2,simple
5101,LCLC-0.5-OM4,simple
5655,USB2-MCAB-RTADP,simple
5735,SFP-10G-LR-ALG,simple
6764,RJ45-FF-01,simple
6399,CMNHD-VGA-AD-ADP,simple
6398,MF-C13C14-10,simple
4489,USB3DHDS,simple
4807,C6A-30-Blue-SH,simple
4533,UP236A,simple
6397,MDP-DP-ADP,simple
6763,TB-01-MM-BK,simple
6396,MDP-VGA-02-MM,simple
6395,3RCA-3RCA-01,simple
4803,C6A-05-White-SH,simple
5097,LCST-25-OM3,simple
6394,DVI-DL-05B-MM,simple
5051,SCSC-01-OM4,simple
4802,C6A-05-Red-SH,simple
5092,LCLC-50-OM3,simple
6393,DVI-DL-03B-MM,simple
4532,UD29A,simple
5916,MF-AUS2PC7-05,simple
4801,C6A-05-Green-SH,simple
4806,C6A-05-Yellow-SH,simple
6392,DVI-DL-02B-MM,simple
4793,C6-1.5-Red-CSV,simple
4800,C6A-03-White-SH,simple
4805,C6A-02-Yellow-SH,simple
6391,HDMI-15-MM-V4,simple
4792,C6A-0.5-Blue-SH,simple
6390,HDMI-10-MM-V4,simple
4799,C6A-02-White-SH,simple
4804,C6A-01-Yellow-SH,simple
4791,C6A-1.5-Green-SH,simple
4798,C6A-03-Red-SH,simple
5637,USB2-03-AM-AM,simple
4790,C6A-03-Purple-SH,simple
4797,C6A-02-Red-SH,simple
5088,STST-10-OM4,simple
4789,C6A-01-White-SH,simple
4796,C6A-01-Red-SH,simple
5083,STST-05-OM4,simple
4788,C6A-03-Yellow-SH,simple
4795,C6A-02-Green-SH,simple
5080,STST-03-OM4,simple
4787,C6A-03-Green-SH,simple
4794,C6A-01-Green-SH,simple
5076,STST-02-OM4,simple
6386,MF-C13C14-02-BLU,simple
5072,STST-01-OM4,simple
6846,MF-C13C14-02-RD,simple
5068,SCSC-10-OM4,simple
5046,LCSC-25-OM3,simple
5064,SCSC-05-OM4,simple
5767,SFP-10G-SR-ALG,simple
6737,MF-C14C15-03,simple
5060,SCSC-03-OM4,simple
5505,USB3-02-AM-AM,simple
6388,MF-3PC15-03,simple
5056,SCSC-02-OM4,simple
4786,C6-20-Yellow,simple
5289,USB3HDDV-ADP,simple
6762,HDMI-SPL-02,simple
5127,LCLC-1.5-OM3,simple
5280,USB2-20EXT-ACTV,simple
6761,TB-03-MM-BK,simple
6387,MM-AD-01,simple
5123,LCLC-2.5-OM3,simple
6384,MFF-C14C13-02,simple
5911,MFF-C14C13-0.3,simple
6817,DMS59-VGA,simple
5766,GLC-LH-SM-ALG,simple
5765,GLC-T-ALG,simple
4960,C5-1.5-White,simple
6758,TB-02-MM-BK,simple
6385,MF-3PC13RT-03,simple
5764,GLC-SX-MM-ALG,simple
6376,3RCA-3RCA-02,simple
6374,3RCA-3RCA-10,simple
5278,USB2-05-MAB,simple
6735,MF-C14C15-0.5,simple
6734,MF-C14C15-1.5,simple
6370,MF-C19C20-1.5,simple
5896,MF-3PC13-1.5,simple
5895,MF-3PC13-0.5,simple
5894,MF-3PRTC13-02,simple
5893,MF-3PC13RT-02,simple
4964,C6-2.5-Red,simple
4958,C6-15-Black,simple
4784,C5-1.5-Blue,simple
6361,AD-EXT-02,simple
4959,C6-30-Blue,simple
6367,VGA-MM-01,simple
6365,VGA-MM-7.5-APS,simple
6363,VGA-MM-05-APS,simple
6362,VGA-MM-03-APS,simple
6358,VGA-MM-02-APS,simple
6356,VGA-MM-01-APS,simple
5524,USB3-03-MCAB,simple
5615,USB3-02-MCAB,simple
5633,USB3-01-MCAB,simple
5276,USB2-MCAB-ADP,simple
6732,USB2-0.5-AA,simple
6760,MF-C13C14-1.5,simple
6759,MF-C13C14-0.5,simple
5904,MF-AUS2PC7-02,simple
6377,MF-3PC15-02,simple
5902,MF-3PC15-01,simple
6375,MDP-VGA-AIC,simple
6371,MDP-DVI-AIC,simple
6369,MDP-DVI-ACTV,simple
6368,HDMI-VGA-AD-ADP,simple
6366,HDMI-05-MM-V4,simple
6364,HDMI-03-MM-V4,simple
6360,HDMI-02-MM-V4,simple
6359,HDMI-01-MM-V4,simple
6357,HDMI-0.5-MM-V4,simple
6355,HDMI-05-MM-V4B,simple
6354,HDMI-03-MM-V4B,simple
6353,HDMI-02-MM-V4B,simple
6352,HDMI-01-MM-V4B,simple
6351,DVI-DL-01B-MM,simple
6757,MF-C13C14-02,simple
5618,USB3-01-AA,simple
6350,DP-HDMI-01-MM,simple
5627,USB2-01-AA,simple
6349,DP-DVI-ACTV,simple
5890,MF-C13C14-01,simple
5624,30P-USB-01,simple
6348,DP-DVI-01-MM,simple
4961,C6A-7.5-Grey-SH,simple
5763,IMS-0.5-8087,simple
4948,C6A-7.5-Blue-SH,simple
6340,VGA-MF-30,simple
6339,VGA-MF-20,simple
6347,DVI-I-DVIVGA-MFF,simple
6338,VGA-MF-15,simple
5271,USB2-05-AA,simple
6337,VGA-MF-10,simple
6346,DP-DVI-05-MM,simple
6345,MF-C13C14-05,simple
6336,VGA-MFF-SPL,simple
5270,USB3-03-AA,simple
6335,VGA-MF-05,simple
5269,USB2-03-AA,simple
6858,3.5-Y-MFF,simple
6344,DP-DVI-03-MM,simple
6739,MF-C13C14-03,simple
5776,IMS-01-8087,simple
5268,USB3-02-AA,simple
5761,IMS-0.5-8087S,simple
5613,USB2-02-AA,simple
6333,DVI-DL-05-MF,simple
6342,DP-DVI-02-MM,simple
6332,DVI-DL-03-MF,simple
6736,MF-C14C15-02,simple
5063,LCST-01-OM4,simple
6330,DVI-DL-02-MF,simple
5775,IMS-01-8087S,simple
5881,MF-C19C20-0.5,simple
6329,VGA-MF-03,simple
5888,MF-C14C15-01,simple
6315,AD-SPL-05,simple
6319,AD-SPL-02,simple
6328,VGA-MF-02,simple
6327,MDP-DP-02-MM,simple
6857,3.5M-2F-ADP,simple
5120,LCLC-20-OM4,simple
6325,AD-SPL-10,simple
5057,LCSC-03-OM4,simple
5116,LCLC-15-OM4,simple
5102,LCSC-20-OM4,simple
5053,LCLC-03-OM4,simple
5112,LCST-10-OM4,simple
5098,LCSC-15-OM4,simple
5049,LCSC-02-OM4,simple
5105,LCLC-10-OM4,simple
5094,LCSC-10-OM4,simple
5045,LCSC-01-OM4,simple
6326,DP-VGA-ADP,simple
5090,LCST-05-OM4,simple
5041,LCLC-01-OM4,simple
5085,LCSC-05-OM4,simple
6314,HDMI-30-MM,simple
5079,LCLC-05-OM4,simple
6313,HDMI-25-MM,simple
5075,LCST-03-OM4,simple
6312,HDMI-20-MM,simple
5071,LCST-02-OM4,simple
6324,HDMI-15-MM,simple
6323,MF-C19C20-10,simple
5067,LCLC-02-OM4,simple
6322,MF-C19C20-02,simple
6321,MF-C19C20-01,simple
5300,USB3-02-AB,simple
5308,USB2-01-MCAB,simple
6316,3.5M-2RCAF-ADP,simple
5774,EMS-05-EMS,simple
5033,LCLC-25-OM3,simple
5037,LCLC-0.5-OM3,simple
5295,USB3-01-AB,simple
5758,EMS-03-EMS,simple
6308,MF-AUS3P2C13-03,simple
6307,MF-AUS3P2C13-01,simple
5029,STST-20-OM3,simple
5753,IMS-0.5-8482-8087,simple
5757,EMS-02-EMS,simple
6733,USB2-05-AB,simple
5025,SCSC-20-OM3,simple
5751,IMS-0.5-8484-8087,simple
5755,EMS-01-EMS,simple
6320,MF-C19C20-05,simple
5630,USB2-02-MAB,simple
6318,MF-C19C20-03,simple
5822,MF-AUS3P2C13-02,simple
5311,USB2-02-MCAB,simple
6317,MF-AUS3P2C13-1.5,simple
5021,LCST-20-OM3,simple
5616,USB2-03-AB,simple
4997,LCLC-15-OM3,simple
5017,LCSC-20-OM3,simple
5283,USB2-01-MAB,simple
4993,STST-10-OM3,simple
5013,STST-15-OM3,simple
5282,USB2-02-AB,simple
4989,SCSC-10-OM3,simple
5009,SCSC-15-OM3,simple
5279,USB2-01-AB,simple
4985,LCST-10-OM3,simple
5005,LCST-15-OM3,simple
6302,MDP-HDMI-02-MM,simple
5001,LCSC-15-OM3,simple
4981,LCSC-10-OM3,simple
4973,STST-05-OM3,simple
4977,LCLC-10-OM3,simple
4969,SCSC-05-OM3,simple
6311,HDMI-10-MM-V4F,simple
4965,LCST-05-OM3,simple
5612,USB3-03-AB,simple
5042,LCSC-05-OM3,simple
6310,DP-HDMI-ADP,simple
5038,LCLC-05-OM3,simple
6309,HDMI-02-MM-V4F,simple
5034,STST-03-OM3,simple
5030,SCSC-03-OM3,simple
5026,LCST-03-OM3,simple
5022,LCSC-03-OM3,simple
5018,LCLC-03-OM3,simple
5014,STST-02-OM3,simple
5010,SCSC-02-OM3,simple
5006,LCST-02-OM3,simple
5002,LCSC-02-OM3,simple
4998,LCLC-02-OM3,simple
4995,STST-01-OM3,simple
4991,SCSC-01-OM3,simple
4988,LCST-01-OM3,simple
4984,LCSC-01-OM3,simple
4979,LCLC-01-OM3,simple
5749,IMS-01-8482-8087,simple
5747,IMS-01-8484-8087,simple
6301,DP-HDMI-05-MM,simple
5277,USB2-10EXT-ACTV,simple
6300,HDMI-05-MM-V4F,simple
6299,DP-HDMI-03-MM,simple
6298,DP-HDMI-02-MM,simple
6297,HDMI-03-MM-V4F,simple
6296,DP-DVI-ADP,simple
6295,HDMI-01-MM-V4F,simple
6294,DVI-HDMI-MF,simple
5745,EMS-05-SAS,simple
5743,EMS-03-SAS,simple
5741,EMS-02-SAS,simple
5739,EMS-01-SAS,simple
6293,MDP-DVI-02-MM,simple
4974,STST-20-OM1,simple
4970,SCST-20-OM1,simple
4966,SCSC-20-OM1,simple
5044,LCST-20-OM1,simple
5040,LCSC-20-OM1,simple
5036,LCLC-20-OM1,simple
5032,STST-15-OM1,simple
5028,SCST-15-OM1,simple
5024,SCSC-15-OM1,simple
5020,LCST-15-OM1,simple
5016,LCSC-15-OM1,simple
5012,LCLC-15-OM1,simple
5008,STST-10-OM1,simple
5004,SCST-10-OM1,simple
5000,SCSC-10-OM1,simple
4996,LCST-10-OM1,simple
4992,LCSC-10-OM1,simple
4987,LCLC-10-OM1,simple
6821,DVI-DL-20-MM,simple
6818,DVI-DL-15-MM,simple
6292,VGA-MM-30,simple
6291,VGA-MM-25,simple
6290,VGA-MM-20,simple
6289,VGA-MM-15,simple
6288,DP-VGA-02-MM,simple
6287,VGA-MM-10,simple
6286,DVI-DL-10-MM,simple
5275,USB3-05A-AA,simple
5272,USB2-05EXT-ACTV,simple
6285,DVI-VGA-MF,simple
6284,MF-C14AUS3P-1.5,simple
5873,MF-C14AUS3P-0.15,simple
6823,DVI-MFF-SPL,simple
4983,STST-05-OM1,simple
4980,SCST-05-OM1,simple
4976,SCSC-05-OM1,simple
4972,LCST-05-OM1,simple
4968,LCSC-05-OM1,simple
5043,LCLC-05-OM1,simple
5039,STST-03-OM1,simple
5035,SCST-03-OM1,simple
5031,SCSC-03-OM1,simple
5027,LCST-03-OM1,simple
5023,LCSC-03-OM1,simple
5019,LCLC-03-OM1,simple
5015,STST-02-OM1,simple
5011,SCST-02-OM1,simple
5007,SCSC-02-OM1,simple
5003,LCST-02-OM1,simple
4999,LCSC-02-OM1,simple
4994,LCLC-02-OM1,simple
4990,STST-01-OM1,simple
4986,SCST-01-OM1,simple
4982,SCSC-01-OM1,simple
4978,LCST-01-OM1,simple
4975,LCSC-01-OM1,simple
4971,LCLC-01-OM1,simple
6283,DVI-DL-05-MM,simple
6282,DVI-DL-03-MM,simple
6281,VGA-MM-05,simple
6280,DVI-DL-02-MM,simple
6279,VGA-MM-03,simple
6278,DVI-I-VGA-02-MM,simple
6277,VGA-MM-02,simple
4938,C6A-1.5-Grey-SH,simple
4962,C6A-1.5-Blue-SH,simple
5872,MF-AUS3PC5-05,simple
4941,C6A-0.5-Grey-SH,simple
4946,C6A-0.5-White-SH,simple
5871,MF-AUS3PC5-02,simple
4967,LCLC-20-OM3,simple
4945,C6A-20-Blue-SH,simple
4949,C6A-15-Blue-SH,simple
4942,C6A-10-Grey-SH,simple
4936,C6A-10-Blue-SH,simple
6276,VGA-DVI-MF,simple
5520,USB2-05-AM-AM,simple
5503,USB2-02-AM-AM,simple
6275,MDP-MDP-02-MM,simple
6274,HDMI-MINI-ADP,simple
4963,C6A-05-Grey-SH,simple
4939,C6A-05-Blue-SH,simple
4940,C6A-03-Grey-SH,simple
4937,C6A-03-Blue-SH,simple
4935,C6A-02-Grey-SH,simple
4956,C6A-02-Blue-SH,simple
4957,C6A-01-Grey-SH,simple
4947,C6A-01-Blue-SH,simple
6273,AD-EXT-01,simple
6271,AD-EXT-20,simple
6272,AD-EXT-15,simple
6270,AD-EXT-10,simple
6268,HDMI-DVI-MF,simple
6266,AD-EXT-05,simple
6264,AD-EXT-03,simple
5859,MF-PEXT-25,simple
5858,MF-PEXT-20,simple
5857,MF-PEXT-15,simple
5870,MF-PEXT-10,simple
6269,DP-10-MM,simple
6267,DVI-HDMI-05-MM,simple
6265,DVI-HDMI-03-MM,simple
6263,DVI-HDMI-02-MM,simple
6262,DVI-HDMI-01-MM,simple
6261,DVI-HDMI-15MF,simple
6260,HDMI-DVI-15MF,simple
5869,MF-PEXT-05,simple
6250,TL-AD-02,simple
5868,MF-PEXT-03,simple
5867,MF-PEXT-02,simple
6255,DP-01-MM,simple
6254,MF-3PC19-05,simple
6729,MF-3PC19-03,simple
5864,MF-3PC19-02,simple
6249,TL-AD-01,simple
6824,MF-3PC19-01,simple
5863,MF-3PC13-05,simple
6259,DP-05-MM,simple
6248,TV-MM-15,simple
5862,MF-3PC13-03,simple
5861,MF-3PC13-02,simple
5860,MF-3PC13-01,simple
4950,C5-0.5-Yellow,simple
6257,DP-03-MM,simple
6247,TV-MM-10,simple
6252,TL-AD-05,simple
4952,C5-0.5-Purple,simple
4955,C5-10-Yellow,simple
6256,DP-02-MM,simple
6251,TL-AD-03,simple
4943,C5-0.5-Orange,simple
4954,C5-10-Purple,simple
4951,C6-1.5-Yellow,simple
4780,C6-0.5-Orange,simple
6246,C5-0.5-Green,simple
4944,C5-10-Orange,simple
4953,C6-1.5-Purple,simple
4779,C6-0.3-Yellow,simple
4775,C5-0.5-Black,simple
6242,TV-MM-03,simple
4783,C6-1.5-Orange,simple
4778,C6-0.3-Purple,simple
6245,3RCA-3RCA-05,simple
6241,TV-MM-02,simple
4782,C6-0.5-Yellow,simple
4777,C6-0.3-Orange,simple
6244,3RCA-3RCA-03,simple
6240,TV-MM-01,simple
4781,C6-0.5-Purple,simple
4776,C5-0.5-White,simple
6243,TV-MM-05,simple
4774,C6-10-Yellow,simple
4772,C6-10-Orange,simple
4768,C5-05-Yellow,simple
4763,C5-03-Orange,simple
4773,C6-10-Purple,simple
4771,C6-10-Red-CSV,simple
4767,C5-05-Purple,simple
4762,C6-1.5-White,simple
4758,C5-02-Purple,simple
4770,C5-10-White,simple
4766,C5-05-Orange,simple
4761,C6-1.5-Green,simple
4757,C5-02-Orange,simple
6239,C5-10-Green,simple
4765,C5-03-Yellow,simple
4760,C6-1.5-Black,simple
4756,C6-0.5-White,simple
4769,C5-10-Black,simple
4764,C5-03-Purple,simple
4759,C5-02-Yellow,simple
4755,C6-0.5-Green,simple
4753,C6-0.3-White,simple
4748,C5-0.5-Pink,simple
6236,MM-AD-10,simple
4754,C6-0.5-Black,simple
4752,C6-0.3-Black,simple
4747,C5-0.5-Grey,simple
4745,C5-50-Blue,simple
4741,C6-10-White,simple
4751,C5-01-Yellow,simple
4746,C5-0.5-Blue,simple
4744,C5-25-Blue,simple
4740,C6-10-Green,simple
4750,C5-01-Purple,simple
6238,MM-AD-20,simple
4743,C5-20-Blue,simple
4739,C6-10-Black,simple
4749,C5-01-Orange,simple
6237,MM-AD-15,simple
4738,C5-10-Red,simple
4742,C5-15-Blue,simple
4736,C5-10-Grey,simple
4731,C6-05-Orange,simple
4737,C5-10-Pink,simple
4727,C6-03-Yellow,simple
4735,C5-10-Blue,simple
4730,C6-05-Black,simple
4722,C6-02-Yellow,simple
4726,C6-03-Purple,simple
4734,C6-05-Red-CSV,simple
4729,C6-03-Red-CSV,simple
4721,C6-02-Purple,simple
4725,C6-03-Orange,simple
4733,C6-05-Yellow,simple
4728,C5-05-White,simple
4720,C6-02-Orange,simple
4724,C6-03-Black,simple
4732,C6-05-Purple,simple
6235,C5-05-Green,simple
4719,C6-02-Black,simple
4723,C6-02-Red-CSV,simple
4713,C6-01-Yellow,simple
4718,C5-05-Black,simple
4717,C5-03-White,simple
6233,C5-02-Green,simple
4712,C6-01-Purple,simple
4704,C6-0.3-Grey,simple
6234,C5-03-Green,simple
4708,C5-03-Black,simple
4711,C6-01-Orange,simple
4703,C5-02-Black,simple
4716,C6-1.5-Pink,simple
4707,C6-0.5-Pink,simple
4710,C6-01-Black,simple
4715,C6-1.5-Blue,simple
4702,C5-01-White,simple
4706,C6-0.5-Grey,simple
4709,C5-02-White,simple
4714,C6-01-Red-CSV,simple
6232,C5-01-Green,simple
4705,C6-0.3-Pink,simple
4701,C5-0.5-Red,simple
4698,C6-25-Blue,simple
4700,C5-01-Black,simple
4693,C6-10-Blue,simple
4697,C6-20-Blue,simple
6231,MM-AD-05,simple
4688,C5-05-Blue,simple
4692,C6-05-White,simple
6230,MM-AD-03,simple
4696,C6-15-Blue,simple
4687,C6-03-White,simple
4691,C6-05-Green,simple
6229,MM-AD-02,simple
4695,C6-10-Pink,simple
4686,C6-03-Green,simple
4690,C5-05-Pink,simple
4694,C6-10-Grey,simple
4699,C6-50-Blue,simple
4685,C6-02-White,simple
4689,C5-05-Grey,simple
4684,C6-02-Green,simple
4673,C5-02-Grey,simple
4678,C6-1.5-Grey,simple
4683,C5-05-Red,simple
4668,C5-01-Grey,simple
4672,C5-02-Blue,simple
4677,C6-01-White,simple
4682,C5-03-Pink,simple
4667,C5-01-Blue,simple
4671,C6-0.5-Red,simple
4676,C6-01-Green,simple
4681,C5-03-Grey,simple
4666,C6-10-Red,simple
4680,C5-03-Blue,simple
4670,C6-0.3-Red,simple
4675,C5-02-Red,simple
4665,C6-05-Pink,simple
4679,C6-1.5-Red,simple
4674,C5-02-Pink,simple
4669,C5-01-Pink,simple
4664,C6-05-Grey,simple
4663,C6-05-Blue,simple
4648,C6-01-Grey,simple
4653,C5-01-Red,simple
4658,C6-02-Grey,simple
4652,C6-05-Red,simple
4662,C6-03-Pink,simple
6228,MDP-HDMI-AIC,simple
4657,C6-02-Blue,simple
4651,C6-03-Red,simple
4647,C6-0.5-Blue,simple
4661,C6-03-Grey,simple
4656,C5-03-Red,simple
4646,C6-0.3-Green,simple
4650,C6-02-Red,simple
4660,C6-03-Blue,simple
4655,C6-01-Pink,simple
4645,C6-0.3-Blue,simple
4654,C6-01-Blue,simple
4659,C6-02-Pink,simple
4649,C6-01-Red,simple
4593,ALIPS,simple
4586,ALUS19,simple
6659,AEXRBK,configurable
6568,AE5RBK,simple
6567,AE2RBK,simple
4592,ALASS,simple
4545,UC3ACR,simple
4510,ULDNAMN-UA-SGR,simple
4081,2222222,simple
