 ===== INPUT POLYNOMIAL ====== 
Degree: 3
Coefficients:  1.0000 3.0000-5.0000 1.0000

===== ALL INTERVALS CONTAINING ROOTS =====
[-6.000000, -2.632993]
[-2.632993, 0.632993]
[0.632993, 3.236068]

===== SHRINKED INTERVAL =====
[-4.316497, -3.895621]

===== ROOT FOUND BY CONSTANT NUMBER OF ITERATION =====
Number of iteration: 10
x = -4.236068
First error: 0.00000000000000062133
Second error: 0.00000000000000000000

===== ROOT FOUND BY FIRST ERROR FUNCTION =====
Error: 0.000001
x = -4.236067977738450

===== ROOT FOUND BY SECOND ERROR FUNCTION =====
Error: 0.000001
x = -4.236067977738450

===== ROOT FOUND BY GIVEN ERROR =====
Error: 0.000001
x = -4.236067977738450

