﻿<meta sql="begin ? := {p0sys_funcschema}qltn_thtoan.in_vat_khoanmuc('{p0chukyno}','{p0phieu_id}','{p0gomhd}','{p0sys_dataschema}','{u0userID}'); end;" name="a" rec-per-page="100" dbms-font="VN8VN3" run="1">
<meta sql="begin ? := {p0sys_funcschema}qltn_tracuu.in_phieuthu_cuoc('{p0chukyno}','{p0phieu_id}','{p0gomhd}','{p0sys_dataschema}','{u0userID}'); end;" name="b" rec-per-page="100" dbms-font="VN8VN3" run="1">
<?xml version="1.0" standalone="no"?>
<svg id="svg-root" width="210mm" height="297mm" xmlns:xlink="http://www.w3.org/1999/xlink" xmlns="http://www.w3.org/2000/svg">
	<text x="225" y="157" space="preserve" font-family="Times New Roman" font-size="14" fill="#000000" stroke="none" baseline-shift="baseline" transform="matrix(1,0,0,1,1,-18)">
	{F02TEN_TT}</text>
	<text x="143" y="176" space="preserve" font-family="Times New Roman" font-size="14" fill="#000000" stroke="none" baseline-shift="baseline" transform="matrix(1,0,0,1,5,-17)">
	{f02DIACHI_TT}</text>
<text x="424" y="153" space="preserve" font-family="Times New Roman" font-size="14" fill="#000000" stroke="none" baseline-shift="baseline" transform="matrix(1,0,0,1,19,-31)">
{f02MS_THUE}</text>
<tr sql-index="1" td-value="{includep:ccbs_qltn/bctk/hoadon_data}">
<text x="540" y="336" space="preserve" font-family="Times New Roman" font-size="14" fill="#000000" stroke="none" stroke-opacity="0" baseline-shift="baseline" transform="matrix(1,0,0,1,-10,-33)">
{f02TRAGOC}</text>
<text x="540" y="360" space="preserve" font-family="Times New Roman" font-size="14" fill="#000000" stroke="none" stroke-opacity="0" baseline-shift="baseline" transform="matrix(1,0,0,1,-10,-42)">
{f02TRATHUE}</text>
<text x="586" y="372" space="preserve" font-family="Times New Roman" font-size="14" fill="#000000" stroke="none" stroke-opacity="0" baseline-shift="baseline" transform="matrix(1,0,0,1,-56,-39)">
{f02TONG}</text>
<text x="212" y="395" space="preserve" font-family="Times New Roman" font-size="14" fill="#000000" stroke="none" stroke-opacity="0" baseline-shift="baseline" transform="matrix(1,0,0,1,-140,-28)">
{f02TIEN_CHU}</text>
 </svg>
