[
  {
    "name": "Happy Birthday",
    "price": "25$",
    "description": "Amazon.com eGift Card.",
    "image": "https://m.media-amazon.com/images/I/81gQraBrBZL._SS500_.jpg",
    "details": {
      "Type": "Digital gift card",
      "Custom message": "Yes",
      "Delivery method": "Email",
      "Gift amount": "$1 - $2,000"
    }
  },
  {
    "name": "Welcome Baby",
    "price": "15$",
    "description": "Amazon.com eGift Card.",
    "image": "https://cdn5.vectorstock.com/i/1000x1000/35/79/welcome-baby-card-vector-14713579.jpg",
    "details": {
      "Type": "Digital gift card",
      "Custom message": "No",
      "Delivery method": "Mail",
      "Gift amount": "$1 - $4,000"
    }
  },
  {
    "name": "Congratulations",
    "price": "7$",
    "description": "Amazon.com eGift Card.",
    "image": "https://cdn.shopify.com/s/files/1/0786/6519/products/congrats_on_sleeping_with_the_same_person_wedding_card.jpg?v=1532655560",
    "details": {
      "Type": "Digital gift card",
      "Custom message": "Yes",
      "Delivery method": "PDF download",
      "Gift amount": "$1 - $6,000"
    }
  },
  {
    "name": "Thank you",
    "price": "6.99$",
    "description": "Amazon.com eGift Card.",
    "image": "https://fiverr-res.cloudinary.com/images/t_main1,q_auto,f_auto/gigs/108897597/original/2a21b24798a3c3fe4a492ff52ab8ec52b86bc71b/design-awesome-thank-you-card-within-6-hours.jpg",
    "details": {
      "Type": "Digital gift card",
      "Custom message": "Yes",
      "Delivery method": "Email",
      "Gift amount": "$1 - $200"
    }
  }
]
