{
  "version": "2.0",
  "routeKey": "$default",
  "rawPath": "/mini10-rust-hf-lambda",
  "rawQueryString": "text=I%20love%20rust",
  "headers": {
    "Accept": "text/html,application/xhtml+xml,application/xml;q=0.9,image/avif,image/webp,image/apng,*/*;q=0.8,application/signed-exchange;v=b3;q=0.7",
    "Accept-Encoding": "gzip, deflate, br, zstd",
    "Accept-Language": "zh-CN,zh;q=0.9,en-US;q=0.8,en;q=0.7,zh-HK;q=0.6,zh-TW;q=0.5",
    "Cache-Control": "no-cache",
    "Content-Length": "83",
    "Content-Type": "application/json",
    "Date": "Thu, 18 Apr 2024 20:50:23 GMT",
    "Pragma": "no-cache",
    "Sec-Ch-Ua": "\"Google Chrome\";v=\"125\", \"Chromium\";v=\"125\", \"Not.A/Brand\";v=\"24\"",
    "Sec-Ch-Ua-Mobile": "?0",
    "Sec-Ch-Ua-Platform": "\"Windows\"",
    "Sec-Fetch-Dest": "document",
    "Sec-Fetch-Mode": "navigate",
    "Sec-Fetch-Site": "none",
    "Sec-Fetch-User": "?1",
    "Upgrade-Insecure-Requests": "1",
    "User-Agent": "Mozilla/5.0 (Windows NT 10.0; Win64; x64) AppleWebKit/537.36 (KHTML, like Gecko) Chrome/125.0.0.0 Safari/537.36"
  },
  "queryStringParameters": {
    "text": "I love rust"
  },
  "requestContext": {
    "accountId": "unknown",
    "apiId": "34ct5jlwn1",
    "domainName": "34ct5jlwn1.execute-api.us-east-2.amazonaws.com",
    "domainPrefix": "34ct5jlwn1",
    "http": {
      "method": "GET",
      "path": "/mini10-rust-hf-lambda",
      "protocol": "HTTP/1.1",
      "sourceIp": "3.22.25.181",
      "userAgent": "Mozilla/5.0 (Windows NT 10.0; Win64; x64) AppleWebKit/537.36 (KHTML, like Gecko) Chrome/125.0.0.0 Safari/537.36"
    },
    "requestId": "WcIebiP8CYcEMFA=",
    "routeKey": "$default",
    "stage": "prod",
    "time": "18/Apr/2024:20:50:23 GMT",
    "timeEpoch": 1587250223000
  },
  "body": "",
  "isBase64Encoded": false
}
