Name,Species,Gender,Height (cm),Weight (kg),Birth Year,Homeworld,Affiliation
Luke Skywalker,Human,Male,172,77,19BBY,Tatooine,Rebel Alliance
Darth Vader,Human,Male,202,136,41.9BBY,Tatooine,Galactic Empire
Princess Leia Organa,Human,Female,150,49,19BBY,Alderaan,Rebel Alliance
Han Solo,Human,Male,180,80,29BBY,Corellia,Rebel Alliance
Chewbacca,Wookiee,Male,228,112,200BBY,Kashyyyk,Rebel Alliance
Obi-Wan Kenobi,Human,Male,182,77,57BBY,Stewjon,Rebel Alliance
Yoda,Unknown,Male,66,17,896BBY,Dagobah,Jedi Order
Anakin Skywalker,Human,Male,188,84,41.9BBY,Tatooine,Jedi Order
Padmé Amidala,Naboo,Female,165,45,46BBY,Naboo,Galactic Republic
Rey,Human,Female,170,unknown,Unknown,Jakku,Resistance
Finn,Human,Male,unknown,unknown,Unknown,Unknown,Resistance
Poe Dameron,Human,Male,unknown,unknown,Unknown,Yavin 4,Resistance
Kylo Ren,Human,Male,unknown,unknown,Unknown,Unknown,First Order
BB-8,Droid,Unknown,unknown,unknown,Unknown,Unknown,Resistance
C-3PO,Droid,Unknown,167,75,112BBY,Tatooine,Rebel Alliance
R2-D2,Droid,Unknown,96,32,33BBY,Naboo,Rebel Alliance
Mace Windu,Human,Male,188,84,72BBY,Haruun Kal,Jedi Order
Qui-Gon Jinn,Human,Male,193,unknown,92BBY,Coruscant,Jedi Order
Count Dooku,Human,Male,193,unknown,102BBY,Serenno,Sith
Darth Maul,Zabrak,Male,175,80,54BBY,Dathomir,Sith
Emperor Palpatine,Human,Male,170,75,84BBY,Naboo,Galactic Empire
Jabba the Hutt,Hutt,Genderless,Unknown,1,600BBY,Nal Hutta,Independent
Boba Fett,Human,Male,183,78,31.5BBY,Kamino,Independent
Lando Calrissian,Human,Male,177,79,31BBY,Socorro,Rebel Alliance
Wedge Antilles,Human,Male,170,77,21BBY,Corellia,Rebel Alliance
Admiral Ackbar,Mon Calamari,Male,180,83,41BBY,Mon Cala,Rebel Alliance
