{
    "Comment": "An example of the Amazon States Language for fanning out AWS Batch job",
    "StartAt": "Validate and Map",
    "TimeoutSeconds": 3600,
    "States": {
      "Validate and Map": {
        "Type": "Task",
        "Resource": "arn:aws:states:::lambda:invoke",
        "OutputPath": "$.Payload",
        "Parameters": {
          "Payload.$": "$",
          "FunctionName": "arn:aws:lambda:us-west-2:<account_number>:function:ns380-step-lambda-1:$LATEST"
        },
        "Next": "Fan out batch jobs"
      },
      "Fan out batch jobs": {
        "Comment": "Start multiple executions of batch job depending on pre-processed data",
        "Type": "Map",
        "MaxConcurrency": 3,
        "ItemsPath": "$.payload",
        "Iterator": {
          "StartAt": "Process",
          "States": {
            "Process": {
              "Type": "Task",
              "Resource": "arn:aws:states:::lambda:invoke",
              "OutputPath": "$.Payload",
              "Parameters": {
                "Payload.$": "$",
                "FunctionName": "arn:aws:lambda:us-west-2:<account_number>:function:ns380-step-lambda-2:$LATEST"
              },
              "Retry": [
                {
                  "ErrorEquals": [
                    "Lambda.ServiceException",
                    "Lambda.AWSLambdaException",
                    "Lambda.SdkClientException",
                    "Lambda.TooManyRequestsException"
                  ],
                  "IntervalSeconds": 1,
                  "MaxAttempts": 3,
                  "BackoffRate": 2
                }
              ],
              "End": true
            }
          }
        },
        "Next": "Reduce"
      },
      "Reduce": {
        "Type": "Task",
        "Resource": "arn:aws:states:::lambda:invoke",
        "OutputPath": "$.Payload",
        "Parameters": {
          "Payload.$": "$",
          "FunctionName": "arn:aws:lambda:us-west-2:<account_number>:function:ns380-step-lambda-3:$LATEST"
        },
        "Retry": [
          {
            "ErrorEquals": [
              "Lambda.ServiceException",
              "Lambda.AWSLambdaException",
              "Lambda.SdkClientException",
              "Lambda.TooManyRequestsException"
            ],
            "IntervalSeconds": 1,
            "MaxAttempts": 3,
            "BackoffRate": 2
          }
        ],
        "End": true
      }
    }
  }