; ModuleID = 'probe5.adf894122bb7a71a-cgu.0'
source_filename = "probe5.adf894122bb7a71a-cgu.0"
target datalayout = "e-m:o-i64:64-i128:128-n32:64-S128"
target triple = "arm64-apple-macosx11.0.0"

; std::f64::<impl f64>::copysign
; Function Attrs: inlinehint uwtable
define internal double @"_ZN3std3f6421_$LT$impl$u20$f64$GT$8copysign17h5a37bbe3cbe372cbE"(double %self, double %sign) unnamed_addr #0 {
start:
  %0 = alloca double, align 8
  %1 = call double @llvm.copysign.f64(double %self, double %sign)
  store double %1, ptr %0, align 8
  %_0 = load double, ptr %0, align 8, !noundef !2
  ret double %_0
}

; probe5::probe
; Function Attrs: uwtable
define void @_ZN6probe55probe17hce8f1d93528f813fE() unnamed_addr #1 {
start:
; call std::f64::<impl f64>::copysign
  %_1 = call double @"_ZN3std3f6421_$LT$impl$u20$f64$GT$8copysign17h5a37bbe3cbe372cbE"(double 1.000000e+00, double -1.000000e+00)
  ret void
}

; Function Attrs: nocallback nofree nosync nounwind speculatable willreturn memory(none)
declare double @llvm.copysign.f64(double, double) #2

attributes #0 = { inlinehint uwtable "frame-pointer"="non-leaf" "probe-stack"="inline-asm" "target-cpu"="apple-m1" }
attributes #1 = { uwtable "frame-pointer"="non-leaf" "probe-stack"="inline-asm" "target-cpu"="apple-m1" }
attributes #2 = { nocallback nofree nosync nounwind speculatable willreturn memory(none) }

!llvm.module.flags = !{!0}
!llvm.ident = !{!1}

!0 = !{i32 8, !"PIC Level", i32 2}
!1 = !{!"rustc version 1.77.0-nightly (d5fd09972 2024-01-22)"}
!2 = !{}
