; ModuleID = 'probe1.b9b95c35918116a-cgu.0'
source_filename = "probe1.b9b95c35918116a-cgu.0"
target datalayout = "e-m:o-i64:64-i128:128-n32:64-S128"
target triple = "arm64-apple-macosx11.0.0"

!llvm.module.flags = !{!0}
!llvm.ident = !{!1}

!0 = !{i32 8, !"PIC Level", i32 2}
!1 = !{!"rustc version 1.77.0-nightly (d5fd09972 2024-01-22)"}
