"n","eff_b","prior","B_mean_mmse","B_CI_avg"
100,0.25,"horse",0.0733391310149319,1.24509748579681
100,0.25,"lasso",0.0534419856017901,1.29738572754964
100,0.5,"horse",0.116036177411241,1.46025322179837
100,0.5,"lasso",0.108329708862258,1.38404419919053
100,0.75,"horse",0.320209819483355,1.11712560890721
100,0.75,"lasso",0.30587883584717,1.18587675676162
500,0.25,"horse",0.0543354989688968,0.481244930480448
500,0.25,"lasso",0.0540790170857107,0.483233751894052
500,0.5,"horse",0.0219709746053387,0.610482534992664
500,0.5,"lasso",0.0270732727898087,0.649818106563515
500,0.75,"horse",0.0273956601540878,0.597110842355173
500,0.75,"lasso",0.0286036844029897,0.61189589180638
1000,0.25,"horse",0.0411588739209602,0.334103251422537
1000,0.25,"lasso",0.0415886953204997,0.33907499863329
1000,0.5,"horse",0.0578560399925864,0.386220107319141
1000,0.5,"lasso",0.0571147746925983,0.38971707457635
1000,0.75,"horse",0.0398812201864448,0.537736974453072
1000,0.75,"lasso",0.0438724713598775,0.52580825983349
