method,0.025%,point estimate,0.975%,SE
IPW,0.2730708428410578,0.33354887710093994,0.395036490359869,0.031073821466132287
overlap,0.2815380482321449,0.3464954389053082,0.41342113903388666,0.03299340436983874
IPW,0.14760626351297945,0.20527178534038548,0.25790331833502717,0.028669324116524782
overlap,0.128416284527302,0.18923395083312056,0.24577311462474768,0.03109441991523905
IPW,-0.012664352992502459,0.05564377637947804,0.12784957596066593,0.03529443321170513
overlap,0.03503796122972471,0.09634221887854844,0.15903288819618075,0.03168362101261614
IPW,0.012615486451107261,0.12590152069736604,0.23097690988417308,0.05715193214679954
overlap,0.07446309036920008,0.15198133275926973,0.22278662186923867,0.03898181097596606
