method,0.025%,point estimate,0.975%,SE
IPW,0.22143362804455546,0.26086696574153867,0.29326703851344255,0.023417588440821025
overlap,0.2345020782071658,0.2646915686085668,0.2971107505651117,0.02095145280288319
IPW,0.16608233295494745,0.19389027550904586,0.23531131539565042,0.022278478801574277
overlap,0.18811924885268608,0.2121926645305917,0.25306126187963757,0.02263041098657649
IPW,0.13612235382474885,0.17459572361972753,0.20436924963919229,0.02320308704961293
overlap,0.12251322041484038,0.16651849326995127,0.1987592157993155,0.02335678400484383
IPW,0.021772947675119038,0.08391110234798158,0.135812821253124,0.038805150215607764
overlap,0.09128524990166964,0.13646525419146988,0.1661269293923788,0.023998908439511274
