0	cat80B	q
1	cont7	q
2	cat79D	q
3	cat57B	q
4	cont2	q
5	cat80D	q
6	cat12B	q
7	cont12	q
8	cont14	q
9	cat87B	q
10	cat81B	q
11	cat72B	q
12	cat1A	q
13	cat113U	q
14	cat53B	q
15	cat10B	q
16	cont11	q
17	cont3	q
18	cat100I	q
19	cat44B	q
20	cont1	q
21	cat2B	q
22	cat4B	q
