Id,Designator,Package,Designation,Supplier,Supplier Part #,Manufactuer,Manufacturer Part #,Description,Quantity,Cost/Unit,Cost,URL
1,R1,R_0805_2012Metric_Pad1.20x1.40mm_HandSolder,0,Digikey,RMCF0805ZT0R00CT-ND,Stackpole Electronics Inc,RMCF0805ZT0R00,RES 0 OHM JUMPER 1/8W 0805,1,0.1,0.1,https://www.digikey.com/en/products/detail/stackpole-electronics-inc/RMCF0805ZT0R00/1756901
2,R2,R_0603_1608Metric_Pad0.98x0.95mm_HandSolder,500,Digikey,CR0603-FX-4990ELFCT-ND,Bourns Inc,CR0603-FX-4990ELF,RES SMD 499 OHM 1% 1/10W 0603,1,0.1,0.1,https://www.digikey.com/en/products/detail/bourns-inc/CR0603-FX-4990ELF/3784058
3,D1,LED_0603_1608Metric_Pad1.05x0.95mm_HandSolder,LED,Digikey,516-1797-1-ND,Broadcom Limited,HSMG-C120,Green 572nm LED Indication - Discrete 2.2V 0603 (1608 Metric),1,0.51,0.51,https://www.digikey.com/en/products/detail/broadcom-limited/HSMG-C120/1235337
4.1,U1,Anderson_2_Horizontal_Side_by_Side,Anderson-2,Digikey,2243-1336G1-ND,Anderson Power Products Inc,1336G1,45A HORIZ. (BOT) RA LP CONTACT,2,1.34,2.68,https://www.digikey.com/en/products/detail/anderson-power-products-inc/1336G1/10650490
4.2,U1,Anderson_2_Horizontal_Side_by_Side,Anderson-2,Digikey,2243-1327-ND,Anderson Power Products Inc,1327,PP15/45-HOUSING W/SPG-RED,1,0.7,0.7,https://www.digikey.com/en/products/detail/anderson-power-products-inc/1327/10647415
4.3,U1,Anderson_2_Horizontal_Side_by_Side,Anderson-2,Digikey,2243-1327G6-BK-ND,Anderson Power Products Inc,1327G6-BK,PP15/45-HOUSING W/SPG-BLACK,1,0.67,0.67,https://www.digikey.com/en/products/detail/anderson-power-products-inc/1327G6-BK/10650286
5,"J4,J3,J2,J1",IDC-Header_2x15_P2.54mm_Vertical,Conn_01x30_Pin,Digikey,900-0702463001-ND,Molex,702463001,CONN HEADER VERT 30POS 2.54MM,4,3.22,12.88,https://www.digikey.com/en/products/detail/molex/0702463001/760173
