<svg version="1.1" id="Ebene_1" xmlns="http://www.w3.org/2000/svg" xmlns:xlink="http://www.w3.org/1999/xlink" x="0px" y="0px"
	 width="1463px" height="400px" viewBox="0 0 1463 400" enable-background="new 0 0 1463 400" xml:space="preserve">
<g display="none">
	<g display="inline">
		<path fill="#FFFFFF" d="M391.1,80.5h20.2c13.1,0,21.8,0.6,26.5,1.8c4.6,1.2,8.1,3.2,10.5,5.9c2.4,2.8,3.8,5.9,4.4,9.1
			c0.6,3.4,0.8,9.9,0.8,19.8v36.3c0,9.3-0.4,15.5-1.4,18.8c-0.8,3.2-2.4,5.7-4.6,7.5c-2.2,1.8-4.8,3-8.1,3.6c-3.2,0.6-8.1,1-14.5,1
			h-33.7V80.5z M418,98.2v68.3c3.8,0,6.3-0.8,7.3-2.4c0.8-1.6,1.4-5.9,1.4-12.7v-40.4c0-4.6-0.2-7.7-0.4-9.1c-0.2-1.4-1-2.2-2-2.8
			C423,98.6,421,98.2,418,98.2z"/>
		<path fill="#FFFFFF" d="M466.1,80.5h19.2c12.7,0,21.4,0.4,25.8,1.4c4.4,1,8.3,3.4,11.1,7.5s4.2,10.5,4.2,19.4c0,8.1-1,13.5-3,16.4
			c-2,2.8-6.1,4.4-11.9,5c5.3,1.4,8.9,3,10.7,5.3c1.8,2.2,3,4.2,3.4,6.1c0.4,1.8,0.6,7.1,0.6,15.3v27.5h-25v-34.5
			c0-5.7-0.4-9.1-1.4-10.3c-0.8-1.4-3.2-2-6.9-2v46.8h-27.1V80.5H466.1z M492.9,98.2v23c3,0,5.3-0.4,6.5-1.2
			c1.2-0.8,1.8-3.6,1.8-8.1v-5.7c0-3.2-0.6-5.5-1.8-6.5C498.2,98.8,496.1,98.2,492.9,98.2z"/>
		<path fill="#FFFFFF" d="M600.3,80.5v69.3c0,7.9-0.2,13.3-0.8,16.6c-0.6,3.2-2,6.5-4.6,9.9c-2.4,3.4-5.9,5.9-9.9,7.7
			c-4,1.8-8.9,2.6-14.5,2.6c-6.3,0-11.7-1-16.4-3c-4.6-2-8.3-4.6-10.7-8.1c-2.4-3.2-3.8-6.7-4.2-10.5c-0.4-3.6-0.6-11.3-0.6-23V80.5
			h27.1v77.7c0,4.4,0.2,7.5,0.8,8.7c0.4,1.2,1.4,1.8,3,1.8s2.8-0.6,3.2-2c0.4-1.4,0.8-4.6,0.8-9.9V80.5H600.3z"/>
		<path fill="#FFFFFF" d="M613.3,80.5h27.3c7.3,0,12.9,0.6,17,1.8c4,1.2,6.9,2.8,8.9,5c2,2.2,3.4,4.8,4,7.9c0.6,3,1,7.9,1,14.3v9.1
			c0,6.7-0.6,11.5-2,14.5c-1.4,3-3.8,5.5-7.5,7.1c-3.6,1.6-8.5,2.4-14.3,2.4h-7.3v41.8h-27.1V80.5z M640.1,98.2v26.5
			c0.8,0,1.4,0,2,0c2.4,0,4.2-0.6,5.3-1.8c1-1.2,1.4-3.8,1.4-7.7v-8.5c0-3.6-0.6-5.9-1.6-6.9C646,98.8,643.8,98.2,640.1,98.2z"/>
		<path fill="#FFFFFF" d="M724.7,80.5l15.3,103.8h-27.7l-1.4-18.6h-9.7l-1.6,18.6h-27.9l13.7-103.8H724.7z M710.6,147.3
			c-1.4-11.7-2.8-26.3-4-43.6c-2.8,19.8-4.4,34.3-5.3,43.6H710.6z"/>
		<path fill="#FFFFFF" d="M774.2,80.5v83h16.4v20.8h-43.4V80.5H774.2z"/>
		<path fill="#FFFFFF" d="M860.4,125.7h-27.1v-18c0-5.3-0.2-8.5-0.8-9.9c-0.6-1.2-1.8-2-3.8-2c-2.2,0-3.6,0.8-4.2,2.4
			c-0.6,1.6-0.8,5-0.8,10.3v48.3c0,5,0.2,8.3,0.8,9.9c0.6,1.6,2,2.2,4,2.2c2,0,3.2-0.8,4-2.2c0.6-1.6,1-5.3,1-10.9v-13.1h27.1v4
			c0,10.7-0.8,18.4-2.2,22.8c-1.6,4.4-4.8,8.5-10.1,11.7c-5.3,3.4-11.5,5-19.2,5c-7.9,0-14.3-1.4-19.6-4.2
			c-5.3-2.8-8.5-6.9-10.1-11.9c-1.6-5-2.4-12.7-2.4-22.8V117c0-7.5,0.2-13.1,0.8-16.8c0.6-3.6,2-7.3,4.6-10.7
			c2.6-3.4,6.1-6.3,10.5-8.1c4.4-2,9.7-3,15.5-3c7.9,0,14.5,1.6,19.6,4.6c5,3,8.5,6.9,10.1,11.5c1.6,4.6,2.4,11.7,2.4,21.4v9.7
			C860.6,125.7,860.4,125.7,860.4,125.7z"/>
		<path fill="#FFFFFF" d="M919.2,80.5l15.3,103.8h-27.7l-1.4-18.6H896l-1.6,18.6h-27.9l13.7-103.8H919.2z M904.9,147.3
			c-1.4-11.7-2.8-26.3-4-43.6c-2.8,19.8-4.4,34.3-5.3,43.6H904.9z"/>
		<path fill="#FFFFFF" d="M1024.8,80.5v103.8h-23.6v-70.1l-9.5,70.1h-16.8l-9.9-68.5v68.5h-23.6V80.5h34.9c1,6.3,2,13.5,3.2,22
			l3.8,26.5l6.3-48.5H1024.8z"/>
		<path fill="#FFFFFF" d="M1037.9,80.5h27.3c7.3,0,12.9,0.6,17,1.8c4,1.2,6.9,2.8,8.9,5c2,2.2,3.4,4.8,4,7.9c0.6,3,1,7.9,1,14.3v9.1
			c0,6.7-0.6,11.5-2,14.5c-1.4,3-3.8,5.5-7.5,7.1s-8.5,2.4-14.3,2.4h-7.3v41.8h-27.1L1037.9,80.5L1037.9,80.5z M1065,98.2v26.5
			c0.8,0,1.4,0,2,0c2.4,0,4.2-0.6,5.3-1.8c1-1.2,1.4-3.8,1.4-7.7v-8.5c0-3.6-0.6-5.9-1.6-6.9C1070.9,98.8,1068.4,98.2,1065,98.2z"/>
		<path fill="#FFFFFF" d="M1131.8,80.5h19.2c12.7,0,21.4,0.4,25.8,1.4c4.4,1,8.3,3.4,11.1,7.5c2.8,4,4.2,10.5,4.2,19.4
			c0,8.1-1,13.5-3,16.4c-2,2.8-6.1,4.4-11.9,5c5.3,1.4,8.9,3,10.7,5.3c1.8,2.2,3,4.2,3.4,6.1c0.4,1.8,0.6,7.1,0.6,15.3v27.5h-25
			v-34.5c0-5.7-0.4-9.1-1.4-10.3c-0.8-1.4-3.2-2-6.9-2v46.8h-27.1V80.5H1131.8z M1158.7,98.2v23c3,0,5.3-0.4,6.5-1.2
			c1.2-0.8,1.8-3.6,1.8-8.1v-5.7c0-3.2-0.6-5.5-1.8-6.5C1164,98.8,1161.9,98.2,1158.7,98.2z"/>
		<path fill="#FFFFFF" d="M1266.1,80.5v69.3c0,7.9-0.2,13.3-0.8,16.6c-0.6,3.2-2,6.5-4.6,9.9c-2.4,3.4-5.9,5.9-9.9,7.7
			c-4,1.8-8.9,2.6-14.5,2.6c-6.3,0-11.7-1-16.4-3c-4.6-2-8.3-4.6-10.7-8.1c-2.4-3.2-3.8-6.7-4.2-10.5c-0.4-3.6-0.6-11.3-0.6-23V80.5
			h27.1v77.7c0,4.4,0.2,7.5,0.8,8.7c0.4,1.2,1.4,1.8,3,1.8s2.8-0.6,3.2-2c0.4-1.4,0.8-4.6,0.8-9.9V80.5H1266.1z"/>
		<path fill="#FFFFFF" d="M1341.1,80.5v103.8H1314v-43.6h-8.1v43.6h-27.1V80.5h27.1v37.2h8.1V80.5H1341.1z"/>
		<path fill="#FFFFFF" d="M1354.2,80.5h19.2c12.7,0,21.4,0.4,25.8,1.4c4.4,1,8.3,3.4,11.1,7.5c2.8,4,4.2,10.5,4.2,19.4
			c0,8.1-1,13.5-3,16.4c-2,2.8-6.1,4.4-11.9,5c5.3,1.4,8.9,3,10.7,5.3c1.8,2.2,3,4.2,3.4,6.1c0.4,1.8,0.6,7.1,0.6,15.3v27.5h-25
			v-34.5c0-5.7-0.4-9.1-1.4-10.3c-0.8-1.4-3.2-2-6.9-2v46.8H1354V80.5H1354.2z M1381.2,98.2v23c3,0,5.3-0.4,6.5-1.2
			c1.2-0.8,1.8-3.6,1.8-8.1v-5.7c0-3.2-0.6-5.5-1.8-6.5C1386.5,98.8,1384.3,98.2,1381.2,98.2z"/>
	</g>
	<rect x="387.1" y="222" display="inline" fill="#FFFFFF" width="1076.3" height="8.1"/>
	<g display="inline">
		<path fill="#FFFFFF" d="M388.9,269.3h27.5V282h-11.1v11.9h10.3V306h-10.3V320h12.1v12.7h-28.5V269.3z"/>
		<path fill="#FFFFFF" d="M453.9,297.1H440v-2.8c0-2.4-0.2-3.8-0.4-4.6c-0.2-0.6-1-1-2-1c-0.8,0-1.6,0.2-2,0.8
			c-0.4,0.6-0.6,1.4-0.6,2.6c0,1.6,0.2,2.8,0.4,3.4c0.2,0.8,0.8,1.6,2,2.4c1,0.8,3.4,2.2,6.9,3.8c4.6,2.2,7.7,4.4,9.1,6.3
			c1.4,2,2.2,4.8,2.2,8.7c0,4.2-0.6,7.5-1.6,9.5c-1,2.2-2.8,3.8-5.5,5c-2.6,1.2-5.7,1.8-9.3,1.8c-4,0-7.5-0.6-10.3-1.8
			c-2.8-1.2-4.8-3-5.9-5c-1-2.2-1.6-5.5-1.6-9.7v-2.4h13.9v3.2c0,2.8,0.2,4.6,0.6,5.5c0.4,0.8,1,1.2,2,1.2c1.2,0,1.8-0.2,2.4-0.8
			c0.4-0.6,0.6-1.8,0.6-3.6c0-2.4-0.2-4-0.8-4.6c-0.6-0.6-3.6-2.4-9.1-5.5c-4.6-2.6-7.5-5-8.5-7.1c-1-2.2-1.6-4.6-1.6-7.5
			c0-4.2,0.6-7.3,1.6-9.1c1-2,3-3.4,5.7-4.6c2.6-1,5.7-1.6,9.1-1.6s6.5,0.4,8.7,1.2c2.4,0.8,4.2,2,5.5,3.4c1.2,1.4,2,2.8,2.4,4
			c0.2,1.2,0.4,3.2,0.4,5.7v3.2L453.9,297.1L453.9,297.1z"/>
		<path fill="#FFFFFF" d="M491.7,297.1h-13.9v-2.8c0-2.4-0.2-3.8-0.4-4.6c-0.2-0.6-1-1-2-1c-0.8,0-1.6,0.2-2,0.8
			c-0.4,0.6-0.6,1.4-0.6,2.6c0,1.6,0.2,2.8,0.4,3.4c0.2,0.8,0.8,1.6,2,2.4c1,0.8,3.4,2.2,6.9,3.8c4.6,2.2,7.7,4.4,9.1,6.3
			c1.4,2,2.2,4.8,2.2,8.7c0,4.2-0.6,7.5-1.6,9.5c-1,2.2-2.8,3.8-5.5,5c-2.6,1.2-5.7,1.8-9.3,1.8c-4,0-7.5-0.6-10.3-1.8
			c-2.8-1.2-4.8-3-5.9-5c-1-2.2-1.6-5.5-1.6-9.7v-2.4h13.9v3.2c0,2.8,0.2,4.6,0.6,5.5c0.4,0.8,1,1.2,2,1.2c1.2,0,1.8-0.2,2.4-0.8
			c0.4-0.6,0.6-1.8,0.6-3.6c0-2.4-0.2-4-0.8-4.6c-0.6-0.6-3.6-2.4-9.1-5.5c-4.6-2.6-7.5-5-8.5-7.1c-1-2.2-1.6-4.6-1.6-7.5
			c0-4.2,0.6-7.3,1.6-9.1c1-2,3-3.4,5.7-4.6c2.6-1,5.7-1.6,9.1-1.6s6.5,0.4,8.7,1.2c2.4,0.8,4.2,2,5.5,3.4c1.2,1.4,2,2.8,2.4,4
			c0.2,1.2,0.4,3.2,0.4,5.7v3.2L491.7,297.1L491.7,297.1z"/>
		<path fill="#FFFFFF" d="M532.9,307.4h-20.6v11.3c0,2.4,0.2,3.8,0.6,4.4c0.4,0.6,1,1,2,1c1.2,0,2-0.4,2.4-1.4
			c0.4-0.8,0.6-2.6,0.6-5.3v-6.7h14.9v3.8c0,3.2-0.2,5.7-0.6,7.5s-1.4,3.6-2.8,5.5c-1.4,2-3.4,3.4-5.7,4.4c-2.2,1-5,1.4-8.5,1.4
			s-6.3-0.4-8.9-1.4c-2.6-1-4.4-2.2-6.1-4c-1.4-1.6-2.4-3.4-3-5.5c-0.6-2-0.8-5-0.8-8.9v-15.1c0-4.4,0.6-8.1,1.8-10.7
			s3.2-4.6,6.1-6.1s6.1-2,9.7-2c4.4,0,8.1,0.8,10.9,2.4c2.8,1.6,4.8,3.8,6.1,6.7c1.2,2.8,1.8,6.7,1.8,11.7L532.9,307.4L532.9,307.4z
			 M516.9,298.9v-3.8c0-2.6-0.2-4.4-0.4-5.3c-0.2-0.8-0.8-1.2-1.8-1.2s-1.8,0.4-2,1c-0.2,0.6-0.4,2.4-0.4,5.5v3.8L516.9,298.9
			L516.9,298.9z"/>
		<path fill="#FFFFFF" d="M554.1,280.6l-0.2,4.8c1.2-1.8,2.6-3.4,4.2-4.2c1.6-1,3.6-1.4,5.7-1.4c2.6,0,4.8,0.6,6.7,1.8
			s2.8,2.8,3.2,4.8c0.4,2,0.8,5.3,0.8,9.7v36.3h-15.8v-35.9c0-3.6-0.2-5.7-0.4-6.5c-0.2-0.8-0.8-1.2-2-1.2c-1.2,0-1.8,0.4-2,1.4
			c-0.2,0.8-0.4,3.2-0.4,7.3v35.1h-15.8v-52.1H554.1z"/>
		<path fill="#FFFFFF" d="M589,320.2v5.7c0,3-0.4,5.5-1,7.3c-0.6,1.8-2,3.4-3.6,4.8c-1.8,1.4-3.6,2.2-5.9,2.6v-4.4
			c1.6-0.8,2.4-2,2.6-3.6h-2.6v-12.3H589z"/>
		<path fill="#FFFFFF" d="M645.6,292.5h-16.4v-5.9c0-3.6-0.2-5.9-0.4-6.9c-0.4-1-1-1.4-2.2-1.4c-1,0-1.6,0.4-2,1.2
			c-0.4,0.8-0.6,2.8-0.6,6.1v30.3c0,2.8,0.2,4.6,0.6,5.7c0.4,0.8,1,1.4,2.2,1.4c1.2,0,2-0.6,2.4-1.6s0.6-3,0.6-5.9V308h-3.2v-9.7
			h19.2v33.9h-10.3l-1.6-4.4c-1.2,2-2.6,3.4-4.2,4.4c-1.6,1-3.6,1.4-6.1,1.4c-2.8,0-5.5-0.6-7.7-2c-2.4-1.4-4.2-3-5.5-5
			c-1.2-2-2-4-2.4-6.3c-0.4-2.2-0.4-5.5-0.4-9.7v-18.8c0-6.1,0.4-10.5,1-13.1c0.6-2.8,2.4-5.3,5.7-7.5c3-2.2,7.1-3.4,11.9-3.4
			c4.8,0,8.9,1,11.9,3c3.2,2,5.3,4.2,6.3,7.1c1,2.6,1.4,6.7,1.4,11.9L645.6,292.5L645.6,292.5z"/>
		<path fill="#FFFFFF" d="M687.4,307.4H667v11.3c0,2.4,0.2,3.8,0.6,4.4c0.4,0.6,1,1,2,1c1.2,0,2-0.4,2.4-1.4
			c0.4-0.8,0.6-2.6,0.6-5.3v-6.7h14.9v3.8c0,3.2-0.2,5.7-0.6,7.5s-1.4,3.6-2.8,5.5c-1.4,2-3.4,3.4-5.7,4.4c-2.2,1-5,1.4-8.5,1.4
			s-6.3-0.4-8.9-1.4c-2.6-1-4.4-2.2-6.1-4c-1.4-1.6-2.4-3.4-3-5.5s-0.8-5-0.8-8.9v-15.1c0-4.4,0.6-8.1,1.8-10.7s3.2-4.6,6.1-6.1
			c2.8-1.4,6.1-2,9.7-2c4.4,0,8.1,0.8,10.9,2.4c2.8,1.6,4.8,3.8,6.1,6.7c1.2,2.8,1.8,6.7,1.8,11.7L687.4,307.4L687.4,307.4z
			 M671.4,298.9v-3.8c0-2.6-0.2-4.4-0.4-5.3c-0.2-0.8-0.8-1.2-1.8-1.2s-1.8,0.4-2,1c-0.2,0.6-0.4,2.4-0.4,5.5v3.8L671.4,298.9
			L671.4,298.9z"/>
		<path fill="#FFFFFF" d="M708.2,280.6l-0.6,6.9c2.2-4.8,5.7-7.5,9.9-7.7v18.2c-2.8,0-5,0.4-6.5,1.2c-1.4,0.8-2.2,1.8-2.4,3.2
			c-0.4,1.4-0.4,4.6-0.4,9.7v20.4h-15.8v-51.9H708.2z"/>
		<path fill="#FFFFFF" d="M736.7,280.6l-0.2,4.8c1.2-2,2.6-3.4,4.4-4.4c1.6-1,3.6-1.4,5.9-1.4c4.2,0,7.5,2,9.9,5.9
			c1.4-2,2.8-3.4,4.4-4.4c1.6-1,3.4-1.4,5.5-1.4c2.6,0,4.8,0.6,6.7,2c1.8,1.2,2.8,2.8,3.4,4.8c0.6,2,0.8,5,0.8,9.3v37h-15.3v-33.9
			c0-4.4-0.2-7.3-0.4-8.3c-0.2-1-1-1.6-2-1.6c-1.2,0-1.8,0.6-2.2,1.6c-0.4,1-0.4,3.8-0.4,8.3v33.7h-15.3v-32.9c0-5-0.2-8.1-0.4-9.1
			c-0.2-1-1-1.6-2-1.6c-0.6,0-1.2,0.2-1.8,0.8c-0.4,0.6-0.8,1.2-0.8,2s0,2.4,0,4.8v35.9h-15.3v-51.9H736.7z"/>
		<path fill="#FFFFFF" d="M796.8,300.8h-14.7v-3.4c0-4,0.4-7.1,1.4-9.3c1-2.2,2.8-4,5.7-5.9c2.8-1.6,6.5-2.4,10.9-2.4
			c5.3,0,9.3,1,12.1,2.8c2.8,1.8,4.2,4.2,4.8,6.9c0.6,2.8,0.8,8.5,0.8,17v26.1h-15.3v-4.6c-1,1.8-2.2,3.2-3.6,4.2
			c-1.6,1-3.4,1.4-5.5,1.4c-2.8,0-5.3-0.8-7.7-2.4c-2.2-1.6-3.4-4.8-3.4-10.1v-4.2c0-3.8,0.6-6.5,1.8-7.9c1.2-1.4,4.2-3,9.1-4.8
			c5.3-2,7.9-3.4,8.3-4c0.4-0.6,0.6-2.2,0.6-4.2c0-2.6-0.2-4.4-0.6-5.3c-0.4-0.8-1-1.2-2-1.2c-1,0-1.8,0.4-2,1
			c-0.2,0.6-0.4,2.4-0.4,5.5L796.8,300.8L796.8,300.8z M801.9,307.8c-2.6,1.8-4,3.4-4.4,4.6c-0.4,1.2-0.6,3-0.6,5.5
			c0,2.6,0.2,4.4,0.6,5.3c0.4,0.8,1,1.2,2,1.2c1,0,1.6-0.4,2-1c0.4-0.6,0.4-2.2,0.4-4.8V307.8z"/>
		<path fill="#FFFFFF" d="M839.2,280.6l-0.2,4.8c1.2-1.8,2.6-3.4,4.2-4.2c1.6-1,3.6-1.4,5.7-1.4c2.6,0,4.8,0.6,6.7,1.8
			c1.8,1.2,2.8,2.8,3.2,4.8c0.4,2,0.8,5.3,0.8,9.7v36.3h-15.8v-35.9c0-3.6-0.2-5.7-0.4-6.5c-0.2-0.8-0.8-1.2-2-1.2
			c-1.2,0-1.8,0.4-2,1.4c-0.2,0.8-0.4,3.2-0.4,7.3v35.1h-15.8v-52.1H839.2z"/>
		<path fill="#FFFFFF" d="M898,280.6l-4.4,37.6c-0.8,5.9-1.2,9.9-1.8,12.1c-0.4,2.2-1.2,4-2.4,5.5c-1.2,1.4-2.6,2.4-4.6,3
			c-2,0.6-5.3,1-9.5,1h-9.5v-8.3c2.4,0,4-0.2,4.6-0.4s1-0.8,1-1.6c0-0.4-0.4-2.2-1-5.5l-8.7-43.4H876l5.3,34.9l2.6-34.9H898z"/>
		<path fill="#FFFFFF" d="M908.7,320.2v5.7c0,3-0.4,5.5-1,7.3s-2,3.4-3.6,4.8s-3.6,2.2-5.9,2.6v-4.4c1.6-0.8,2.4-2,2.6-3.6H898
			v-12.3H908.7z"/>
		<path fill="#FFFFFF" d="M978.2,269.3v63.2h-14.3v-42.8l-5.7,42.8h-10.3l-6.1-41.8v41.8h-14.3v-63.2h21.2c0.6,3.8,1.2,8.3,2,13.5
			l2.4,16.2l3.8-29.5L978.2,269.3L978.2,269.3z"/>
		<path fill="#FFFFFF" d="M998.6,300.8h-14.7v-3.4c0-4,0.4-7.1,1.4-9.3c1-2.2,2.8-4,5.7-5.9c2.8-1.6,6.5-2.4,10.9-2.4
			c5.3,0,9.3,1,12.1,2.8c2.6,1.8,4.2,4.2,4.8,6.9c0.6,2.8,0.8,8.5,0.8,17v26.1h-15.3v-4.6c-1,1.8-2.2,3.2-3.6,4.2
			c-1.4,1-3.4,1.4-5.5,1.4c-2.8,0-5.3-0.8-7.7-2.4c-2.2-1.6-3.4-4.8-3.4-10.1v-4.2c0-3.8,0.6-6.5,1.8-7.9c1.2-1.4,4.2-3,9.1-4.8
			c5.3-2,7.9-3.4,8.3-4c0.4-0.6,0.6-2.2,0.6-4.2c0-2.6-0.2-4.4-0.6-5.3c-0.4-0.8-1-1.2-2-1.2s-1.8,0.4-2,1c-0.2,0.6-0.4,2.4-0.4,5.5
			v5L998.6,300.8L998.6,300.8z M1003.4,307.8c-2.6,1.8-4,3.4-4.4,4.6c-0.4,1.2-0.6,3-0.6,5.5c0,2.6,0.2,4.4,0.6,5.3
			c0.4,0.8,1,1.2,2,1.2s1.6-0.4,2-1c0.4-0.6,0.4-2.2,0.4-4.8V307.8z"/>
		<path fill="#FFFFFF" d="M1057.7,280.6l-4.4,37.6c-0.8,5.9-1.2,9.9-1.8,12.1c-0.4,2.2-1.2,4-2.4,5.5c-1.2,1.4-2.6,2.4-4.6,3
			s-5.3,1-9.5,1h-9.7v-8.3c2.4,0,4-0.2,4.6-0.4c0.6-0.2,1-0.8,1-1.6c0-0.4-0.4-2.2-1-5.5l-8.7-43.4h14.3l5.3,34.9l2.6-34.9H1057.7z"
			/>
		<path fill="#FFFFFF" d="M1099.1,269.3v63.2h-15.8v-33.9c0-4.8-0.2-7.9-0.4-8.9c-0.2-1-0.8-1.8-2-2.2c-1.2-0.4-3.4-0.8-7.1-0.8
			h-1.6v-7.5c7.7-1.6,13.5-5,17.4-10.1L1099.1,269.3L1099.1,269.3z"/>
		<path fill="#FFFFFF" d="M1139.3,321.8v10.7h-34.7v-9.1c10.3-16.8,16.4-27.3,18.4-31.3c2-4,2.8-7.1,2.8-9.3c0-1.8-0.2-3-0.8-3.8
			s-1.4-1.2-2.6-1.2s-2,0.4-2.6,1.4c-0.6,1-0.8,2.8-0.8,5.7v6.1h-14.1v-2.2c0-3.6,0.2-6.3,0.6-8.5c0.4-2,1.2-4,2.6-6.1
			c1.4-2,3.2-3.4,5.7-4.4c2.2-1,5-1.6,8.3-1.6c6.3,0,11.1,1.6,14.3,4.6c3.2,3,4.8,7.1,4.8,11.9c0,3.6-0.8,7.5-2.6,11.5
			c-1.8,4-7.1,12.5-16,25.6H1139.3L1139.3,321.8z"/>
		<path fill="#FFFFFF" d="M1164.8,301.2v10.9H1144v-10.9H1164.8z"/>
		<path fill="#FFFFFF" d="M1193.2,269.3v63.2h-15.8v-33.9c0-4.8-0.2-7.9-0.4-8.9c-0.2-1-0.8-1.8-2-2.2s-3.4-0.8-7.1-0.8h-1.4v-7.5
			c7.7-1.6,13.5-5,17.4-10.1L1193.2,269.3L1193.2,269.3z"/>
		<path fill="#FFFFFF" d="M1229.2,296.5c2.4,0.8,4.2,2.2,5.5,4c1.2,1.8,1.8,6.1,1.8,12.9c0,5-0.6,8.9-1.8,11.7
			c-1.2,2.8-3,4.8-5.9,6.3c-2.8,1.4-6.5,2.2-10.9,2.2c-5,0-8.9-0.8-11.7-2.4c-2.8-1.6-4.6-3.8-5.7-6.3c-0.8-2.4-1.4-6.7-1.4-12.7v-5
			h15.8v10.3c0,2.8,0.2,4.4,0.4,5.3c0.4,0.8,1,1.2,2.2,1.2s2-0.4,2.4-1.4s0.6-3.4,0.6-7.3v-4.4c0-2.4-0.2-4.2-0.8-5.3
			c-0.6-1.2-1.4-1.8-2.4-2.2c-1-0.4-3.2-0.6-6.3-0.6v-9.1c3.8,0,6.1-0.2,6.9-0.4c0.8-0.2,1.6-1,1.8-1.8s0.6-2.4,0.6-4.4v-3.4
			c0-2.2-0.2-3.6-0.6-4.4c-0.4-0.6-1.2-1-2.2-1c-1,0-1.8,0.4-2.2,1.2c-0.4,0.8-0.6,2.4-0.6,4.8v5.3h-15.8V284
			c0-6.1,1.4-10.1,4.2-12.3s7.1-3.2,13.1-3.2c7.5,0,12.7,1.4,15.3,4.4c2.6,3,4,7.1,4,12.3c0,3.6-0.4,6.1-1.4,7.7
			C1233.2,293.9,1231.6,295.3,1229.2,296.5z"/>
		<path fill="#FFFFFF" d="M1251,320.2v5.7c0,3-0.4,5.5-1,7.3s-2,3.4-3.6,4.8s-3.6,2.2-5.9,2.6v-4.4c1.6-0.8,2.4-2,2.6-3.6h-2.6
			v-12.3H1251z"/>
		<path fill="#FFFFFF" d="M1303.5,321.8v10.7h-34.7v-9.1c10.3-16.8,16.4-27.3,18.4-31.3c2-4,2.8-7.1,2.8-9.3c0-1.8-0.2-3-0.8-3.8
			c-0.6-0.8-1.4-1.2-2.6-1.2c-1.2,0-2,0.4-2.6,1.4c-0.6,1-0.8,2.8-0.8,5.7v6.1H1269v-2.2c0-3.6,0.2-6.3,0.6-8.5c0.4-2,1.2-4,2.6-6.1
			s3.2-3.4,5.7-4.4c2.2-1,5-1.6,8.3-1.6c6.3,0,11.1,1.6,14.3,4.6c3.2,3,4.8,7.1,4.8,11.9c0,3.6-0.8,7.5-2.6,11.5
			c-1.8,4-7.1,12.5-16,25.6H1303.5L1303.5,321.8z"/>
		<path fill="#FFFFFF" d="M1346.9,290.7v21.2c0,4.8-0.2,8.3-0.8,10.5c-0.6,2.2-1.6,4.2-3.2,6.1c-1.6,1.8-3.6,3.2-5.9,4
			s-4.8,1.2-7.9,1.2c-3.8,0-6.9-0.4-9.5-1.2s-4.4-2.2-6.1-4c-1.4-1.8-2.6-3.8-3.2-5.9c-0.6-2-1-5.3-1-9.7v-22.2
			c0-5.9,0.4-10.1,1.4-13.1c1-2.8,3-5.3,6.1-6.9c3-1.8,6.7-2.6,10.9-2.6c3.4,0,6.7,0.6,9.3,1.8c2.8,1.2,4.8,2.6,6.1,4.4
			c1.4,1.8,2.2,3.6,2.8,5.9C1346.5,282.4,1346.9,285.8,1346.9,290.7z M1331,285.2c0-3.4-0.2-5.5-0.4-6.3c-0.2-0.8-1-1.2-2.2-1.2
			s-2,0.4-2.4,1.4c-0.4,1-0.6,3-0.6,6.3v30.9c0,3.6,0.2,5.9,0.6,6.7c0.4,0.8,1.2,1.2,2.2,1.2s2-0.4,2.2-1.4c0.4-0.8,0.6-2.8,0.6-6.1
			L1331,285.2L1331,285.2z"/>
		<path fill="#FFFFFF" d="M1386.5,321.8v10.7h-34.7v-9.1c10.3-16.8,16.4-27.3,18.4-31.3c2-4,2.8-7.1,2.8-9.3c0-1.8-0.2-3-0.8-3.8
			c-0.6-0.8-1.4-1.2-2.6-1.2c-1.2,0-2,0.4-2.6,1.4c-0.6,1-0.8,2.8-0.8,5.7v6.1H1352v-2.2c0-3.6,0.2-6.3,0.6-8.5c0.4-2,1.2-4,2.6-6.1
			s3.2-3.4,5.7-4.4c2.2-1,5-1.6,8.3-1.6c6.3,0,11.1,1.6,14.3,4.6c3.2,3,4.8,7.1,4.8,11.9c0,3.6-0.8,7.5-2.6,11.5
			c-1.8,4-7.1,12.5-16,25.6H1386.5L1386.5,321.8z"/>
		<path fill="#FFFFFF" d="M1422.4,296.5c2.4,0.8,4.2,2.2,5.5,4s1.8,6.1,1.8,12.9c0,5-0.6,8.9-1.8,11.7c-1.2,2.8-3,4.8-5.9,6.3
			c-2.8,1.4-6.5,2.2-10.9,2.2c-5,0-8.9-0.8-11.7-2.4c-2.8-1.6-4.6-3.8-5.7-6.3c-0.8-2.4-1.4-6.7-1.4-12.7v-5h15.8v10.3
			c0,2.8,0.2,4.4,0.4,5.3s1,1.2,2.2,1.2c1.2,0,2-0.4,2.4-1.4s0.6-3.4,0.6-7.3v-4.4c0-2.4-0.2-4.2-0.8-5.3c-0.6-1.2-1.4-1.8-2.4-2.2
			c-1-0.4-3.2-0.6-6.3-0.6v-9.1c3.8,0,6.1-0.2,6.9-0.4c0.8-0.2,1.6-1,1.8-1.8s0.6-2.4,0.6-4.4v-3.4c0-2.2-0.2-3.6-0.6-4.4
			c-0.4-0.6-1.2-1-2.2-1c-1,0-1.8,0.4-2.2,1.2c-0.4,0.8-0.6,2.4-0.6,4.8v5.3h-15.8V284c0-6.1,1.4-10.1,4.2-12.3
			c2.8-2.2,7.1-3.2,13.1-3.2c7.5,0,12.7,1.4,15.3,4.4c2.6,3,4,7.1,4,12.3c0,3.6-0.4,6.1-1.4,7.7
			C1426.5,293.9,1424.9,295.3,1422.4,296.5z"/>
	</g>
</g>
<g>
	<g>
		<path fill="#FFFFFF" d="M388.9,269.3h27.5V282h-10.9v11.9h10.3V306h-10.3V320h12.1v12.7h-28.5v-63.4H388.9z"/>
		<path fill="#FFFFFF" d="M453.9,297.3H440v-2.8c0-2.4-0.2-3.8-0.4-4.6c-0.2-0.6-1-1-2-1c-0.8,0-1.6,0.2-2,0.8s-0.6,1.4-0.6,2.6
			c0,1.6,0.2,2.8,0.4,3.4c0.2,0.8,0.8,1.6,2,2.4c1,0.8,3.4,2.2,6.9,3.8c4.6,2.2,7.7,4.4,9.1,6.3c1.4,2,2.2,4.8,2.2,8.7
			c0,4.2-0.6,7.5-1.6,9.5c-1,2.2-3,3.8-5.5,5c-2.6,1.2-5.7,1.8-9.3,1.8c-4,0-7.5-0.6-10.3-1.8c-2.8-1.2-4.8-3-5.9-5
			c-1-2.2-1.6-5.5-1.6-9.7v-2.4h13.9v3.2c0,2.8,0.2,4.6,0.6,5.5c0.4,0.8,1,1.2,2,1.2c1.2,0,1.8-0.2,2.4-0.8c0.4-0.6,0.6-1.8,0.6-3.6
			c0-2.4-0.2-4-0.8-4.6c-0.6-0.6-3.6-2.4-9.3-5.7c-4.6-2.6-7.5-5-8.5-7.1c-1-2.2-1.6-4.6-1.6-7.5c0-4.2,0.6-7.3,1.6-9.1
			c1-2,3-3.4,5.7-4.6c2.6-1,5.7-1.6,9.1-1.6s6.5,0.4,8.7,1.2c2.4,0.8,4.2,2,5.7,3.4c1.2,1.4,2,2.8,2.4,4c0.2,1.2,0.4,3.2,0.4,5.7
			v3.4H453.9z"/>
		<path fill="#FFFFFF" d="M491.7,297.3h-13.9v-2.8c0-2.4-0.2-3.8-0.4-4.6c-0.2-0.6-1-1-2-1c-0.8,0-1.6,0.2-2,0.8s-0.6,1.4-0.6,2.6
			c0,1.6,0.2,2.8,0.4,3.4c0.2,0.8,0.8,1.6,2,2.4c1,0.8,3.4,2.2,6.9,3.8c4.6,2.2,7.7,4.4,9.1,6.3c1.4,2,2.2,4.8,2.2,8.7
			c0,4.2-0.6,7.5-1.6,9.5c-1,2.2-3,3.8-5.5,5c-2.6,1.2-5.7,1.8-9.3,1.8c-4,0-7.5-0.6-10.3-1.8c-2.8-1.2-4.8-3-5.9-5
			c-1-2.2-1.6-5.5-1.6-9.7v-2.4h13.9v3.2c0,2.8,0.2,4.6,0.6,5.5c0.4,0.8,1,1.2,2,1.2c1.2,0,1.8-0.2,2.4-0.8c0.4-0.6,0.6-1.8,0.6-3.6
			c0-2.4-0.2-4-0.8-4.6c-0.6-0.6-3.6-2.4-9.3-5.7c-4.6-2.6-7.5-5-8.5-7.1c-1-2.2-1.6-4.6-1.6-7.5c0-4.2,0.6-7.3,1.6-9.1
			c1-2,3-3.4,5.7-4.6c2.6-1,5.7-1.6,9.1-1.6s6.5,0.4,8.7,1.2c2.4,0.8,4.2,2,5.7,3.4c1.2,1.4,2,2.8,2.4,4c0.2,1.2,0.4,3.2,0.4,5.7
			v3.4H491.7z"/>
		<path fill="#FFFFFF" d="M532.9,307.6h-20.4v11.3c0,2.4,0.2,3.8,0.6,4.4c0.4,0.6,1,1,2,1c1.2,0,2-0.4,2.4-1.4
			c0.4-0.8,0.6-2.6,0.6-5.3v-6.9h14.9v3.8c0,3.2-0.2,5.7-0.6,7.5c-0.4,1.8-1.4,3.6-2.8,5.5c-1.4,2-3.4,3.4-5.7,4.4
			c-2.2,1-5,1.4-8.7,1.4c-3.4,0-6.3-0.4-8.9-1.4c-2.6-1-4.6-2.2-6.1-4c-1.4-1.6-2.4-3.6-3-5.7c-0.6-2-0.8-5-0.8-8.9v-14.7
			c0-4.4,0.6-8.1,1.8-10.7c1.2-2.6,3.2-4.6,6.1-6.1c2.8-1.4,6.1-2,9.7-2c4.4,0,8.1,0.8,10.9,2.6c2.8,1.6,4.8,3.8,6.1,6.7
			c1.2,2.8,1.8,6.7,1.8,11.7V307.6z M517.1,299.2v-3.8c0-2.6-0.2-4.4-0.4-5.3c-0.2-0.8-0.8-1.2-1.8-1.2c-1,0-1.8,0.4-2,1
			c-0.2,0.6-0.4,2.4-0.4,5.5v3.8L517.1,299.2L517.1,299.2z"/>
		<path fill="#FFFFFF" d="M554.3,280.8l-0.2,4.8c1.2-1.8,2.6-3.4,4.2-4.2c1.6-1,3.6-1.4,5.7-1.4c2.6,0,4.8,0.6,6.7,1.8
			c1.8,1.2,2.8,2.8,3.2,4.8c0.4,2,0.8,5.3,0.8,9.7v36.3h-16v-35.9c0-3.6-0.2-5.7-0.4-6.5c-0.2-0.8-0.8-1.2-2-1.2
			c-1.2,0-1.8,0.4-2,1.4c-0.2,0.8-0.4,3.2-0.4,7.3v35.1h-15.8V281h16.2V280.8z"/>
		<path fill="#FFFFFF" d="M589.2,320.2v5.7c0,3-0.4,5.5-1,7.3c-0.6,1.8-2,3.4-3.6,4.8c-1.8,1.4-3.6,2.2-5.9,2.6v-4.4
			c1.6-0.8,2.4-2,2.6-3.6h-2.6v-12.3H589.2z"/>
		<path fill="#FFFFFF" d="M632.1,269.3v63.4h-15.8v-33.9c0-4.8-0.2-7.9-0.4-8.9c-0.2-1-0.8-1.8-2-2.2c-1-0.6-3.4-0.8-7.1-0.8h-1.6
			v-7.5c7.7-1.6,13.5-5,17.4-10.1L632.1,269.3L632.1,269.3z"/>
		<path fill="#FFFFFF" d="M672.2,321.8v10.7h-34.7v-9.1c10.3-16.8,16.4-27.3,18.4-31.3c2-4,2.8-7.1,2.8-9.3c0-1.8-0.2-3-0.8-3.8
			c-0.6-0.8-1.4-1.2-2.6-1.2s-2,0.4-2.6,1.4c-0.6,1-0.8,2.8-0.8,5.7v6.1h-14.1v-2.2c0-3.6,0.2-6.3,0.6-8.5c0.4-2,1.2-4,2.6-6.1
			c1.4-2,3.2-3.4,5.7-4.4c2.2-1,5-1.6,8.3-1.6c6.3,0,11.1,1.6,14.3,4.6c3.2,3,4.8,7.1,4.8,11.9c0,3.6-0.8,7.5-2.6,11.5
			c-1.8,4-7.1,12.7-16,25.6H672.2z"/>
		<path fill="#FFFFFF" d="M688.8,319.7v12.9h-11.9v-12.9H688.8z"/>
		<path fill="#FFFFFF" d="M712.6,301.2v10.9h-20.8v-10.9H712.6z"/>
		<path fill="#FFFFFF" d="M741.1,269.3v63.4h-15.8v-33.9c0-4.8-0.2-7.9-0.4-8.9c-0.2-1-0.8-1.8-2-2.2c-1-0.6-3.4-0.8-7.1-0.8h-1.6
			v-7.5c7.7-1.6,13.5-5,17.4-10.1L741.1,269.3L741.1,269.3z"/>
		<path fill="#FFFFFF" d="M777,296.7c2.4,0.8,4.2,2.2,5.5,4c1.2,1.8,1.8,6.1,1.8,12.9c0,5-0.6,8.9-1.8,11.7c-1.2,2.8-3,4.8-5.9,6.3
			c-2.8,1.4-6.5,2.2-10.9,2.2c-5,0-8.9-0.8-11.7-2.4s-4.6-3.8-5.7-6.3c-0.8-2.4-1.4-6.7-1.4-12.7v-5h15.8v10.3
			c0,2.8,0.2,4.4,0.4,5.3c0.4,0.8,1,1.2,2.2,1.2c1.2,0,2-0.4,2.4-1.4c0.4-1,0.6-3.4,0.6-7.3v-4.4c0-2.4-0.2-4.2-0.8-5.3
			c-0.6-1.2-1.4-1.8-2.4-2.2c-1-0.4-3.2-0.6-6.3-0.6v-9.3c3.8,0,6.1-0.2,6.9-0.4s1.6-1,1.8-1.8c0.4-1,0.6-2.4,0.6-4.4v-3.4
			c0-2.2-0.2-3.6-0.6-4.4c-0.4-0.6-1.2-1-2.2-1s-1.8,0.4-2.2,1.2c-0.4,0.8-0.6,2.4-0.6,4.8v5.3h-15.8V284c0-6.1,1.4-10.1,4.2-12.3
			c2.8-2.2,7.1-3.2,13.1-3.2c7.5,0,12.7,1.4,15.3,4.4c2.6,3,4,7.1,4,12.3c0,3.6-0.4,6.1-1.4,7.7C781.1,294.1,779.5,295.5,777,296.7z
			"/>
		<path fill="#FFFFFF" d="M800.3,319.7v12.9h-11.9v-12.9H800.3z"/>
		<path fill="#FFFFFF" d="M869.9,269.3v63.4h-14.3v-42.8l-5.7,42.8h-10.3l-6.1-41.8v41.8h-14.3v-63.4h21.4c0.6,3.8,1.2,8.3,2,13.5
			l2.4,16.2l3.8-29.5h21V269.3z"/>
		<path fill="#FFFFFF" d="M890.3,300.8h-14.7v-3.4c0-4,0.4-7.1,1.4-9.3c1-2.2,2.8-4,5.7-5.9c2.8-1.6,6.5-2.4,10.9-2.4
			c5.3,0,9.3,1,12.1,2.8c2.6,1.8,4.4,4.2,4.8,6.9c0.6,2.8,0.8,8.5,0.8,17v26.1H896v-4.6c-1,1.8-2.2,3.2-3.8,4.2
			c-1.6,1-3.4,1.4-5.5,1.4c-2.8,0-5.3-0.8-7.7-2.4c-2.2-1.6-3.4-5-3.4-10.1v-4.2c0-3.8,0.6-6.5,1.8-7.9c1.2-1.4,4.2-3,9.1-4.8
			c5.3-2,7.9-3.4,8.3-4c0.4-0.6,0.6-2.2,0.6-4.2c0-2.6-0.2-4.4-0.6-5.3c-0.4-0.8-1-1.2-2-1.2s-1.8,0.4-2,1c-0.2,0.6-0.4,2.4-0.4,5.5
			L890.3,300.8L890.3,300.8z M895.2,308c-2.6,1.8-4,3.4-4.4,4.6c-0.4,1.2-0.6,3-0.6,5.5c0,2.6,0.2,4.4,0.6,5.3c0.4,0.8,1,1.2,2,1.2
			s1.6-0.4,2-1c0.2-0.6,0.4-2.2,0.4-4.8V308z"/>
		<path fill="#FFFFFF" d="M932.7,269.3v8.3h-16.4v-8.3H932.7z M932.7,280.8v51.9h-16.4v-51.9H932.7z"/>
		<path fill="#FFFFFF" d="M986.7,321.8v10.7h-34.7v-9.1c10.3-16.8,16.4-27.3,18.4-31.3c2-4,2.8-7.1,2.8-9.3c0-1.8-0.2-3-0.8-3.8
			c-0.6-0.8-1.4-1.2-2.6-1.2c-1.2,0-2,0.4-2.6,1.4c-0.6,1-0.8,2.8-0.8,5.7v6.1h-14.1v-2.2c0-3.6,0.2-6.3,0.6-8.5
			c0.4-2,1.2-4,2.6-6.1s3.2-3.4,5.7-4.4c2.2-1,5-1.6,8.3-1.6c6.3,0,11.1,1.6,14.3,4.6c3.2,3,4.8,7.1,4.8,11.9
			c0,3.6-0.8,7.5-2.6,11.5c-1.8,4-7.1,12.7-16,25.6H986.7z"/>
		<path fill="#FFFFFF" d="M1030.1,290.7v21.2c0,4.8-0.2,8.3-0.8,10.5c-0.6,2.2-1.6,4.2-3.2,6.1c-1.6,1.8-3.6,3.2-5.9,4
			c-2.4,0.8-4.8,1.2-7.9,1.2c-3.8,0-6.9-0.4-9.5-1.2c-2.4-0.8-4.4-2.2-6.1-4c-1.4-1.8-2.6-3.8-3.2-5.9s-1-5.3-1-9.7v-22.2
			c0-5.9,0.4-10.1,1.4-13.1c1-2.8,3-5.3,6.1-6.9c3-1.8,6.7-2.6,10.9-2.6c3.4,0,6.7,0.6,9.3,1.8c2.8,1.2,4.8,2.6,6.1,4.4
			c1.4,1.8,2.2,3.6,2.8,5.9C1029.9,282.4,1030.1,286,1030.1,290.7z M1014.3,285.4c0-3.4-0.2-5.5-0.4-6.3c-0.4-0.8-1-1.2-2.2-1.2
			c-1.2,0-2,0.4-2.4,1.4c-0.4,0.8-0.6,3-0.6,6.3v30.9c0,3.6,0.2,5.9,0.6,6.7c0.4,0.8,1.2,1.2,2.2,1.2c1.2,0,2-0.4,2.2-1.4
			c0.4-0.8,0.6-2.8,0.6-6.1L1014.3,285.4L1014.3,285.4z"/>
		<path fill="#FFFFFF" d="M1069.9,321.8v10.7h-34.7v-9.1c10.3-16.8,16.4-27.3,18.4-31.3c2-4,2.8-7.1,2.8-9.3c0-1.8-0.2-3-0.8-3.8
			s-1.4-1.2-2.6-1.2s-2,0.4-2.6,1.4c-0.6,1-0.8,2.8-0.8,5.7v6.1h-14.1v-2.2c0-3.6,0.2-6.3,0.6-8.5c0.4-2,1.2-4,2.6-6.1
			c1.4-2,3.2-3.4,5.7-4.4c2.2-1,5-1.6,8.3-1.6c6.3,0,11.1,1.6,14.3,4.6c3.2,3,4.8,7.1,4.8,11.9c0,3.6-0.8,7.5-2.6,11.5
			c-1.8,4-7.1,12.7-16,25.6H1069.9z"/>
		<path fill="#FFFFFF" d="M1105.6,296.7c2.4,0.8,4.2,2.2,5.5,4c1.2,1.8,1.8,6.1,1.8,12.9c0,5-0.6,8.9-1.8,11.7
			c-1.2,2.8-3,4.8-5.9,6.3c-2.8,1.4-6.5,2.2-10.9,2.2c-5,0-8.9-0.8-11.7-2.4c-2.8-1.6-4.6-3.8-5.7-6.3c-0.8-2.4-1.4-6.7-1.4-12.7v-5
			h15.8v10.3c0,2.8,0.2,4.4,0.4,5.3c0.4,0.8,1,1.2,2.2,1.2s2-0.4,2.4-1.4c0.4-1,0.6-3.4,0.6-7.3v-4.4c0-2.4-0.2-4.2-0.8-5.3
			c-0.6-1.2-1.4-1.8-2.4-2.2c-1-0.4-3.2-0.6-6.3-0.6v-9.3c3.8,0,6.1-0.2,6.9-0.4c0.8-0.2,1.6-1,1.8-1.8c0.4-1,0.6-2.4,0.6-4.4v-3.4
			c0-2.2-0.2-3.6-0.6-4.4c-0.4-0.6-1.2-1-2.2-1s-1.8,0.4-2.2,1.2c-0.4,0.8-0.6,2.4-0.6,4.8v5.3h-15.8V284c0-6.1,1.4-10.1,4.2-12.3
			c2.8-2.2,7.1-3.2,13.1-3.2c7.5,0,12.7,1.4,15.3,4.4c2.6,3,4,7.1,4,12.3c0,3.6-0.4,6.1-1.4,7.7
			C1109.8,294.1,1108,295.5,1105.6,296.7z"/>
	</g>
	<g>
		<path fill="#FFFFFF" d="M391.1,80.5h20.2c13.1,0,21.8,0.6,26.5,1.8c4.6,1.2,8.1,3.2,10.5,5.9c2.4,2.8,3.8,5.9,4.4,9.1
			c0.6,3.4,0.8,9.9,0.8,19.8v36.3c0,9.3-0.4,15.5-1.4,18.8c-0.8,3.2-2.4,5.7-4.6,7.5c-2.2,1.8-4.8,3-8.1,3.6c-3.2,0.6-8.1,1-14.5,1
			h-33.7V80.5z M418,98.2v68.3c3.8,0,6.3-0.8,7.3-2.4c0.8-1.6,1.4-5.9,1.4-12.7v-40.4c0-4.6-0.2-7.7-0.4-9.1c-0.2-1.4-1-2.2-2-2.8
			C423,98.6,421,98.2,418,98.2z"/>
		<path fill="#FFFFFF" d="M466.1,80.5h19.2c12.7,0,21.4,0.4,25.8,1.4c4.4,1,8.3,3.4,11.1,7.5s4.2,10.5,4.2,19.4c0,8.1-1,13.5-3,16.4
			c-2,2.8-6.1,4.4-11.9,5c5.3,1.4,8.9,3,10.7,5.3c1.8,2.2,3,4.2,3.4,6.1c0.4,1.8,0.6,7.1,0.6,15.3v27.5h-25v-34.5
			c0-5.7-0.4-9.1-1.4-10.3c-0.8-1.4-3.2-2-6.9-2v46.8h-27.1V80.5H466.1z M492.9,98.2v23c3,0,5.3-0.4,6.5-1.2
			c1.2-0.8,1.8-3.6,1.8-8.1v-5.7c0-3.2-0.6-5.5-1.8-6.5C498.2,98.8,496.1,98.2,492.9,98.2z"/>
		<path fill="#FFFFFF" d="M600.3,80.5v69.3c0,7.9-0.2,13.3-0.8,16.6c-0.6,3.2-2,6.5-4.6,9.9c-2.4,3.4-5.9,5.9-9.9,7.7
			c-4,1.8-8.9,2.6-14.5,2.6c-6.3,0-11.7-1-16.4-3c-4.6-2-8.3-4.6-10.7-8.1c-2.4-3.2-3.8-6.7-4.2-10.5c-0.4-3.6-0.6-11.3-0.6-23V80.5
			h27.1v77.7c0,4.4,0.2,7.5,0.8,8.7c0.4,1.2,1.4,1.8,3,1.8s2.8-0.6,3.2-2c0.4-1.4,0.8-4.6,0.8-9.9V80.5H600.3z"/>
		<path fill="#FFFFFF" d="M613.3,80.5h27.3c7.3,0,12.9,0.6,17,1.8c4,1.2,6.9,2.8,8.9,5c2,2.2,3.4,4.8,4,7.9c0.6,3,1,7.9,1,14.3v9.1
			c0,6.7-0.6,11.5-2,14.5c-1.4,3-3.8,5.5-7.5,7.1c-3.6,1.6-8.5,2.4-14.3,2.4h-7.3v41.8h-27.1V80.5z M640.1,98.2v26.5
			c0.8,0,1.4,0,2,0c2.4,0,4.2-0.6,5.3-1.8c1-1.2,1.4-3.8,1.4-7.7v-8.5c0-3.6-0.6-5.9-1.6-6.9C646,98.8,643.8,98.2,640.1,98.2z"/>
		<path fill="#FFFFFF" d="M724.7,80.5l15.3,103.8h-27.7l-1.4-18.6h-9.7l-1.6,18.6h-27.9l13.7-103.8H724.7z M710.6,147.3
			c-1.4-11.7-2.8-26.3-4-43.6c-2.8,19.8-4.4,34.3-5.3,43.6H710.6z"/>
		<path fill="#FFFFFF" d="M774.2,80.5v83h16.4v20.8h-43.4V80.5H774.2z"/>
		<path fill="#FFFFFF" d="M860.4,125.7h-27.1v-18c0-5.3-0.2-8.5-0.8-9.9c-0.6-1.2-1.8-2-3.8-2c-2.2,0-3.6,0.8-4.2,2.4
			c-0.6,1.6-0.8,5-0.8,10.3v48.3c0,5,0.2,8.3,0.8,9.9c0.6,1.6,2,2.2,4,2.2c2,0,3.2-0.8,4-2.2c0.6-1.6,1-5.3,1-10.9v-13.1h27.1v4
			c0,10.7-0.8,18.4-2.2,22.8c-1.6,4.4-4.8,8.5-10.1,11.7c-5.3,3.4-11.5,5-19.2,5c-7.9,0-14.3-1.4-19.6-4.2
			c-5.3-2.8-8.5-6.9-10.1-11.9c-1.6-5-2.4-12.7-2.4-22.8V117c0-7.5,0.2-13.1,0.8-16.8c0.6-3.6,2-7.3,4.6-10.7
			c2.6-3.4,6.1-6.3,10.5-8.1c4.4-2,9.7-3,15.5-3c7.9,0,14.5,1.6,19.6,4.6c5,3,8.5,6.9,10.1,11.5c1.6,4.6,2.4,11.7,2.4,21.4v9.7
			C860.6,125.7,860.4,125.7,860.4,125.7z"/>
		<path fill="#FFFFFF" d="M919.2,80.5l15.3,103.8h-27.7l-1.4-18.6H896l-1.6,18.6h-27.9l13.7-103.8H919.2z M904.9,147.3
			c-1.4-11.7-2.8-26.3-4-43.6c-2.8,19.8-4.4,34.3-5.3,43.6H904.9z"/>
		<path fill="#FFFFFF" d="M1024.8,80.5v103.8h-23.6v-70.1l-9.5,70.1h-16.8l-9.9-68.5v68.5h-23.6V80.5h34.9c1,6.3,2,13.5,3.2,22
			l3.8,26.5l6.3-48.5H1024.8z"/>
		<path fill="#FFFFFF" d="M1037.9,80.5h27.3c7.3,0,12.9,0.6,17,1.8c4,1.2,6.9,2.8,8.9,5c2,2.2,3.4,4.8,4,7.9c0.6,3,1,7.9,1,14.3v9.1
			c0,6.7-0.6,11.5-2,14.5c-1.4,3-3.8,5.5-7.5,7.1s-8.5,2.4-14.3,2.4h-7.3v41.8h-27.1L1037.9,80.5L1037.9,80.5z M1065,98.2v26.5
			c0.8,0,1.4,0,2,0c2.4,0,4.2-0.6,5.3-1.8c1-1.2,1.4-3.8,1.4-7.7v-8.5c0-3.6-0.6-5.9-1.6-6.9C1070.9,98.8,1068.4,98.2,1065,98.2z"/>
		<path fill="#FFFFFF" d="M1131.8,80.5h19.2c12.7,0,21.4,0.4,25.8,1.4c4.4,1,8.3,3.4,11.1,7.5c2.8,4,4.2,10.5,4.2,19.4
			c0,8.1-1,13.5-3,16.4c-2,2.8-6.1,4.4-11.9,5c5.3,1.4,8.9,3,10.7,5.3c1.8,2.2,3,4.2,3.4,6.1c0.4,1.8,0.6,7.1,0.6,15.3v27.5h-25
			v-34.5c0-5.7-0.4-9.1-1.4-10.3c-0.8-1.4-3.2-2-6.9-2v46.8h-27.1V80.5H1131.8z M1158.7,98.2v23c3,0,5.3-0.4,6.5-1.2
			c1.2-0.8,1.8-3.6,1.8-8.1v-5.7c0-3.2-0.6-5.5-1.8-6.5C1164,98.8,1161.9,98.2,1158.7,98.2z"/>
		<path fill="#FFFFFF" d="M1266.1,80.5v69.3c0,7.9-0.2,13.3-0.8,16.6c-0.6,3.2-2,6.5-4.6,9.9c-2.4,3.4-5.9,5.9-9.9,7.7
			c-4,1.8-8.9,2.6-14.5,2.6c-6.3,0-11.7-1-16.4-3c-4.6-2-8.3-4.6-10.7-8.1c-2.4-3.2-3.8-6.7-4.2-10.5c-0.4-3.6-0.6-11.3-0.6-23V80.5
			h27.1v77.7c0,4.4,0.2,7.5,0.8,8.7c0.4,1.2,1.4,1.8,3,1.8s2.8-0.6,3.2-2c0.4-1.4,0.8-4.6,0.8-9.9V80.5H1266.1z"/>
		<path fill="#FFFFFF" d="M1341.1,80.5v103.8H1314v-43.6h-8.1v43.6h-27.1V80.5h27.1v37.2h8.1V80.5H1341.1z"/>
		<path fill="#FFFFFF" d="M1354.2,80.5h19.2c12.7,0,21.4,0.4,25.8,1.4c4.4,1,8.3,3.4,11.1,7.5c2.8,4,4.2,10.5,4.2,19.4
			c0,8.1-1,13.5-3,16.4c-2,2.8-6.1,4.4-11.9,5c5.3,1.4,8.9,3,10.7,5.3c1.8,2.2,3,4.2,3.4,6.1c0.4,1.8,0.6,7.1,0.6,15.3v27.5h-25
			v-34.5c0-5.7-0.4-9.1-1.4-10.3c-0.8-1.4-3.2-2-6.9-2v46.8H1354V80.5H1354.2z M1381.2,98.2v23c3,0,5.3-0.4,6.5-1.2
			c1.2-0.8,1.8-3.6,1.8-8.1v-5.7c0-3.2-0.6-5.5-1.8-6.5C1386.5,98.8,1384.3,98.2,1381.2,98.2z"/>
	</g>
	<rect x="387.1" y="222" fill="#FFFFFF" width="1076.3" height="8.1"/>
</g>
<path fill="#FFFFFF" d="M216.6,85.2c-28.1-28.1-55-55-63-85.2c-8,30.2-34.9,57.1-63,85.2c-42.2,42.2-90.1,90-90.1,161.7
	C0.5,331.3,69.2,400,153.6,400c84.4,0,153.1-68.7,153.1-153.1C306.6,175.2,258.8,127.4,216.6,85.2z M224,248l-28.2-28.2L168.5,247
	l53.7,53.7l-15,15l-53.7-53.7l-53.7,53.7l-15-15l53.7-53.7l-24.8-24.8l-19.6,19.6l-22.9-22.9l19.6-19.6l-2.3-2.3l15-15l2.3,2.3
	l20.5-20.5l22.9,22.9l-20.5,20.5l24.8,24.8l27.2-27.2l-18.4-18.4l23.8-23.8l18.4,18.4l2.7-2.7l15,15l-2.7,2.7l9.4,9.4L224,248z"/>
</svg>
