<svg version="1.1" xmlns="http://www.w3.org/2000/svg" xmlns:xlink="http://www.w3.org/1999/xlink" x="0px" y="0px" viewBox="0 0 780 250">
<path fill="#FFFFFF" d="M195,71.7c-3.1-3.9-12.6-15.8-30.5-26.9l-0.2-0.1c-6.1-3.9-12.3-6.7-18.2-9.4c-6.3-2.8-12.8-5.8-19.2-10
	c-7.2-4.6-16.5-15.4-24.6-25C99.9,15.9,94.5,22.1,89.4,26c-9.6,7.5-16.6,11.1-23.9,14.9c-2.4,1.2-4.8,2.5-7.4,3.9
	C52.7,47.6,38.9,56,26.1,71C9.3,90.7,0.8,114,0.8,140.2c0,29.4,11.8,56.8,33.3,77.1c10.2,9.7,22.1,17.2,35.2,22.5
	c13.4,5.4,27.4,8.1,41.7,8.1c28.9,0,55.8-10.3,75.9-29c10.1-9.5,18.1-20.7,23.6-33.4c5.8-13.4,8.8-28,8.8-43.4
	C219.3,115.5,211.1,91.8,195,71.7z M173.3,148.1l-23.5-24.2L126,147.2l45.9,45.7l-13.2,13.3l-45.5-45.7L67.6,206l-12.5-12.7
	l45.2-45.5l-20.6-21L63,143.6l-19.6-19.5L60,107.6l-1.8-1.9l13.1-13.1l1.8,2L90,77.8l19.4,19.3l-17.1,17l21.1,20.5l22.3-22.4
	l-15.3-15.4l19.8-19.7l15.3,15.3l2.5-2.6l12.8,12.8l-2.1,2.2l8,8.1L173.3,148.1z"/>
<g>
	<path fill="#FFFFFF" d="M245.9,158.4h13.6v6.3h-5.4v5.9h5.1v6h-5.1v6.9h6v6.3h-14.1V158.4z"/>
	<path fill="#FFFFFF" d="M278.1,172.3h-6.9v-1.4c0-1.2-0.1-1.9-0.2-2.3c-0.1-0.3-0.5-0.5-1-0.5c-0.4,0-0.8,0.1-1,0.4
		c-0.2,0.3-0.3,0.7-0.3,1.3c0,0.8,0.1,1.4,0.2,1.7c0.1,0.4,0.4,0.8,1,1.2c0.5,0.4,1.7,1.1,3.4,1.9c2.3,1.1,3.8,2.2,4.5,3.1
		c0.7,1,1.1,2.4,1.1,4.3c0,2.1-0.3,3.7-0.8,4.7c-0.5,1.1-1.5,1.9-2.7,2.5c-1.3,0.6-2.8,0.9-4.6,0.9c-2,0-3.7-0.3-5.1-0.9
		c-1.4-0.6-2.4-1.5-2.9-2.5c-0.5-1.1-0.8-2.7-0.8-4.8v-1.2h6.9v1.6c0,1.4,0.1,2.3,0.3,2.7c0.2,0.4,0.5,0.6,1,0.6
		c0.6,0,0.9-0.1,1.2-0.4c0.2-0.3,0.3-0.9,0.3-1.8c0-1.2-0.1-2-0.4-2.3c-0.3-0.3-1.8-1.2-4.6-2.8c-2.3-1.3-3.7-2.5-4.2-3.5
		c-0.5-1.1-0.8-2.3-0.8-3.7c0-2.1,0.3-3.6,0.8-4.5c0.5-1,1.5-1.7,2.8-2.3c1.3-0.5,2.8-0.8,4.5-0.8c1.7,0,3.2,0.2,4.3,0.6
		c1.2,0.4,2.1,1,2.8,1.7c0.6,0.7,1,1.4,1.2,2c0.1,0.6,0.2,1.6,0.2,2.8V172.3z"/>
	<path fill="#FFFFFF" d="M296.8,172.3h-6.9v-1.4c0-1.2-0.1-1.9-0.2-2.3c-0.1-0.3-0.5-0.5-1-0.5c-0.4,0-0.8,0.1-1,0.4
		c-0.2,0.3-0.3,0.7-0.3,1.3c0,0.8,0.1,1.4,0.2,1.7c0.1,0.4,0.4,0.8,1,1.2c0.5,0.4,1.7,1.1,3.4,1.9c2.3,1.1,3.8,2.2,4.5,3.1
		c0.7,1,1.1,2.4,1.1,4.3c0,2.1-0.3,3.7-0.8,4.7c-0.5,1.1-1.5,1.9-2.7,2.5c-1.3,0.6-2.8,0.9-4.6,0.9c-2,0-3.7-0.3-5.1-0.9
		c-1.4-0.6-2.4-1.5-2.9-2.5c-0.5-1.1-0.8-2.7-0.8-4.8v-1.2h6.9v1.6c0,1.4,0.1,2.3,0.3,2.7c0.2,0.4,0.5,0.6,1,0.6
		c0.6,0,0.9-0.1,1.2-0.4c0.2-0.3,0.3-0.9,0.3-1.8c0-1.2-0.1-2-0.4-2.3c-0.3-0.3-1.8-1.2-4.6-2.8c-2.3-1.3-3.7-2.5-4.2-3.5
		c-0.5-1.1-0.8-2.3-0.8-3.7c0-2.1,0.3-3.6,0.8-4.5c0.5-1,1.5-1.7,2.8-2.3c1.3-0.5,2.8-0.8,4.5-0.8c1.7,0,3.2,0.2,4.3,0.6
		c1.2,0.4,2.1,1,2.8,1.7c0.6,0.7,1,1.4,1.2,2c0.1,0.6,0.2,1.6,0.2,2.8V172.3z"/>
	<path fill="#FFFFFF" d="M317.2,177.4h-10.1v5.6c0,1.2,0.1,1.9,0.3,2.2c0.2,0.3,0.5,0.5,1,0.5c0.6,0,1-0.2,1.2-0.7
		c0.2-0.4,0.3-1.3,0.3-2.6v-3.4h7.4v1.9c0,1.6-0.1,2.8-0.3,3.7c-0.2,0.9-0.7,1.8-1.4,2.7c-0.7,1-1.7,1.7-2.8,2.2
		c-1.1,0.5-2.5,0.7-4.3,0.7c-1.7,0-3.1-0.2-4.4-0.7c-1.3-0.5-2.3-1.1-3-2c-0.7-0.8-1.2-1.8-1.5-2.8c-0.3-1-0.4-2.5-0.4-4.4V173
		c0-2.2,0.3-4,0.9-5.3c0.6-1.3,1.6-2.3,3-3c1.4-0.7,3-1,4.8-1c2.2,0,4,0.4,5.4,1.3c1.4,0.8,2.4,1.9,3,3.3c0.6,1.4,0.9,3.3,0.9,5.8
		V177.4z M309.4,173.2v-1.9c0-1.3-0.1-2.2-0.2-2.6c-0.1-0.4-0.4-0.6-0.9-0.6c-0.5,0-0.9,0.2-1,0.5c-0.1,0.3-0.2,1.2-0.2,2.7v1.9
		H309.4z"/>
	<path fill="#FFFFFF" d="M327.8,164.1l-0.1,2.4c0.6-0.9,1.3-1.7,2.1-2.1c0.8-0.5,1.8-0.7,2.8-0.7c1.3,0,2.4,0.3,3.3,0.9
		c0.9,0.6,1.4,1.4,1.6,2.4c0.2,1,0.4,2.6,0.4,4.8v18H330V172c0-1.8-0.1-2.8-0.2-3.2c-0.1-0.4-0.4-0.6-1-0.6c-0.6,0-0.9,0.2-1,0.7
		c-0.1,0.4-0.2,1.6-0.2,3.6v17.4h-7.8v-25.7H327.8z"/>
	<path fill="#FFFFFF" d="M345.1,183.6v2.8c0,1.5-0.2,2.7-0.5,3.6c-0.3,0.9-1,1.7-1.8,2.4c-0.9,0.7-1.8,1.1-2.9,1.3v-2.2
		c0.8-0.4,1.2-1,1.3-1.8h-1.3v-6.1H345.1z"/>
	<path fill="#FFFFFF" d="M366.3,158.4v31.4h-7.8V173c0-2.4-0.1-3.9-0.2-4.4c-0.1-0.5-0.4-0.9-1-1.1c-0.5-0.3-1.7-0.4-3.5-0.4H353
		v-3.7c3.8-0.8,6.7-2.5,8.6-5H366.3z"/>
	<path fill="#FFFFFF" d="M386.2,184.4v5.3H369l0-4.5c5.1-8.3,8.1-13.5,9.1-15.5c1-2,1.4-3.5,1.4-4.6c0-0.9-0.1-1.5-0.4-1.9
		c-0.3-0.4-0.7-0.6-1.3-0.6c-0.6,0-1,0.2-1.3,0.7c-0.3,0.5-0.4,1.4-0.4,2.8v3h-7V168c0-1.8,0.1-3.1,0.3-4.2c0.2-1,0.6-2,1.3-3
		c0.7-1,1.6-1.7,2.8-2.2c1.1-0.5,2.5-0.8,4.1-0.8c3.1,0,5.5,0.8,7.1,2.3c1.6,1.5,2.4,3.5,2.4,5.9c0,1.8-0.4,3.7-1.3,5.7
		c-0.9,2-3.5,6.3-7.9,12.7H386.2z"/>
	<path fill="#FFFFFF" d="M394.4,183.4v6.4h-5.9v-6.4H394.4z"/>
	<path fill="#FFFFFF" d="M406.2,174.2v5.4h-10.3v-5.4H406.2z"/>
	<path fill="#FFFFFF" d="M420.3,158.4v31.4h-7.8V173c0-2.4-0.1-3.9-0.2-4.4c-0.1-0.5-0.4-0.9-1-1.1c-0.5-0.3-1.7-0.4-3.5-0.4h-0.8
		v-3.7c3.8-0.8,6.7-2.5,8.6-5H420.3z"/>
	<path fill="#FFFFFF" d="M438.1,172c1.2,0.4,2.1,1.1,2.7,2c0.6,0.9,0.9,3,0.9,6.4c0,2.5-0.3,4.4-0.9,5.8c-0.6,1.4-1.5,2.4-2.9,3.1
		c-1.4,0.7-3.2,1.1-5.4,1.1c-2.5,0-4.4-0.4-5.8-1.2c-1.4-0.8-2.3-1.9-2.8-3.1c-0.4-1.2-0.7-3.3-0.7-6.3v-2.5h7.8v5.1
		c0,1.4,0.1,2.2,0.2,2.6c0.2,0.4,0.5,0.6,1.1,0.6c0.6,0,1-0.2,1.2-0.7c0.2-0.5,0.3-1.7,0.3-3.6v-2.2c0-1.2-0.1-2.1-0.4-2.6
		c-0.3-0.6-0.7-0.9-1.2-1.1c-0.5-0.2-1.6-0.3-3.1-0.3v-4.6c1.9,0,3-0.1,3.4-0.2c0.4-0.1,0.8-0.5,0.9-0.9c0.2-0.5,0.3-1.2,0.3-2.2
		v-1.7c0-1.1-0.1-1.8-0.3-2.2c-0.2-0.3-0.6-0.5-1.1-0.5c-0.5,0-0.9,0.2-1.1,0.6c-0.2,0.4-0.3,1.2-0.3,2.4v2.6h-7.8v-2.7
		c0-3,0.7-5,2.1-6.1c1.4-1.1,3.5-1.6,6.5-1.6c3.7,0,6.3,0.7,7.6,2.2c1.3,1.5,2,3.5,2,6.1c0,1.8-0.2,3-0.7,3.8
		C440.1,170.7,439.3,171.4,438.1,172z"/>
	<path fill="#FFFFFF" d="M449.6,183.4v6.4h-5.9v-6.4H449.6z"/>
	<path fill="#FFFFFF" d="M484.1,158.4v31.4H477l0-21.2l-2.8,21.2h-5.1l-3-20.7l0,20.7h-7.1v-31.4h10.6c0.3,1.9,0.6,4.1,1,6.7l1.2,8
		l1.9-14.6H484.1z"/>
	<path fill="#FFFFFF" d="M494.2,174h-7.3v-1.7c0-2,0.2-3.5,0.7-4.6c0.5-1.1,1.4-2,2.8-2.9c1.4-0.8,3.2-1.2,5.4-1.2
		c2.6,0,4.6,0.5,6,1.4c1.3,0.9,2.2,2.1,2.4,3.4c0.3,1.4,0.4,4.2,0.4,8.4v12.9h-7.6v-2.3c-0.5,0.9-1.1,1.6-1.9,2.1
		c-0.8,0.5-1.7,0.7-2.7,0.7c-1.4,0-2.6-0.4-3.8-1.2c-1.1-0.8-1.7-2.5-1.7-5v-2.1c0-1.9,0.3-3.2,0.9-3.9c0.6-0.7,2.1-1.5,4.5-2.4
		c2.6-1,3.9-1.7,4.1-2c0.2-0.3,0.3-1.1,0.3-2.1c0-1.3-0.1-2.2-0.3-2.6c-0.2-0.4-0.5-0.6-1-0.6c-0.5,0-0.9,0.2-1,0.5
		c-0.1,0.3-0.2,1.2-0.2,2.7V174z M496.6,177.6c-1.3,0.9-2,1.7-2.2,2.3c-0.2,0.6-0.3,1.5-0.3,2.7c0,1.3,0.1,2.2,0.3,2.6
		c0.2,0.4,0.5,0.6,1,0.6c0.5,0,0.8-0.2,1-0.5c0.1-0.3,0.2-1.1,0.2-2.4V177.6z"/>
	<path fill="#FFFFFF" d="M515.2,158.4v4.1h-8.1v-4.1H515.2z M515.2,164.1v25.7h-8.1v-25.7H515.2z"/>
	<path fill="#FFFFFF" d="M541.9,184.4v5.3h-17.2l0-4.5c5.1-8.3,8.1-13.5,9.1-15.5c1-2,1.4-3.5,1.4-4.6c0-0.9-0.1-1.5-0.4-1.9
		c-0.3-0.4-0.7-0.6-1.3-0.6c-0.6,0-1,0.2-1.3,0.7c-0.3,0.5-0.4,1.4-0.4,2.8v3h-7V168c0-1.8,0.1-3.1,0.3-4.2c0.2-1,0.6-2,1.3-3
		c0.7-1,1.6-1.7,2.8-2.2c1.1-0.5,2.5-0.8,4.1-0.8c3.1,0,5.5,0.8,7.1,2.3c1.6,1.5,2.4,3.5,2.4,5.9c0,1.8-0.4,3.7-1.3,5.7
		c-0.9,2-3.5,6.3-7.9,12.7H541.9z"/>
	<path fill="#FFFFFF" d="M563.4,169v10.5c0,2.4-0.1,4.1-0.4,5.2c-0.3,1.1-0.8,2.1-1.6,3c-0.8,0.9-1.8,1.6-2.9,2
		c-1.2,0.4-2.4,0.6-3.9,0.6c-1.9,0-3.4-0.2-4.7-0.6c-1.2-0.4-2.2-1.1-3-2c-0.7-0.9-1.3-1.9-1.6-2.9c-0.3-1-0.5-2.6-0.5-4.8V169
		c0-2.9,0.2-5,0.7-6.5c0.5-1.4,1.5-2.6,3-3.4c1.5-0.9,3.3-1.3,5.4-1.3c1.7,0,3.3,0.3,4.6,0.9c1.4,0.6,2.4,1.3,3,2.2
		c0.7,0.9,1.1,1.8,1.4,2.9C563.3,164.9,563.4,166.7,563.4,169z M555.6,166.4c0-1.7-0.1-2.7-0.2-3.1c-0.2-0.4-0.5-0.6-1.1-0.6
		c-0.6,0-1,0.2-1.2,0.7c-0.2,0.4-0.3,1.5-0.3,3.1v15.3c0,1.8,0.1,2.9,0.3,3.3c0.2,0.4,0.6,0.6,1.1,0.6c0.6,0,1-0.2,1.1-0.7
		c0.2-0.4,0.3-1.4,0.3-3V166.4z"/>
	<path fill="#FFFFFF" d="M583.1,184.4v5.3h-17.2l0-4.5c5.1-8.3,8.1-13.5,9.1-15.5c1-2,1.4-3.5,1.4-4.6c0-0.9-0.1-1.5-0.4-1.9
		c-0.3-0.4-0.7-0.6-1.3-0.6c-0.6,0-1,0.2-1.3,0.7c-0.3,0.5-0.4,1.4-0.4,2.8v3h-7V168c0-1.8,0.1-3.1,0.3-4.2c0.2-1,0.6-2,1.3-3
		c0.7-1,1.6-1.7,2.8-2.2c1.1-0.5,2.5-0.8,4.1-0.8c3.1,0,5.5,0.8,7.1,2.3c1.6,1.5,2.4,3.5,2.4,5.9c0,1.8-0.4,3.7-1.3,5.7
		c-0.9,2-3.5,6.3-7.9,12.7H583.1z"/>
	<path fill="#FFFFFF" d="M600.8,172c1.2,0.4,2.1,1.1,2.7,2c0.6,0.9,0.9,3,0.9,6.4c0,2.5-0.3,4.4-0.9,5.8c-0.6,1.4-1.5,2.4-2.9,3.1
		c-1.4,0.7-3.2,1.1-5.4,1.1c-2.5,0-4.4-0.4-5.8-1.2c-1.4-0.8-2.3-1.9-2.8-3.1c-0.4-1.2-0.7-3.3-0.7-6.3v-2.5h7.8v5.1
		c0,1.4,0.1,2.2,0.2,2.6c0.2,0.4,0.5,0.6,1.1,0.6c0.6,0,1-0.2,1.2-0.7c0.2-0.5,0.3-1.7,0.3-3.6v-2.2c0-1.2-0.1-2.1-0.4-2.6
		c-0.3-0.6-0.7-0.9-1.2-1.1c-0.5-0.2-1.6-0.3-3.1-0.3v-4.6c1.9,0,3-0.1,3.4-0.2c0.4-0.1,0.8-0.5,0.9-0.9c0.2-0.5,0.3-1.2,0.3-2.2
		v-1.7c0-1.1-0.1-1.8-0.3-2.2c-0.2-0.3-0.6-0.5-1.1-0.5c-0.5,0-0.9,0.2-1.1,0.6c-0.2,0.4-0.3,1.2-0.3,2.4v2.6h-7.8v-2.7
		c0-3,0.7-5,2.1-6.1c1.4-1.1,3.5-1.6,6.5-1.6c3.7,0,6.3,0.7,7.6,2.2c1.3,1.5,2,3.5,2,6.1c0,1.8-0.2,3-0.7,3.8
		C602.9,170.7,602,171.4,600.8,172z"/>
</g>
<g>
	<path fill="#FFFFFF" d="M247,64.9h10c6.5,0,10.8,0.3,13.1,0.9c2.3,0.6,4,1.6,5.2,2.9c1.2,1.4,1.9,2.9,2.2,4.5
		c0.3,1.7,0.4,4.9,0.4,9.8v18c0,4.6-0.2,7.7-0.7,9.3c-0.4,1.6-1.2,2.8-2.3,3.7s-2.4,1.5-4,1.8s-4,0.5-7.2,0.5H247V64.9z M260.3,73.7
		v33.8c1.9,0,3.1-0.4,3.6-1.2c0.4-0.8,0.7-2.9,0.7-6.3V80c0-2.3-0.1-3.8-0.2-4.5s-0.5-1.1-1-1.4C262.8,73.9,261.8,73.7,260.3,73.7z"
		/>
	<path fill="#FFFFFF" d="M284.1,64.9h9.5c6.3,0,10.6,0.2,12.8,0.7c2.2,0.5,4.1,1.7,5.5,3.7s2.1,5.2,2.1,9.6c0,4-0.5,6.7-1.5,8.1
		s-3,2.2-5.9,2.5c2.6,0.7,4.4,1.5,5.3,2.6s1.5,2.1,1.7,3s0.3,3.5,0.3,7.6v13.6h-12.4V99.2c0-2.8-0.2-4.5-0.7-5.1
		c-0.4-0.7-1.6-1-3.4-1v23.2H284V64.9H284.1z M297.4,73.7v11.4c1.5,0,2.6-0.2,3.2-0.6s0.9-1.8,0.9-4v-2.8c0-1.6-0.3-2.7-0.9-3.2
		S299,73.7,297.4,73.7z"/>
	<path fill="#FFFFFF" d="M350.6,64.9v34.3c0,3.9-0.1,6.6-0.4,8.2s-1,3.2-2.3,4.9c-1.2,1.7-2.9,2.9-4.9,3.8s-4.4,1.3-7.2,1.3
		c-3.1,0-5.8-0.5-8.1-1.5s-4.1-2.3-5.3-4c-1.2-1.6-1.9-3.3-2.1-5.2c-0.2-1.8-0.3-5.6-0.3-11.4V64.9h13.4v38.5c0,2.2,0.1,3.7,0.4,4.3
		c0.2,0.6,0.7,0.9,1.5,0.9s1.4-0.3,1.6-1s0.4-2.3,0.4-4.9V64.9H350.6z"/>
	<path fill="#FFFFFF" d="M357,64.9h13.5c3.6,0,6.4,0.3,8.4,0.9s3.4,1.4,4.4,2.5s1.7,2.4,2,3.9s0.5,3.9,0.5,7.1v4.5
		c0,3.3-0.3,5.7-1,7.2s-1.9,2.7-3.7,3.5c-1.8,0.8-4.2,1.2-7.1,1.2h-3.6v20.7H357V64.9z M370.3,73.7v13.1c0.4,0,0.7,0,1,0
		c1.2,0,2.1-0.3,2.6-0.9s0.7-1.9,0.7-3.8v-4.2c0-1.8-0.3-2.9-0.8-3.4C373.2,74,372.1,73.7,370.3,73.7z"/>
	<path fill="#FFFFFF" d="M412.2,64.9l7.6,51.4h-13.7l-0.7-9.2h-4.8l-0.8,9.2H386l6.8-51.4H412.2z M405.2,98c-0.7-5.8-1.4-13-2-21.6
		c-1.4,9.8-2.2,17-2.6,21.6H405.2z"/>
	<path fill="#FFFFFF" d="M436.7,64.9V106h8.1v10.3h-21.5V64.9H436.7z"/>
	<path fill="#FFFFFF" d="M479.4,87.3H466v-8.9c0-2.6-0.1-4.2-0.4-4.9c-0.3-0.6-0.9-1-1.9-1c-1.1,0-1.8,0.4-2.1,1.2
		c-0.3,0.8-0.4,2.5-0.4,5.1v23.9c0,2.5,0.1,4.1,0.4,4.9s1,1.1,2,1.1s1.6-0.4,2-1.1c0.3-0.8,0.5-2.6,0.5-5.4v-6.5h13.4v2
		c0,5.3-0.4,9.1-1.1,11.3c-0.8,2.2-2.4,4.2-5,5.8c-2.6,1.7-5.7,2.5-9.5,2.5c-3.9,0-7.1-0.7-9.7-2.1s-4.2-3.4-5-5.9S448,103,448,98
		V83c0-3.7,0.1-6.5,0.4-8.3s1-3.6,2.3-5.3c1.3-1.7,3-3.1,5.2-4c2.2-1,4.8-1.5,7.7-1.5c3.9,0,7.2,0.8,9.7,2.3s4.2,3.4,5,5.7
		c0.8,2.3,1.2,5.8,1.2,10.6v4.8H479.4z"/>
	<path fill="#FFFFFF" d="M508.5,64.9l7.6,51.4h-13.7l-0.7-9.2H497l-0.8,9.2h-13.8l6.8-51.4H508.5z M501.4,98c-0.7-5.8-1.4-13-2-21.6
		c-1.4,9.8-2.2,17-2.6,21.6H501.4z"/>
	<path fill="#FFFFFF" d="M560.8,64.9v51.4h-11.7V81.6l-4.7,34.7h-8.3l-4.9-33.9v33.9h-11.7V64.9h17.3c0.5,3.1,1,6.7,1.6,10.9
		l1.9,13.1l3.1-24H560.8z"/>
	<path fill="#FFFFFF" d="M567.3,64.9h13.5c3.6,0,6.4,0.3,8.4,0.9s3.4,1.4,4.4,2.5s1.7,2.4,2,3.9s0.5,3.9,0.5,7.1v4.5
		c0,3.3-0.3,5.7-1,7.2s-1.9,2.7-3.7,3.5s-4.2,1.2-7.1,1.2h-3.6v20.7h-13.4L567.3,64.9L567.3,64.9z M580.7,73.7v13.1c0.4,0,0.7,0,1,0
		c1.2,0,2.1-0.3,2.6-0.9s0.7-1.9,0.7-3.8v-4.2c0-1.8-0.3-2.9-0.8-3.4C583.6,74,582.4,73.7,580.7,73.7z"/>
	<path fill="#FFFFFF" d="M613.8,64.9h9.5c6.3,0,10.6,0.2,12.8,0.7s4.1,1.7,5.5,3.7s2.1,5.2,2.1,9.6c0,4-0.5,6.7-1.5,8.1
		s-3,2.2-5.9,2.5c2.6,0.7,4.4,1.5,5.3,2.6c0.9,1.1,1.5,2.1,1.7,3s0.3,3.5,0.3,7.6v13.6h-12.4V99.2c0-2.8-0.2-4.5-0.7-5.1
		c-0.4-0.7-1.6-1-3.4-1v23.2h-13.4V64.9H613.8z M627.1,73.7v11.4c1.5,0,2.6-0.2,3.2-0.6c0.6-0.4,0.9-1.8,0.9-4v-2.8
		c0-1.6-0.3-2.7-0.9-3.2C629.7,74,628.7,73.7,627.1,73.7z"/>
	<path fill="#FFFFFF" d="M680.3,64.9v34.3c0,3.9-0.1,6.6-0.4,8.2s-1,3.2-2.3,4.9c-1.2,1.7-2.9,2.9-4.9,3.8s-4.4,1.3-7.2,1.3
		c-3.1,0-5.8-0.5-8.1-1.5s-4.1-2.3-5.3-4c-1.2-1.6-1.9-3.3-2.1-5.2c-0.2-1.8-0.3-5.6-0.3-11.4V64.9h13.4v38.5c0,2.2,0.1,3.7,0.4,4.3
		c0.2,0.6,0.7,0.9,1.5,0.9s1.4-0.3,1.6-1s0.4-2.3,0.4-4.9V64.9H680.3z"/>
	<path fill="#FFFFFF" d="M717.4,64.9v51.4H704V94.7h-4v21.6h-13.4V64.9H700v18.4h4V64.9H717.4z"/>
	<path fill="#FFFFFF" d="M723.9,64.9h9.5c6.3,0,10.6,0.2,12.8,0.7s4.1,1.7,5.5,3.7s2.1,5.2,2.1,9.6c0,4-0.5,6.7-1.5,8.1
		s-3,2.2-5.9,2.5c2.6,0.7,4.4,1.5,5.3,2.6c0.9,1.1,1.5,2.1,1.7,3s0.3,3.5,0.3,7.6v13.6h-12.4V99.2c0-2.8-0.2-4.5-0.7-5.1
		c-0.4-0.7-1.6-1-3.4-1v23.2h-13.4V64.9H723.9z M737.3,73.7v11.4c1.5,0,2.6-0.2,3.2-0.6c0.6-0.4,0.9-1.8,0.9-4v-2.8
		c0-1.6-0.3-2.7-0.9-3.2C739.9,74,738.8,73.7,737.3,73.7z"/>
</g>
<rect x="245" y="135" fill="#FFFFFF" width="533" height="4"/>
</svg>
