<?xml version="1.0" encoding="utf-8"?>
<!-- Generator: Adobe Illustrator 22.0.1, SVG Export Plug-In . SVG Version: 6.00 Build 0)  -->
<svg version="1.1" id="Ebene_1" xmlns="http://www.w3.org/2000/svg" xmlns:xlink="http://www.w3.org/1999/xlink" x="0px" y="0px"
	 viewBox="0 0 1200 50" style="enable-background:new 0 0 1200 50;" xml:space="preserve">
<style type="text/css">
	.st0{fill:#E0703A;}
</style>
<rect y="23" class="st0" width="572" height="4"/>
<rect x="629" y="23" class="st0" width="572" height="4"/>
<g id="PCjFTL.tif">
</g>
<polyline class="st0" points="586.6,35.6 589.8,38.7 601.4,27.6 613,38.8 616.4,35.5 604.7,24.3 610.7,18.6 616.7,24.5 617.6,15.9
	615.5,13.9 616.1,13.4 612.8,10.3 612.2,10.9 608.3,7.2 603.2,12 607.1,15.8 601.4,21.2 596.1,16.2 600.4,12 595.5,7.3 591.1,11.5
	590.7,11 587.3,14.2 587.8,14.6 583.6,18.7 588.6,23.4 592.8,19.3 598.1,24.5 586.6,35.6 "/>
</svg>
