<svg version="1.1" xmlns="http://www.w3.org/2000/svg" xmlns:xlink="http://www.w3.org/1999/xlink" x="0px" y="0px" width="1200px" height="50px" viewBox="0 0 1200 50" enable-background="new 0 0 1200 50" xml:space="preserve">
<polygon fill="#b8235f" points="615.9,25.2 609.9,19.1 604,25 615.6,36.5 612.3,39.8 600.7,28.2 589.2,39.8 585.9,36.5 597.5,25 
	592.2,19.6 587.9,23.8 583,18.9 587.2,14.7 586.7,14.2 590,10.9 590.5,11.4 594.9,7 599.8,12 595.4,16.4 600.7,21.7 606.6,15.9 
	602.6,11.9 607.8,6.8 611.7,10.7 612.3,10.1 615.6,13.4 615,14 617,16 "/>
<polygon fill="#b8235f" points="552,23 -20,23 -20,27 552,27 554,25 "/>
<polygon fill="#b8235f" points="648,23 1220,23 1220,27 648,27 646,25 "/>
</svg>
