^C:\USERS\ADMIN\DESKTOP\DHMT\TEMP\CHONGCHONG\GLSLEXPERIMENT\DEBUG\EXAMPLE1.OBJ|C:\USERS\ADMIN\DESKTOP\DHMT\TEMP\CHONGCHONG\GLSLEXPERIMENT\DEBUG\INITSHADER.OBJ
C:\USERS\ADMIN\DESKTOP\DHMT\TEMP\CHONGCHONG\DEBUG\GLSLEXPERIMENT.EXE
C:\USERS\ADMIN\DESKTOP\DHMT\TEMP\CHONGCHONG\DEBUG\GLSLEXPERIMENT.ILK
C:\USERS\ADMIN\DESKTOP\DHMT\TEMP\CHONGCHONG\DEBUG\GLSLEXPERIMENT.PDB
