^E:\YEN\GIAOTRINH\DHMTCDIO\THUCHANH_YEN\BAITHSO4_1_PROJECT_CUBE\GLSLEXPERIMENT\EXAMPLE1.CPP
/c /I..\GLEW\LIB /I..\GLEW\INCLUDE /I..\FREEGLUT\INCLUDE\GL /ZI /nologo /W3 /WX- /Od /Oy- /D _MBCS /Gm /EHsc /RTC1 /MDd /GS /fp:precise /Zc:wchar_t /Zc:forScope /Zc:inline /Fo"DEBUG\\" /Fd"DEBUG\VC140.PDB" /Gd /TP /analyze- E:\YEN\GIAOTRINH\DHMTCDIO\THUCHANH_YEN\BAITHSO4_1_PROJECT_CUBE\GLSLEXPERIMENT\EXAMPLE1.CPP
^E:\YEN\GIAOTRINH\DHMTCDIO\THUCHANH_YEN\BAITHSO4_1_PROJECT_CUBE\GLSLEXPERIMENT\INITSHADER.CPP
/c /I..\GLEW\LIB /I..\GLEW\INCLUDE /I..\FREEGLUT\INCLUDE\GL /ZI /nologo /W3 /WX- /Od /Oy- /D _MBCS /Gm /EHsc /RTC1 /MDd /GS /fp:precise /Zc:wchar_t /Zc:forScope /Zc:inline /Fo"DEBUG\\" /Fd"DEBUG\VC140.PDB" /Gd /TP /analyze- E:\YEN\GIAOTRINH\DHMTCDIO\THUCHANH_YEN\BAITHSO4_1_PROJECT_CUBE\GLSLEXPERIMENT\INITSHADER.CPP
^E:\YEN\GIAOTRINH\DHMTCDIO\THUCHANH_YEN\BAITHSO3_2_PROJECT_CUBE\GLSLEXPERIMENT\EXAMPLE1.CPP
/c /I..\GLEW\INCLUDE /I..\FREEGLUT\INCLUDE\GL /ZI /nologo /W3 /WX- /Od /Oy- /D _MBCS /Gm /EHsc /RTC1 /MDd /GS /fp:precise /Zc:wchar_t /Zc:forScope /Zc:inline /Fo"DEBUG\\" /Fd"DEBUG\VC140.PDB" /Gd /TP /analyze- E:\YEN\GIAOTRINH\DHMTCDIO\THUCHANH_YEN\BAITHSO3_2_PROJECT_CUBE\GLSLEXPERIMENT\EXAMPLE1.CPP
^E:\YEN\GIAOTRINH\DHMTCDIO\THUCHANH_YEN\BAITHSO3_2_PROJECT_CUBE\GLSLEXPERIMENT\INITSHADER.CPP
/c /I..\GLEW\INCLUDE /I..\FREEGLUT\INCLUDE\GL /ZI /nologo /W3 /WX- /Od /Oy- /D _MBCS /Gm /EHsc /RTC1 /MDd /GS /fp:precise /Zc:wchar_t /Zc:forScope /Zc:inline /Fo"DEBUG\\" /Fd"DEBUG\VC140.PDB" /Gd /TP /analyze- E:\YEN\GIAOTRINH\DHMTCDIO\THUCHANH_YEN\BAITHSO3_2_PROJECT_CUBE\GLSLEXPERIMENT\INITSHADER.CPP
^E:\WORKS\GIAOTRINH\DHMTCDIO\THUCHANH_YEN\BAITHSO3_2_PROJECT_CUBE\GLSLEXPERIMENT\EXAMPLE1.CPP
/c /I..\GLEW\INCLUDE /I..\FREEGLUT\INCLUDE\GL /ZI /nologo /W3 /WX- /diagnostics:classic /Od /Oy- /D _MBCS /Gm /EHsc /RTC1 /MDd /GS /fp:precise /Zc:wchar_t /Zc:forScope /Zc:inline /Fo"DEBUG\\" /Fd"DEBUG\VC141.PDB" /Gd /TP /analyze- /FC E:\WORKS\GIAOTRINH\DHMTCDIO\THUCHANH_YEN\BAITHSO3_2_PROJECT_CUBE\GLSLEXPERIMENT\EXAMPLE1.CPP
^E:\WORKS\GIAOTRINH\DHMTCDIO\THUCHANH_YEN\BAITHSO3_2_PROJECT_CUBE\GLSLEXPERIMENT\INITSHADER.CPP
/c /I..\GLEW\INCLUDE /I..\FREEGLUT\INCLUDE\GL /ZI /nologo /W3 /WX- /diagnostics:classic /Od /Oy- /D _MBCS /Gm /EHsc /RTC1 /MDd /GS /fp:precise /Zc:wchar_t /Zc:forScope /Zc:inline /Fo"DEBUG\\" /Fd"DEBUG\VC141.PDB" /Gd /TP /analyze- /FC E:\WORKS\GIAOTRINH\DHMTCDIO\THUCHANH_YEN\BAITHSO3_2_PROJECT_CUBE\GLSLEXPERIMENT\INITSHADER.CPP
^E:\WORKS\GIAOTRINH\DHMTCDIO\THUCHANH_YEN\THUCHANH2020\BAITHSO2\BAITHSO3_2_PROJECT_CUBE\GLSLEXPERIMENT\EXAMPLE1.CPP
/c /I..\GLEW\INCLUDE /I..\FREEGLUT\INCLUDE\GL /ZI /nologo /W3 /WX- /diagnostics:classic /Od /Oy- /D _MBCS /Gm /EHsc /RTC1 /MDd /GS /fp:precise /Zc:wchar_t /Zc:forScope /Zc:inline /Fo"DEBUG\\" /Fd"DEBUG\VC141.PDB" /Gd /TP /analyze- /FC E:\WORKS\GIAOTRINH\DHMTCDIO\THUCHANH_YEN\THUCHANH2020\BAITHSO2\BAITHSO3_2_PROJECT_CUBE\GLSLEXPERIMENT\EXAMPLE1.CPP
^E:\WORKS\GIAOTRINH\DHMTCDIO\THUCHANH_YEN\THUCHANH2020\BAITHSO2\BAITHSO3_2_PROJECT_CUBE\GLSLEXPERIMENT\INITSHADER.CPP
/c /I..\GLEW\INCLUDE /I..\FREEGLUT\INCLUDE\GL /ZI /nologo /W3 /WX- /diagnostics:classic /Od /Oy- /D _MBCS /Gm /EHsc /RTC1 /MDd /GS /fp:precise /Zc:wchar_t /Zc:forScope /Zc:inline /Fo"DEBUG\\" /Fd"DEBUG\VC141.PDB" /Gd /TP /analyze- /FC E:\WORKS\GIAOTRINH\DHMTCDIO\THUCHANH_YEN\THUCHANH2020\BAITHSO2\BAITHSO3_2_PROJECT_CUBE\GLSLEXPERIMENT\INITSHADER.CPP
^C:\USERS\ADMIN\DESKTOP\DHMT\TEMP\BAITHSO2_1_PROJECT_CUBE\GLSLEXPERIMENT\EXAMPLE1.CPP
/c /I..\GLEW\INCLUDE /I..\FREEGLUT\INCLUDE\GL /ZI /nologo /W3 /WX- /diagnostics:classic /Od /Oy- /D _MBCS /Gm /EHsc /RTC1 /MDd /GS /fp:precise /Zc:wchar_t /Zc:forScope /Zc:inline /Fo"DEBUG\\" /Fd"DEBUG\VC141.PDB" /Gd /TP /analyze- /FC C:\USERS\ADMIN\DESKTOP\DHMT\TEMP\BAITHSO2_1_PROJECT_CUBE\GLSLEXPERIMENT\EXAMPLE1.CPP
^C:\USERS\ADMIN\DESKTOP\DHMT\TEMP\BAITHSO2_1_PROJECT_CUBE\GLSLEXPERIMENT\INITSHADER.CPP
/c /I..\GLEW\INCLUDE /I..\FREEGLUT\INCLUDE\GL /ZI /nologo /W3 /WX- /diagnostics:classic /Od /Oy- /D _MBCS /Gm /EHsc /RTC1 /MDd /GS /fp:precise /Zc:wchar_t /Zc:forScope /Zc:inline /Fo"DEBUG\\" /Fd"DEBUG\VC141.PDB" /Gd /TP /analyze- /FC C:\USERS\ADMIN\DESKTOP\DHMT\TEMP\BAITHSO2_1_PROJECT_CUBE\GLSLEXPERIMENT\INITSHADER.CPP
^C:\USERS\ADMIN\DESKTOP\DHMT\TEMP\CHONGCHONG\GLSLEXPERIMENT\EXAMPLE1.CPP
/c /I..\GLEW\INCLUDE /I..\FREEGLUT\INCLUDE\GL /ZI /nologo /W3 /WX- /diagnostics:classic /Od /Oy- /D _MBCS /Gm /EHsc /RTC1 /MDd /GS /fp:precise /Zc:wchar_t /Zc:forScope /Zc:inline /Fo"DEBUG\\" /Fd"DEBUG\VC141.PDB" /Gd /TP /analyze- /FC C:\USERS\ADMIN\DESKTOP\DHMT\TEMP\CHONGCHONG\GLSLEXPERIMENT\EXAMPLE1.CPP
^C:\USERS\ADMIN\DESKTOP\DHMT\TEMP\CHONGCHONG\GLSLEXPERIMENT\INITSHADER.CPP
/c /I..\GLEW\INCLUDE /I..\FREEGLUT\INCLUDE\GL /ZI /nologo /W3 /WX- /diagnostics:classic /Od /Oy- /D _MBCS /Gm /EHsc /RTC1 /MDd /GS /fp:precise /Zc:wchar_t /Zc:forScope /Zc:inline /Fo"DEBUG\\" /Fd"DEBUG\VC141.PDB" /Gd /TP /analyze- /FC C:\USERS\ADMIN\DESKTOP\DHMT\TEMP\CHONGCHONG\GLSLEXPERIMENT\INITSHADER.CPP
