{
  "development": {
    "username": "root",
    "password": "123456@Ab",
    "database": "rufa",
    "host": "localhost",
    "port": 3306,
    "dialect": "mysql",
    "logging": false
  },
  "test": {
    "username": "ndd",
    "password": "Fd18ei6pD_~e",
    "database": "NDD",
    "host": "den1.mysql4.gear.host",
    "port": 3306,
    "dialect": "mysql",
    "logging": false
  },
  "production": {
    "username": "rufa",
    "password": "Cr9Ot01!?Cgj",
    "database": "rufa",
    "host": "den1.mysql2.gear.host",
    "port": 3306,
    "dialect": "mysql",
    "logging": false
  }
}
