{
    "1": {
        "channel": "705130899972292688",
        "role": "Day 2",
        "solutions": [
            "christmas tree",
            "Christmas Tree",
            "christmas Tree",
            "Christmas tree"
        ]
    },
    "2": {
        "channel": "705132925204824134",
        "role": "Day 3",
        "solutions": [
            ":gift:",
            "🎁"
        ]
    },
    "3": {
        "channel": "705135335905951915",
        "role": "Day 4",
        "solutions": [
            "Puddle",
            "puddle"
        ]
    },
    "4": {
        "channel": "705135355917107341",
        "role": "Day 5",
        "solutions": [
            "snow",
            "Snow"
        ]
    },
    "5": {
        "channel": "705135375806627921",
        "role": "Day 6",
        "solutions": [
            "Every year",
            "every year"
        ]
    },
    "6": {
        "channel": "705135558996787280",
        "role": "Day 7",
        "solutions": [
            "VRChat",
            "vrchat"
        ]
    },
    "7": {
        "channel": "705135597903413279",
        "role": "Day 8",
        "solutions": [
            "mu - e",
            "MU - E",
            "mu-e",
            "MU-E"
        ]
    },
    "8": {
        "channel": "762850131761561671",
        "role": "Day 9",
        "solutions": [
            "0"
        ]
    },
    "9": {
        "channel": "705135630157348905",
        "role": "Day 10",
        "solutions": [
            "alexis",
            "Alexis"
        ]
    },
    "10": {
        "channel": "783086110544101446",
        "role": "Day 11",
        "solutions": [
            ":gift:",
            "🎁"
        ]
    },
    "11": {
        "channel": "783086480578576386",
        "role": "Day 12",
        "solutions": [
            "banana",
            "Banana"
        ]
    },
    "12": {
        "channel": "783086537964388353",
        "role": "Day 13",
        "solutions": [
            "mistletoe",
            "Mistletoe"
        ]
    },
    "13": {
        "channel": "783086564631904256",
        "role": "Day 14",
        "solutions": [
            ":christmas_tree:",
            "🎄"
        ]
    },
    "14": {
        "channel": "783086582848684043",
        "role": "Day 15",
        "solutions": [
            "POG",
            "pog",
            "Pog"
        ]
    },
    "15": {
        "channel": "783086597003804712",
        "role": "Day 16",
        "solutions": [
            ":gift:",
            "🎁"
        ]
    },
    "16": {
        "channel": "783086759285620757",
        "role": "Day 17",
        "solutions": [
            "Christmas Party",
            "christmas party"
        ]
    },
    "17": {
        "channel": "783086774364012596",
        "role": "Day 18",
        "solutions": [
            "Eggnog",
            "eggnog"
        ]
    },
    "18": {
        "channel": "783086792449851463",
        "role": "Day 19",
        "solutions": [
            "Puddle was not the imposter",
            "puddle was not the imposter"
        ]
    },
    "19": {
        "channel": "783086808048730202",
        "role": "Day 20",
        "solutions": [
            "christmas tree",
            "Christmas Tree",
            "christmas Tree",
            "Christmas tree"
        ]
    },
    "20": {
        "channel": "783086821621497895",
        "role": "Day 21",
        "solutions": [
            "1225336"
        ]
    },
    "21": {
        "channel": "783086896472915978",
        "role": "Day 22",
        "solutions": [
            "Saint Nick", "saint nick"
        ]
    },
    "22": {
        "channel": "783086911715278878",
        "role": "Day 23",
        "solutions": [
            "Sky Winter",
            "sky winter"
        ]
    },
    "23": {
        "channel": "783086929570431046",
        "role": "Day 24",
        "solutions": [
            "366"
        ]
    },
    "24": {
        "channel": "783086948100079677",
        "role": "Day 25",
        "solutions": [
            "Feliz Navidad",
            "feliz navidad"
        ]
    },
    "25": {
        "channel": "783087028417331262",
        "role": "Winner",
        "solutions": [
            "Candy cane and gifts",
            "candy cane and gifts"
        ]
    }
}