<svg width="153" height="99" viewBox="0 0 153 99" fill="none" xmlns="http://www.w3.org/2000/svg">
<path fill-rule="evenodd" clip-rule="evenodd" d="M152.203 35.959C146.262 33.7151 139.56 31.1878 131.97 28.325C123.274 25.0449 113.213 21.252 101.468 16.8225C89.7238 21.252 79.6629 25.0449 70.9672 28.325C63.3771 31.1878 56.6753 33.7151 50.7343 35.959C50.7343 32.238 50.7343 28.5172 50.7343 24.7913C56.6804 21.8844 63.3779 18.6126 70.972 14.9017C79.6635 10.6542 89.7184 5.73827 101.468 -9.90236e-05V12.8373L152.203 31.9957V35.959Z" fill="#212121"/>
<path fill-rule="evenodd" clip-rule="evenodd" d="M152.203 54.8569C146.262 53.7353 139.565 52.4724 131.97 51.0407C123.274 49.4014 113.213 47.5045 101.468 45.2899V45.2902C89.7238 47.5045 79.6629 49.4014 70.9672 51.0407C63.3722 52.4721 56.6753 53.7353 50.7343 54.8569C50.7343 51.1409 50.7343 47.4202 50.7343 43.6991C56.6753 41.915 63.3771 39.9054 70.9672 37.6289C79.6629 35.0206 89.7238 32.0045 101.468 28.4825V41.3493L152.203 50.8939V54.8569Z" fill="#212121"/>
<path fill-rule="evenodd" clip-rule="evenodd" d="M152.203 73.7505C146.262 73.7505 139.565 73.7505 131.97 73.7505C123.274 73.7505 113.213 73.7505 101.468 73.7505C89.7238 73.7505 79.6629 73.7505 70.9672 73.7505C63.3722 73.7505 56.6753 73.7505 50.7343 73.7505C50.7343 70.0394 50.7343 66.3186 50.7343 62.5978C56.6753 61.9354 63.3722 61.1897 70.9672 60.3449C79.6629 59.3772 89.7238 58.2572 101.468 56.9501V69.7875H152.203V73.7505Z" fill="#212121"/>
<path fill-rule="evenodd" clip-rule="evenodd" d="M152.203 98.2913C146.262 98.2913 139.565 98.2913 131.97 98.2913C123.274 98.2913 113.213 98.2913 101.468 98.2913H0V81.4909H101.468V94.3283H152.203V98.2913Z" fill="#212121"/>
</svg>
