^C:\USERS\1\SOURCE\REPOS\HELLOWORLD2\HELLOWORLD2.CPP
C:\WINDOWS\GLOBALIZATION\SORTING\SORTDEFAULT.NLS
Y:\PROGRAMMS\MVS\VC\TOOLS\MSVC\14.25.28610\BIN\HOSTX86\X86\1033\CLUI.DLL
C:\WINDOWS\SYSTEM32\TZRES.DLL
Y:\PROGRAMMS\MVS\VC\TOOLS\MSVC\14.25.28610\INCLUDE\IOSTREAM
Y:\PROGRAMMS\MVS\VC\TOOLS\MSVC\14.25.28610\INCLUDE\YVALS_CORE.H
Y:\PROGRAMMS\MVS\VC\TOOLS\MSVC\14.25.28610\INCLUDE\VCRUNTIME.H
Y:\PROGRAMMS\MVS\VC\TOOLS\MSVC\14.25.28610\INCLUDE\SAL.H
Y:\PROGRAMMS\MVS\VC\TOOLS\MSVC\14.25.28610\INCLUDE\CONCURRENCYSAL.H
Y:\PROGRAMMS\MVS\VC\TOOLS\MSVC\14.25.28610\INCLUDE\VADEFS.H
Y:\PROGRAMMS\MVS\VC\TOOLS\MSVC\14.25.28610\INCLUDE\XKEYCHECK.H
Y:\PROGRAMMS\MVS\VC\TOOLS\MSVC\14.25.28610\INCLUDE\ISTREAM
Y:\PROGRAMMS\MVS\VC\TOOLS\MSVC\14.25.28610\INCLUDE\OSTREAM
Y:\PROGRAMMS\MVS\VC\TOOLS\MSVC\14.25.28610\INCLUDE\IOS
Y:\PROGRAMMS\MVS\VC\TOOLS\MSVC\14.25.28610\INCLUDE\XLOCNUM
Y:\PROGRAMMS\MVS\VC\TOOLS\MSVC\14.25.28610\INCLUDE\CLIMITS
Y:\PROGRAMMS\MVS\VC\TOOLS\MSVC\14.25.28610\INCLUDE\LIMITS.H
Y:\PROGRAMMS\MVS\VC\TOOLS\MSVC\14.25.28610\INCLUDE\CMATH
Y:\PROGRAMMS\MVS\VC\TOOLS\MSVC\14.25.28610\INCLUDE\YVALS.H
C:\PROGRAM FILES (X86)\WINDOWS KITS\10\INCLUDE\10.0.18362.0\UCRT\CRTDBG.H
C:\PROGRAM FILES (X86)\WINDOWS KITS\10\INCLUDE\10.0.18362.0\UCRT\CORECRT.H
Y:\PROGRAMMS\MVS\VC\TOOLS\MSVC\14.25.28610\INCLUDE\VCRUNTIME_NEW_DEBUG.H
Y:\PROGRAMMS\MVS\VC\TOOLS\MSVC\14.25.28610\INCLUDE\VCRUNTIME_NEW.H
Y:\PROGRAMMS\MVS\VC\TOOLS\MSVC\14.25.28610\INCLUDE\CRTDEFS.H
Y:\PROGRAMMS\MVS\VC\TOOLS\MSVC\14.25.28610\INCLUDE\USE_ANSI.H
Y:\PROGRAMMS\MVS\VC\TOOLS\MSVC\14.25.28610\INCLUDE\CSTDLIB
C:\PROGRAM FILES (X86)\WINDOWS KITS\10\INCLUDE\10.0.18362.0\UCRT\MATH.H
C:\PROGRAM FILES (X86)\WINDOWS KITS\10\INCLUDE\10.0.18362.0\UCRT\CORECRT_MATH.H
C:\PROGRAM FILES (X86)\WINDOWS KITS\10\INCLUDE\10.0.18362.0\UCRT\STDLIB.H
C:\PROGRAM FILES (X86)\WINDOWS KITS\10\INCLUDE\10.0.18362.0\UCRT\CORECRT_MALLOC.H
C:\PROGRAM FILES (X86)\WINDOWS KITS\10\INCLUDE\10.0.18362.0\UCRT\CORECRT_SEARCH.H
C:\PROGRAM FILES (X86)\WINDOWS KITS\10\INCLUDE\10.0.18362.0\UCRT\STDDEF.H
C:\PROGRAM FILES (X86)\WINDOWS KITS\10\INCLUDE\10.0.18362.0\UCRT\CORECRT_WSTDLIB.H
Y:\PROGRAMMS\MVS\VC\TOOLS\MSVC\14.25.28610\INCLUDE\XTR1COMMON
Y:\PROGRAMMS\MVS\VC\TOOLS\MSVC\14.25.28610\INCLUDE\CSTDIO
C:\PROGRAM FILES (X86)\WINDOWS KITS\10\INCLUDE\10.0.18362.0\UCRT\STDIO.H
C:\PROGRAM FILES (X86)\WINDOWS KITS\10\INCLUDE\10.0.18362.0\UCRT\CORECRT_WSTDIO.H
C:\PROGRAM FILES (X86)\WINDOWS KITS\10\INCLUDE\10.0.18362.0\UCRT\CORECRT_STDIO_CONFIG.H
Y:\PROGRAMMS\MVS\VC\TOOLS\MSVC\14.25.28610\INCLUDE\STREAMBUF
Y:\PROGRAMMS\MVS\VC\TOOLS\MSVC\14.25.28610\INCLUDE\XIOSBASE
C:\PROGRAM FILES (X86)\WINDOWS KITS\10\INCLUDE\10.0.18362.0\UCRT\SHARE.H
C:\PROGRAM FILES (X86)\WINDOWS KITS\10\INCLUDE\10.0.18362.0\UCRT\CORECRT_SHARE.H
Y:\PROGRAMMS\MVS\VC\TOOLS\MSVC\14.25.28610\INCLUDE\SYSTEM_ERROR
Y:\PROGRAMMS\MVS\VC\TOOLS\MSVC\14.25.28610\INCLUDE\CERRNO
C:\PROGRAM FILES (X86)\WINDOWS KITS\10\INCLUDE\10.0.18362.0\UCRT\ERRNO.H
Y:\PROGRAMMS\MVS\VC\TOOLS\MSVC\14.25.28610\INCLUDE\STDEXCEPT
Y:\PROGRAMMS\MVS\VC\TOOLS\MSVC\14.25.28610\INCLUDE\EXCEPTION
Y:\PROGRAMMS\MVS\VC\TOOLS\MSVC\14.25.28610\INCLUDE\TYPE_TRAITS
Y:\PROGRAMMS\MVS\VC\TOOLS\MSVC\14.25.28610\INCLUDE\XSTDDEF
Y:\PROGRAMMS\MVS\VC\TOOLS\MSVC\14.25.28610\INCLUDE\CSTDDEF
Y:\PROGRAMMS\MVS\VC\TOOLS\MSVC\14.25.28610\INCLUDE\INITIALIZER_LIST
C:\PROGRAM FILES (X86)\WINDOWS KITS\10\INCLUDE\10.0.18362.0\UCRT\MALLOC.H
Y:\PROGRAMMS\MVS\VC\TOOLS\MSVC\14.25.28610\INCLUDE\VCRUNTIME_EXCEPTION.H
Y:\PROGRAMMS\MVS\VC\TOOLS\MSVC\14.25.28610\INCLUDE\EH.H
C:\PROGRAM FILES (X86)\WINDOWS KITS\10\INCLUDE\10.0.18362.0\UCRT\CORECRT_TERMINATE.H
Y:\PROGRAMMS\MVS\VC\TOOLS\MSVC\14.25.28610\INCLUDE\XSTRING
Y:\PROGRAMMS\MVS\VC\TOOLS\MSVC\14.25.28610\INCLUDE\IOSFWD
Y:\PROGRAMMS\MVS\VC\TOOLS\MSVC\14.25.28610\INCLUDE\CSTRING
C:\PROGRAM FILES (X86)\WINDOWS KITS\10\INCLUDE\10.0.18362.0\UCRT\STRING.H
C:\PROGRAM FILES (X86)\WINDOWS KITS\10\INCLUDE\10.0.18362.0\UCRT\CORECRT_MEMORY.H
C:\PROGRAM FILES (X86)\WINDOWS KITS\10\INCLUDE\10.0.18362.0\UCRT\CORECRT_MEMCPY_S.H
Y:\PROGRAMMS\MVS\VC\TOOLS\MSVC\14.25.28610\INCLUDE\VCRUNTIME_STRING.H
C:\PROGRAM FILES (X86)\WINDOWS KITS\10\INCLUDE\10.0.18362.0\UCRT\CORECRT_WSTRING.H
Y:\PROGRAMMS\MVS\VC\TOOLS\MSVC\14.25.28610\INCLUDE\CWCHAR
C:\PROGRAM FILES (X86)\WINDOWS KITS\10\INCLUDE\10.0.18362.0\UCRT\WCHAR.H
C:\PROGRAM FILES (X86)\WINDOWS KITS\10\INCLUDE\10.0.18362.0\UCRT\CORECRT_WCONIO.H
C:\PROGRAM FILES (X86)\WINDOWS KITS\10\INCLUDE\10.0.18362.0\UCRT\CORECRT_WCTYPE.H
C:\PROGRAM FILES (X86)\WINDOWS KITS\10\INCLUDE\10.0.18362.0\UCRT\CORECRT_WDIRECT.H
C:\PROGRAM FILES (X86)\WINDOWS KITS\10\INCLUDE\10.0.18362.0\UCRT\CORECRT_WIO.H
C:\PROGRAM FILES (X86)\WINDOWS KITS\10\INCLUDE\10.0.18362.0\UCRT\CORECRT_WPROCESS.H
C:\PROGRAM FILES (X86)\WINDOWS KITS\10\INCLUDE\10.0.18362.0\UCRT\CORECRT_WTIME.H
C:\PROGRAM FILES (X86)\WINDOWS KITS\10\INCLUDE\10.0.18362.0\UCRT\SYS\STAT.H
C:\PROGRAM FILES (X86)\WINDOWS KITS\10\INCLUDE\10.0.18362.0\UCRT\SYS\TYPES.H
Y:\PROGRAMMS\MVS\VC\TOOLS\MSVC\14.25.28610\INCLUDE\XMEMORY
Y:\PROGRAMMS\MVS\VC\TOOLS\MSVC\14.25.28610\INCLUDE\CSTDINT
Y:\PROGRAMMS\MVS\VC\TOOLS\MSVC\14.25.28610\INCLUDE\STDINT.H
Y:\PROGRAMMS\MVS\VC\TOOLS\MSVC\14.25.28610\INCLUDE\LIMITS
Y:\PROGRAMMS\MVS\VC\TOOLS\MSVC\14.25.28610\INCLUDE\CFLOAT
C:\PROGRAM FILES (X86)\WINDOWS KITS\10\INCLUDE\10.0.18362.0\UCRT\FLOAT.H
Y:\PROGRAMMS\MVS\VC\TOOLS\MSVC\14.25.28610\INCLUDE\NEW
Y:\PROGRAMMS\MVS\VC\TOOLS\MSVC\14.25.28610\INCLUDE\XATOMIC.H
Y:\PROGRAMMS\MVS\VC\TOOLS\MSVC\14.25.28610\INCLUDE\INTRIN0.H
Y:\PROGRAMMS\MVS\VC\TOOLS\MSVC\14.25.28610\INCLUDE\XUTILITY
Y:\PROGRAMMS\MVS\VC\TOOLS\MSVC\14.25.28610\INCLUDE\UTILITY
Y:\PROGRAMMS\MVS\VC\TOOLS\MSVC\14.25.28610\INCLUDE\XCALL_ONCE.H
Y:\PROGRAMMS\MVS\VC\TOOLS\MSVC\14.25.28610\INCLUDE\XERRC.H
Y:\PROGRAMMS\MVS\VC\TOOLS\MSVC\14.25.28610\INCLUDE\XLOCALE
Y:\PROGRAMMS\MVS\VC\TOOLS\MSVC\14.25.28610\INCLUDE\MEMORY
Y:\PROGRAMMS\MVS\VC\TOOLS\MSVC\14.25.28610\INCLUDE\TYPEINFO
Y:\PROGRAMMS\MVS\VC\TOOLS\MSVC\14.25.28610\INCLUDE\VCRUNTIME_TYPEINFO.H
Y:\PROGRAMMS\MVS\VC\TOOLS\MSVC\14.25.28610\INCLUDE\XFACET
Y:\PROGRAMMS\MVS\VC\TOOLS\MSVC\14.25.28610\INCLUDE\XLOCINFO
Y:\PROGRAMMS\MVS\VC\TOOLS\MSVC\14.25.28610\INCLUDE\XLOCINFO.H
C:\PROGRAM FILES (X86)\WINDOWS KITS\10\INCLUDE\10.0.18362.0\UCRT\CTYPE.H
C:\PROGRAM FILES (X86)\WINDOWS KITS\10\INCLUDE\10.0.18362.0\UCRT\LOCALE.H
