^C:\Users\1\source\repos\HelloWorld2\HelloWorld2.vcxproj
C:\Users\1\source\repos\HelloWorld2\Release\HelloWorld2.ipdb
C:\Users\1\source\repos\HelloWorld2\Release\HelloWorld2.iobj
^C:\Users\1\source\repos\HelloWorld2\HelloWorld2.vcxproj
C:\Users\1\source\repos\HelloWorld2\Release\HelloWorld2.ipdb
C:\Users\1\source\repos\HelloWorld2\Release\HelloWorld2.iobj
