{
  "type": "service_account",
  "project_id": "stoked-woods-284614",
  "private_key_id": "aa1804150406f8c4b629fe46f7405c43147ecc90",
  "private_key": "-----BEGIN PRIVATE KEY-----\nMIIEvgIBADANBgkqhkiG9w0BAQEFAASCBKgwggSkAgEAAoIBAQD0+2ARwY6OoADM\nNailQxL6A90GvjC5T6ygGCAJbn/YzIcXuaUQNGVJ9I99iZ5elvCk/oORklOQmtqw\n+YKZVtaZK6Ii8TY6gbSSBzY3Ffkh7BP7x/HTKHJt1JoUSvvMEqKbSE1K3M5GfQxY\nLXOp6flZYp9TjEIu6uomRbymr9Iuz2XX7E8vbVA3R+GSsl3nVrTlCdlKS/uBM0HX\nTPUfbIvcDs89koVj4jrY1hBcnWNMVAATEV0W4iPNx5yEfDia23ZDhNPdZ9I3lPpt\nwSuOumlOjVRQGqEoa6N/emXVOpzX1CLlnNXlDcJgxTiSx0g7JfFeRuFYS06sFoXt\nmPRrQoGDAgMBAAECggEAAlHI+JIRE/ee2lAdvybR7K0RsCkn0/FVrJRd5Uj3C+nv\n04Et92fPl7Ipk6I0bifWsnE4dK3ifamBrZBHNMV2NbAMknEfNtGYkJNh54adO718\n+PLNLtcgsjqDlPKazLVWdcrq9Gz/xPoVHlab1D2DX13ILWXUEJanzeH2JcvfXRMT\n4QalC2oCyxgWOZBpHyyvx0GV9eVNU11ZFqHzxXcpzuJFLJuyCblFn/9qAowGXtuk\n40KUQThk3nLc1OUla3oVozUV9AH1KBEUtrf++kKwt2onOZfcmRJmAPQWh5DpBK11\npl4zxbLGSJS6u8EsRztWVaNU2NgQFzq+wxinrOxxKQKBgQD/iJB28iYDX80lM9qX\nlfQaEigdzXe1aShlHE/Ukc5WG6PSXnOAUQBoGKMpj1a/UthCajanxmaCop+ceEEW\nXOiH9PAocvILy8ASdvQOYbBmXSWWvVcTFDmEwfVONU5mHQDmI/5un1X+vzVTK1nv\nq97zgmN5W1mmvYcCxUUbakNSyQKBgQD1beETa0HZ5cM3deQTOidrm6dDpL19uN+P\ny0S/bUIYBu9mIJE91eZshz97V+KgT0q/9+AQyBEmSZdHUO7icvZj+bST3F3HPH6Q\nK1FDBs6cYDvzT+RGhnqziHd8BaVsU+XfyvZt6hudHYjAsRwOVhaxiymMomwCk6gQ\nUnGlmz/r6wKBgQCr6fmfPHwciwhePguTLhxiqdJ5cnFWCCBYHfsLPOj/f2rwrgCw\n1E4cum6TGE85Oogp7oFE0LLIspYFU9YeMHV0enJUFDkJfJOFGKhLQKfHxmTyjAGX\n4WRtD3x0mGJdSqf/LToQvHvDfmpmwOSp3QyK8S7xR2cCScIaOBOtRQl0GQKBgQDl\nJnCN9wkG75WzxKjsotGHkU88wyYBqolh8sH/kX2yfVcsnZ++gmagUi8ddNMuJpp+\nXmugf4wzmWZbud8xI3GVquHFZG1SxtLMvQUkdciXDOsspB1ZE9qgofwdmg/38uWg\nbBpmSbz6l0bF0xeE8zBBGNP0cPoz9bVnd/KQU0H9fQKBgEqGPK/90fs7NWtGwFon\n1U1d2BDR0cWny94aWkvSO64d/ydmZBgRLqLbsTW/ZeJpSX6vj9ycYME5zfNzOyxb\nzbvbPd87IcAqc5Xx1V1ymM4Sajqs0qyYInSyiL1RdpriinVf2/JYt1t+T5sJC2sv\nufr/C0lFykiQt/zHc6EWPHiL\n-----END PRIVATE KEY-----\n",
  "client_email": "dtduc0103@stoked-woods-284614.iam.gserviceaccount.com",
  "client_id": "117816835210372797262",
  "auth_uri": "https://accounts.google.com/o/oauth2/auth",
  "token_uri": "https://oauth2.googleapis.com/token",
  "auth_provider_x509_cert_url": "https://www.googleapis.com/oauth2/v1/certs",
  "client_x509_cert_url": "https://www.googleapis.com/robot/v1/metadata/x509/dtduc0103%40stoked-woods-284614.iam.gserviceaccount.com"
}
