%!PS-Adobe-2.0 EPSF-1.2
%%Creator: MATLAB, The Mathworks, Inc. Version 7.5.0.338 (R2007b). Operating System: Linux 2.6.35-32-generic #67-Ubuntu SMP Mon Mar 5 19:39:49 UTC 2012 x86_64.
%%Title: ./filtri_q_costante.eps
%%CreationDate: 04/23/2012  16:53:56
%%DocumentNeededFonts: Helvetica
%%DocumentProcessColors: Cyan Magenta Yellow Black
%%Extensions: CMYK
%%Pages: 1
%%BoundingBox:    53   196   550   602
%%EndComments

%%BeginProlog
% MathWorks dictionary
/MathWorks 160 dict begin
% definition operators
/bdef {bind def} bind def
/ldef {load def} bind def
/xdef {exch def} bdef
/xstore {exch store} bdef
% operator abbreviations
/c  /clip ldef
/cc /concat ldef
/cp /closepath ldef
/gr /grestore ldef
/gs /gsave ldef
/mt /moveto ldef
/np /newpath ldef
/cm /currentmatrix ldef
/sm /setmatrix ldef
/rm /rmoveto ldef
/rl /rlineto ldef
/s {show newpath} bdef
/sc {setcmykcolor} bdef
/sr /setrgbcolor ldef
/sg /setgray ldef
/w /setlinewidth ldef
/j /setlinejoin ldef
/cap /setlinecap ldef
/rc {rectclip} bdef
/rf {rectfill} bdef
% page state control
/pgsv () def
/bpage {/pgsv save def} bdef
/epage {pgsv restore} bdef
/bplot /gsave ldef
/eplot {stroke grestore} bdef
% orientation switch
/portraitMode 0 def /landscapeMode 1 def /rotateMode 2 def
% coordinate system mappings
/dpi2point 0 def
% font control
/FontSize 0 def
/FMS {/FontSize xstore findfont [FontSize 0 0 FontSize neg 0 0]
  makefont setfont} bdef
/reencode {exch dup where {pop load} {pop StandardEncoding} ifelse
  exch dup 3 1 roll findfont dup length dict begin
  { 1 index /FID ne {def}{pop pop} ifelse } forall
  /Encoding exch def currentdict end definefont pop} bdef
/isroman {findfont /CharStrings get /Agrave known} bdef
/FMSR {3 1 roll 1 index dup isroman {reencode} {pop pop} ifelse
  exch FMS} bdef
/csm {1 dpi2point div -1 dpi2point div scale neg translate
 dup landscapeMode eq {pop -90 rotate}
  {rotateMode eq {90 rotate} if} ifelse} bdef
% line types: solid, dotted, dashed, dotdash
/SO { [] 0 setdash } bdef
/DO { [.5 dpi2point mul 4 dpi2point mul] 0 setdash } bdef
/DA { [6 dpi2point mul] 0 setdash } bdef
/DD { [.5 dpi2point mul 4 dpi2point mul 6 dpi2point mul 4
  dpi2point mul] 0 setdash } bdef
% macros for lines and objects
/L {lineto stroke} bdef
/MP {3 1 roll moveto 1 sub {rlineto} repeat} bdef
/AP {{rlineto} repeat} bdef
/PDlw -1 def
/W {/PDlw currentlinewidth def setlinewidth} def
/PP {closepath eofill} bdef
/DP {closepath stroke} bdef
/MR {4 -2 roll moveto dup  0 exch rlineto exch 0 rlineto
  neg 0 exch rlineto closepath} bdef
/FR {MR stroke} bdef
/PR {MR fill} bdef
/L1i {{currentfile picstr readhexstring pop} image} bdef
/tMatrix matrix def
/MakeOval {newpath tMatrix currentmatrix pop translate scale
0 0 1 0 360 arc tMatrix setmatrix} bdef
/FO {MakeOval stroke} bdef
/PO {MakeOval fill} bdef
/PD {currentlinewidth 2 div 0 360 arc fill
   PDlw -1 eq not {PDlw w /PDlw -1 def} if} def
/FA {newpath tMatrix currentmatrix pop translate scale
  0 0 1 5 -2 roll arc tMatrix setmatrix stroke} bdef
/PA {newpath tMatrix currentmatrix pop	translate 0 0 moveto scale
  0 0 1 5 -2 roll arc closepath tMatrix setmatrix fill} bdef
/FAn {newpath tMatrix currentmatrix pop translate scale
  0 0 1 5 -2 roll arcn tMatrix setmatrix stroke} bdef
/PAn {newpath tMatrix currentmatrix pop translate 0 0 moveto scale
  0 0 1 5 -2 roll arcn closepath tMatrix setmatrix fill} bdef
/vradius 0 def /hradius 0 def /lry 0 def
/lrx 0 def /uly 0 def /ulx 0 def /rad 0 def
/MRR {/vradius xdef /hradius xdef /lry xdef /lrx xdef /uly xdef
  /ulx xdef newpath tMatrix currentmatrix pop ulx hradius add uly
  vradius add translate hradius vradius scale 0 0 1 180 270 arc 
  tMatrix setmatrix lrx hradius sub uly vradius add translate
  hradius vradius scale 0 0 1 270 360 arc tMatrix setmatrix
  lrx hradius sub lry vradius sub translate hradius vradius scale
  0 0 1 0 90 arc tMatrix setmatrix ulx hradius add lry vradius sub
  translate hradius vradius scale 0 0 1 90 180 arc tMatrix setmatrix
  closepath} bdef
/FRR {MRR stroke } bdef
/PRR {MRR fill } bdef
/MlrRR {/lry xdef /lrx xdef /uly xdef /ulx xdef /rad lry uly sub 2 div def
  newpath tMatrix currentmatrix pop ulx rad add uly rad add translate
  rad rad scale 0 0 1 90 270 arc tMatrix setmatrix lrx rad sub lry rad
  sub translate rad rad scale 0 0 1 270 90 arc tMatrix setmatrix
  closepath} bdef
/FlrRR {MlrRR stroke } bdef
/PlrRR {MlrRR fill } bdef
/MtbRR {/lry xdef /lrx xdef /uly xdef /ulx xdef /rad lrx ulx sub 2 div def
  newpath tMatrix currentmatrix pop ulx rad add uly rad add translate
  rad rad scale 0 0 1 180 360 arc tMatrix setmatrix lrx rad sub lry rad
  sub translate rad rad scale 0 0 1 0 180 arc tMatrix setmatrix
  closepath} bdef
/FtbRR {MtbRR stroke } bdef
/PtbRR {MtbRR fill } bdef
/stri 6 array def /dtri 6 array def
/smat 6 array def /dmat 6 array def
/tmat1 6 array def /tmat2 6 array def /dif 3 array def
/asub {/ind2 exch def /ind1 exch def dup dup
  ind1 get exch ind2 get sub exch } bdef
/tri_to_matrix {
  2 0 asub 3 1 asub 4 0 asub 5 1 asub
  dup 0 get exch 1 get 7 -1 roll astore } bdef
/compute_transform {
  dmat dtri tri_to_matrix tmat1 invertmatrix 
  smat stri tri_to_matrix tmat2 concatmatrix } bdef
/ds {stri astore pop} bdef
/dt {dtri astore pop} bdef
/db {2 copy /cols xdef /rows xdef mul dup 3 mul string
  currentfile exch readhexstring pop
  dup 0 3 index getinterval /rbmap xdef
  dup 2 index dup getinterval /gbmap xdef
  1 index dup 2 mul exch getinterval /bbmap xdef pop pop}bdef
/it {gs np dtri aload pop moveto lineto lineto cp c
  cols rows 8 compute_transform 
  rbmap gbmap bbmap true 3 colorimage gr}bdef
/il {newpath moveto lineto stroke}bdef
currentdict end def
%%EndProlog

%%BeginSetup
MathWorks begin

0 cap

end
%%EndSetup

%%Page: 1 1
%%BeginPageSetup
%%PageBoundingBox:    53   196   550   602
MathWorks begin
bpage
%%EndPageSetup

%%BeginObject: obj1
bplot

/dpi2point 12 def
portraitMode 0216 7344 csm

  422   110  5971  4882 MR c np
86 dict begin %Colortable dictionary
/c0 { 0.000000 0.000000 0.000000 sr} bdef
/c1 { 1.000000 1.000000 1.000000 sr} bdef
/c2 { 0.900000 0.000000 0.000000 sr} bdef
/c3 { 0.000000 0.820000 0.000000 sr} bdef
/c4 { 0.000000 0.000000 0.800000 sr} bdef
/c5 { 0.910000 0.820000 0.320000 sr} bdef
/c6 { 1.000000 0.260000 0.820000 sr} bdef
/c7 { 0.000000 0.820000 0.820000 sr} bdef
c0
1 j
1 sg
   0    0 6913 5186 PR
6 w
0 4226 5356 0 0 -4226 899 4615 4 MP
PP
-5356 0 0 4226 5356 0 0 -4226 899 4615 5 MP stroke
4 w
DO
0 sg
 899 4615 mt  899  389 L
 899  389 mt  899  389 L
2684 4615 mt 2684  389 L
2684  389 mt 2684  389 L
4469 4615 mt 4469  389 L
4469  389 mt 4469  389 L
6255 4615 mt 6255  389 L
6255  389 mt 6255  389 L
 899 4615 mt 6255 4615 L
6255 4615 mt 6255 4615 L
 899 4011 mt 6255 4011 L
6255 4011 mt 6255 4011 L
 899 3407 mt 6255 3407 L
6255 3407 mt 6255 3407 L
 899 2803 mt 6255 2803 L
6255 2803 mt 6255 2803 L
 899 2200 mt 6255 2200 L
6255 2200 mt 6255 2200 L
 899 1596 mt 6255 1596 L
6255 1596 mt 6255 1596 L
 899  992 mt 6255  992 L
6255  992 mt 6255  992 L
 899  389 mt 6255  389 L
6255  389 mt 6255  389 L
SO
6 w
 899 4615 mt 6255 4615 L
 899  389 mt 6255  389 L
 899 4615 mt  899  389 L
6255 4615 mt 6255  389 L
 899 4615 mt 6255 4615 L
 899 4615 mt  899  389 L
 899 4615 mt  899 4588 L
 899  389 mt  899  415 L
DO
 899 4615 mt  899  389 L
 899  389 mt  899  389 L
SO
 899 4615 mt  899 4561 L
 899  389 mt  899  442 L
%%IncludeResource: font Helvetica
/Helvetica /ISOLatin1Encoding 120 FMSR

 787 4797 mt 
(10) s
%%IncludeResource: font Helvetica
/Helvetica /ISOLatin1Encoding 80 FMSR

 920 4723 mt 
(-1) s
1436 4615 mt 1436 4588 L
1436  389 mt 1436  415 L
DO
1436 4615 mt 1436  389 L
1436  389 mt 1436  389 L
SO
1750 4615 mt 1750 4588 L
1750  389 mt 1750  415 L
DO
1750 4615 mt 1750  389 L
1750  389 mt 1750  389 L
SO
1973 4615 mt 1973 4588 L
1973  389 mt 1973  415 L
DO
1973 4615 mt 1973  389 L
1973  389 mt 1973  389 L
SO
2146 4615 mt 2146 4588 L
2146  389 mt 2146  415 L
DO
2146 4615 mt 2146  389 L
2146  389 mt 2146  389 L
SO
2288 4615 mt 2288 4588 L
2288  389 mt 2288  415 L
DO
2288 4615 mt 2288  389 L
2288  389 mt 2288  389 L
SO
2407 4615 mt 2407 4588 L
2407  389 mt 2407  415 L
DO
2407 4615 mt 2407  389 L
2407  389 mt 2407  389 L
SO
2511 4615 mt 2511 4588 L
2511  389 mt 2511  415 L
DO
2511 4615 mt 2511  389 L
2511  389 mt 2511  389 L
SO
2602 4615 mt 2602 4588 L
2602  389 mt 2602  415 L
DO
2602 4615 mt 2602  389 L
2602  389 mt 2602  389 L
SO
2684 4615 mt 2684 4588 L
2684  389 mt 2684  415 L
DO
2684 4615 mt 2684  389 L
2684  389 mt 2684  389 L
SO
2684 4615 mt 2684 4561 L
2684  389 mt 2684  442 L
%%IncludeResource: font Helvetica
/Helvetica /ISOLatin1Encoding 120 FMSR

2596 4797 mt 
(10) s
%%IncludeResource: font Helvetica
/Helvetica /ISOLatin1Encoding 80 FMSR

2729 4723 mt 
(0) s
3221 4615 mt 3221 4588 L
3221  389 mt 3221  415 L
DO
3221 4615 mt 3221  389 L
3221  389 mt 3221  389 L
SO
3536 4615 mt 3536 4588 L
3536  389 mt 3536  415 L
DO
3536 4615 mt 3536  389 L
3536  389 mt 3536  389 L
SO
3759 4615 mt 3759 4588 L
3759  389 mt 3759  415 L
DO
3759 4615 mt 3759  389 L
3759  389 mt 3759  389 L
SO
3932 4615 mt 3932 4588 L
3932  389 mt 3932  415 L
DO
3932 4615 mt 3932  389 L
3932  389 mt 3932  389 L
SO
4073 4615 mt 4073 4588 L
4073  389 mt 4073  415 L
DO
4073 4615 mt 4073  389 L
4073  389 mt 4073  389 L
SO
4193 4615 mt 4193 4588 L
4193  389 mt 4193  415 L
DO
4193 4615 mt 4193  389 L
4193  389 mt 4193  389 L
SO
4296 4615 mt 4296 4588 L
4296  389 mt 4296  415 L
DO
4296 4615 mt 4296  389 L
4296  389 mt 4296  389 L
SO
4387 4615 mt 4387 4588 L
4387  389 mt 4387  415 L
DO
4387 4615 mt 4387  389 L
4387  389 mt 4387  389 L
SO
4469 4615 mt 4469 4588 L
4469  389 mt 4469  415 L
DO
4469 4615 mt 4469  389 L
4469  389 mt 4469  389 L
SO
4469 4615 mt 4469 4561 L
4469  389 mt 4469  442 L
%%IncludeResource: font Helvetica
/Helvetica /ISOLatin1Encoding 120 FMSR

4381 4797 mt 
(10) s
%%IncludeResource: font Helvetica
/Helvetica /ISOLatin1Encoding 80 FMSR

4514 4723 mt 
(1) s
5007 4615 mt 5007 4588 L
5007  389 mt 5007  415 L
DO
5007 4615 mt 5007  389 L
5007  389 mt 5007  389 L
SO
5321 4615 mt 5321 4588 L
5321  389 mt 5321  415 L
DO
5321 4615 mt 5321  389 L
5321  389 mt 5321  389 L
SO
5544 4615 mt 5544 4588 L
5544  389 mt 5544  415 L
DO
5544 4615 mt 5544  389 L
5544  389 mt 5544  389 L
SO
5717 4615 mt 5717 4588 L
5717  389 mt 5717  415 L
DO
5717 4615 mt 5717  389 L
5717  389 mt 5717  389 L
SO
5858 4615 mt 5858 4588 L
5858  389 mt 5858  415 L
DO
5858 4615 mt 5858  389 L
5858  389 mt 5858  389 L
SO
5978 4615 mt 5978 4588 L
5978  389 mt 5978  415 L
DO
5978 4615 mt 5978  389 L
5978  389 mt 5978  389 L
SO
6081 4615 mt 6081 4588 L
6081  389 mt 6081  415 L
DO
6081 4615 mt 6081  389 L
6081  389 mt 6081  389 L
SO
6173 4615 mt 6173 4588 L
6173  389 mt 6173  415 L
DO
6173 4615 mt 6173  389 L
6173  389 mt 6173  389 L
SO
6255 4615 mt 6255 4588 L
6255  389 mt 6255  415 L
DO
6255 4615 mt 6255  389 L
6255  389 mt 6255  389 L
SO
6255 4615 mt 6255 4561 L
6255  389 mt 6255  442 L
%%IncludeResource: font Helvetica
/Helvetica /ISOLatin1Encoding 120 FMSR

6167 4797 mt 
(10) s
%%IncludeResource: font Helvetica
/Helvetica /ISOLatin1Encoding 80 FMSR

6300 4723 mt 
(2) s
 899 4615 mt  925 4615 L
6255 4615 mt 6228 4615 L
DO
 899 4615 mt 6255 4615 L
6255 4615 mt 6255 4615 L
SO
 899 4615 mt  952 4615 L
6255 4615 mt 6201 4615 L
%%IncludeResource: font Helvetica
/Helvetica /ISOLatin1Encoding 120 FMSR

 640 4659 mt 
(10) s
%%IncludeResource: font Helvetica
/Helvetica /ISOLatin1Encoding 80 FMSR

 773 4585 mt 
(-4) s
 899 4433 mt  925 4433 L
6255 4433 mt 6228 4433 L
DO
 899 4433 mt 6255 4433 L
6255 4433 mt 6255 4433 L
SO
 899 4326 mt  925 4326 L
6255 4326 mt 6228 4326 L
DO
 899 4326 mt 6255 4326 L
6255 4326 mt 6255 4326 L
SO
 899 4251 mt  925 4251 L
6255 4251 mt 6228 4251 L
DO
 899 4251 mt 6255 4251 L
6255 4251 mt 6255 4251 L
SO
 899 4193 mt  925 4193 L
6255 4193 mt 6228 4193 L
DO
 899 4193 mt 6255 4193 L
6255 4193 mt 6255 4193 L
SO
 899 4145 mt  925 4145 L
6255 4145 mt 6228 4145 L
DO
 899 4145 mt 6255 4145 L
6255 4145 mt 6255 4145 L
SO
 899 4104 mt  925 4104 L
6255 4104 mt 6228 4104 L
DO
 899 4104 mt 6255 4104 L
6255 4104 mt 6255 4104 L
SO
 899 4069 mt  925 4069 L
6255 4069 mt 6228 4069 L
DO
 899 4069 mt 6255 4069 L
6255 4069 mt 6255 4069 L
SO
 899 4038 mt  925 4038 L
6255 4038 mt 6228 4038 L
DO
 899 4038 mt 6255 4038 L
6255 4038 mt 6255 4038 L
SO
 899 4011 mt  925 4011 L
6255 4011 mt 6228 4011 L
DO
 899 4011 mt 6255 4011 L
6255 4011 mt 6255 4011 L
SO
 899 4011 mt  952 4011 L
6255 4011 mt 6201 4011 L
%%IncludeResource: font Helvetica
/Helvetica /ISOLatin1Encoding 120 FMSR

 640 4055 mt 
(10) s
%%IncludeResource: font Helvetica
/Helvetica /ISOLatin1Encoding 80 FMSR

 773 3981 mt 
(-3) s
 899 3829 mt  925 3829 L
6255 3829 mt 6228 3829 L
DO
 899 3829 mt 6255 3829 L
6255 3829 mt 6255 3829 L
SO
 899 3723 mt  925 3723 L
6255 3723 mt 6228 3723 L
DO
 899 3723 mt 6255 3723 L
6255 3723 mt 6255 3723 L
SO
 899 3647 mt  925 3647 L
6255 3647 mt 6228 3647 L
DO
 899 3647 mt 6255 3647 L
6255 3647 mt 6255 3647 L
SO
 899 3589 mt  925 3589 L
6255 3589 mt 6228 3589 L
DO
 899 3589 mt 6255 3589 L
6255 3589 mt 6255 3589 L
SO
 899 3541 mt  925 3541 L
6255 3541 mt 6228 3541 L
DO
 899 3541 mt 6255 3541 L
6255 3541 mt 6255 3541 L
SO
 899 3501 mt  925 3501 L
6255 3501 mt 6228 3501 L
DO
 899 3501 mt 6255 3501 L
6255 3501 mt 6255 3501 L
SO
 899 3466 mt  925 3466 L
6255 3466 mt 6228 3466 L
DO
 899 3466 mt 6255 3466 L
6255 3466 mt 6255 3466 L
SO
 899 3435 mt  925 3435 L
6255 3435 mt 6228 3435 L
DO
 899 3435 mt 6255 3435 L
6255 3435 mt 6255 3435 L
SO
 899 3407 mt  925 3407 L
6255 3407 mt 6228 3407 L
DO
 899 3407 mt 6255 3407 L
6255 3407 mt 6255 3407 L
SO
 899 3407 mt  952 3407 L
6255 3407 mt 6201 3407 L
%%IncludeResource: font Helvetica
/Helvetica /ISOLatin1Encoding 120 FMSR

 640 3451 mt 
(10) s
%%IncludeResource: font Helvetica
/Helvetica /ISOLatin1Encoding 80 FMSR

 773 3377 mt 
(-2) s
 899 3225 mt  925 3225 L
6255 3225 mt 6228 3225 L
DO
 899 3225 mt 6255 3225 L
6255 3225 mt 6255 3225 L
SO
 899 3119 mt  925 3119 L
6255 3119 mt 6228 3119 L
DO
 899 3119 mt 6255 3119 L
6255 3119 mt 6255 3119 L
SO
 899 3044 mt  925 3044 L
6255 3044 mt 6228 3044 L
DO
 899 3044 mt 6255 3044 L
6255 3044 mt 6255 3044 L
SO
 899 2985 mt  925 2985 L
6255 2985 mt 6228 2985 L
DO
 899 2985 mt 6255 2985 L
6255 2985 mt 6255 2985 L
SO
 899 2937 mt  925 2937 L
6255 2937 mt 6228 2937 L
DO
 899 2937 mt 6255 2937 L
6255 2937 mt 6255 2937 L
SO
 899 2897 mt  925 2897 L
6255 2897 mt 6228 2897 L
DO
 899 2897 mt 6255 2897 L
6255 2897 mt 6255 2897 L
SO
 899 2862 mt  925 2862 L
6255 2862 mt 6228 2862 L
DO
 899 2862 mt 6255 2862 L
6255 2862 mt 6255 2862 L
SO
 899 2831 mt  925 2831 L
6255 2831 mt 6228 2831 L
DO
 899 2831 mt 6255 2831 L
6255 2831 mt 6255 2831 L
SO
 899 2803 mt  925 2803 L
6255 2803 mt 6228 2803 L
DO
 899 2803 mt 6255 2803 L
6255 2803 mt 6255 2803 L
SO
 899 2803 mt  952 2803 L
6255 2803 mt 6201 2803 L
%%IncludeResource: font Helvetica
/Helvetica /ISOLatin1Encoding 120 FMSR

 640 2847 mt 
(10) s
%%IncludeResource: font Helvetica
/Helvetica /ISOLatin1Encoding 80 FMSR

 773 2773 mt 
(-1) s
 899 2622 mt  925 2622 L
6255 2622 mt 6228 2622 L
DO
 899 2622 mt 6255 2622 L
6255 2622 mt 6255 2622 L
SO
 899 2515 mt  925 2515 L
6255 2515 mt 6228 2515 L
DO
 899 2515 mt 6255 2515 L
6255 2515 mt 6255 2515 L
SO
 899 2440 mt  925 2440 L
6255 2440 mt 6228 2440 L
DO
 899 2440 mt 6255 2440 L
6255 2440 mt 6255 2440 L
SO
 899 2381 mt  925 2381 L
6255 2381 mt 6228 2381 L
DO
 899 2381 mt 6255 2381 L
6255 2381 mt 6255 2381 L
SO
 899 2334 mt  925 2334 L
6255 2334 mt 6228 2334 L
DO
 899 2334 mt 6255 2334 L
6255 2334 mt 6255 2334 L
SO
 899 2293 mt  925 2293 L
6255 2293 mt 6228 2293 L
DO
 899 2293 mt 6255 2293 L
6255 2293 mt 6255 2293 L
SO
 899 2258 mt  925 2258 L
6255 2258 mt 6228 2258 L
DO
 899 2258 mt 6255 2258 L
6255 2258 mt 6255 2258 L
SO
 899 2227 mt  925 2227 L
6255 2227 mt 6228 2227 L
DO
 899 2227 mt 6255 2227 L
6255 2227 mt 6255 2227 L
SO
 899 2200 mt  925 2200 L
6255 2200 mt 6228 2200 L
DO
 899 2200 mt 6255 2200 L
6255 2200 mt 6255 2200 L
SO
 899 2200 mt  952 2200 L
6255 2200 mt 6201 2200 L
%%IncludeResource: font Helvetica
/Helvetica /ISOLatin1Encoding 120 FMSR

 640 2244 mt 
(10) s
%%IncludeResource: font Helvetica
/Helvetica /ISOLatin1Encoding 80 FMSR

 773 2170 mt 
(0) s
 899 2018 mt  925 2018 L
6255 2018 mt 6228 2018 L
DO
 899 2018 mt 6255 2018 L
6255 2018 mt 6255 2018 L
SO
 899 1912 mt  925 1912 L
6255 1912 mt 6228 1912 L
DO
 899 1912 mt 6255 1912 L
6255 1912 mt 6255 1912 L
SO
 899 1836 mt  925 1836 L
6255 1836 mt 6228 1836 L
DO
 899 1836 mt 6255 1836 L
6255 1836 mt 6255 1836 L
SO
 899 1778 mt  925 1778 L
6255 1778 mt 6228 1778 L
DO
 899 1778 mt 6255 1778 L
6255 1778 mt 6255 1778 L
SO
 899 1730 mt  925 1730 L
6255 1730 mt 6228 1730 L
DO
 899 1730 mt 6255 1730 L
6255 1730 mt 6255 1730 L
SO
 899 1689 mt  925 1689 L
6255 1689 mt 6228 1689 L
DO
 899 1689 mt 6255 1689 L
6255 1689 mt 6255 1689 L
SO
 899 1654 mt  925 1654 L
6255 1654 mt 6228 1654 L
DO
 899 1654 mt 6255 1654 L
6255 1654 mt 6255 1654 L
SO
 899 1624 mt  925 1624 L
6255 1624 mt 6228 1624 L
DO
 899 1624 mt 6255 1624 L
6255 1624 mt 6255 1624 L
SO
 899 1596 mt  925 1596 L
6255 1596 mt 6228 1596 L
DO
 899 1596 mt 6255 1596 L
6255 1596 mt 6255 1596 L
SO
 899 1596 mt  952 1596 L
6255 1596 mt 6201 1596 L
%%IncludeResource: font Helvetica
/Helvetica /ISOLatin1Encoding 120 FMSR

 640 1640 mt 
(10) s
%%IncludeResource: font Helvetica
/Helvetica /ISOLatin1Encoding 80 FMSR

 773 1566 mt 
(1) s
 899 1414 mt  925 1414 L
6255 1414 mt 6228 1414 L
DO
 899 1414 mt 6255 1414 L
6255 1414 mt 6255 1414 L
SO
 899 1308 mt  925 1308 L
6255 1308 mt 6228 1308 L
DO
 899 1308 mt 6255 1308 L
6255 1308 mt 6255 1308 L
SO
 899 1232 mt  925 1232 L
6255 1232 mt 6228 1232 L
DO
 899 1232 mt 6255 1232 L
6255 1232 mt 6255 1232 L
SO
 899 1174 mt  925 1174 L
6255 1174 mt 6228 1174 L
DO
 899 1174 mt 6255 1174 L
6255 1174 mt 6255 1174 L
SO
 899 1126 mt  925 1126 L
6255 1126 mt 6228 1126 L
DO
 899 1126 mt 6255 1126 L
6255 1126 mt 6255 1126 L
SO
 899 1086 mt  925 1086 L
6255 1086 mt 6228 1086 L
DO
 899 1086 mt 6255 1086 L
6255 1086 mt 6255 1086 L
SO
 899 1051 mt  925 1051 L
6255 1051 mt 6228 1051 L
DO
 899 1051 mt 6255 1051 L
6255 1051 mt 6255 1051 L
SO
 899 1020 mt  925 1020 L
6255 1020 mt 6228 1020 L
DO
 899 1020 mt 6255 1020 L
6255 1020 mt 6255 1020 L
SO
 899  992 mt  925  992 L
6255  992 mt 6228  992 L
DO
 899  992 mt 6255  992 L
6255  992 mt 6255  992 L
SO
 899  992 mt  952  992 L
6255  992 mt 6201  992 L
%%IncludeResource: font Helvetica
/Helvetica /ISOLatin1Encoding 120 FMSR

 640 1036 mt 
(10) s
%%IncludeResource: font Helvetica
/Helvetica /ISOLatin1Encoding 80 FMSR

 773  962 mt 
(2) s
 899  810 mt  925  810 L
6255  810 mt 6228  810 L
DO
 899  810 mt 6255  810 L
6255  810 mt 6255  810 L
SO
 899  704 mt  925  704 L
6255  704 mt 6228  704 L
DO
 899  704 mt 6255  704 L
6255  704 mt 6255  704 L
SO
 899  629 mt  925  629 L
6255  629 mt 6228  629 L
DO
 899  629 mt 6255  629 L
6255  629 mt 6255  629 L
SO
 899  570 mt  925  570 L
6255  570 mt 6228  570 L
DO
 899  570 mt 6255  570 L
6255  570 mt 6255  570 L
SO
 899  522 mt  925  522 L
6255  522 mt 6228  522 L
DO
 899  522 mt 6255  522 L
6255  522 mt 6255  522 L
SO
 899  482 mt  925  482 L
6255  482 mt 6228  482 L
DO
 899  482 mt 6255  482 L
6255  482 mt 6255  482 L
SO
 899  447 mt  925  447 L
6255  447 mt 6228  447 L
DO
 899  447 mt 6255  447 L
6255  447 mt 6255  447 L
SO
 899  416 mt  925  416 L
6255  416 mt 6228  416 L
DO
 899  416 mt 6255  416 L
6255  416 mt 6255  416 L
SO
 899  389 mt  925  389 L
6255  389 mt 6228  389 L
DO
 899  389 mt 6255  389 L
6255  389 mt 6255  389 L
SO
 899  389 mt  952  389 L
6255  389 mt 6201  389 L
%%IncludeResource: font Helvetica
/Helvetica /ISOLatin1Encoding 120 FMSR

 640  433 mt 
(10) s
%%IncludeResource: font Helvetica
/Helvetica /ISOLatin1Encoding 80 FMSR

 773  359 mt 
(3) s
 899 4615 mt 6255 4615 L
 899  389 mt 6255  389 L
 899 4615 mt  899  389 L
6255 4615 mt 6255  389 L
gs 899 389 5357 4227 MR c np
/c8 { 0.000000 0.000000 1.000000 sr} bdef
c8
6 4 5 3 6 4 5 4 5 3 6 4 5 3 5 4 
6 4 5 3 5 4 6 4 5 3 6 4 5 3 5 4 
6 4 5 3 5 4 6 4 5 3 5 4 6 3 5 4 
6 4 5 3 5 4 6 4 5 3 5 4 6 3 5 4 
5 4 6 3 5 4 6 4 5 3 5 4 6 3 5 4 
5 4 6 3 5 4 5 4 6 3 5 4 5 4 6 3 
5 4 6 3 5 4 5 4 6 3 5 4 5 4 6 3 
5 4 5 3 6 4 5 4 6 3 5 4 5 4 6 3 
5 4 5 3 6 4 5 4 5 3 6 4 5 4 6 3 
5 4 5 4 6 3 5 4 5 3 6 4 5 4 5 3 
6 4 5 4 5 3 6 4 5 3 6 4 5 4 5 3 
6 4 5 4 5 3 6 4 5 4 5 3 6 4 5 3 
6 4 5 4 5 3 5724 3873 100 MP stroke
6 4 5 4 5 3 6 4 5 3 5 4 6 4 5 3 
6 4 5 4 5 3 6 4 5 4 5 3 6 4 5 3 
5 4 6 4 5 3 6 4 5 4 5 3 6 4 5 3 
5 4 6 4 5 3 5 4 6 4 5 3 5 4 6 4 
5 3 6 4 5 3 5 4 6 4 5 3 5 4 6 4 
5 3 5 4 6 4 5 3 6 4 5 3 5 4 6 4 
5 3 5 4 6 4 5 3 5 4 6 4 5 3 6 4 
5 4 5 3 6 4 5 3 5 4 6 4 5 3 5 4 
6 4 5 3 5 4 6 4 5 3 6 4 5 3 5 4 
6 4 5 3 5 4 6 4 5 3 5 4 6 4 5 3 
6 4 5 4 5 3 6 4 5 3 5 4 6 4 5 3 
5 4 6 4 5 3 6 4 5 4 5 3 6 4 5 4 
5 3 6 4 5 4 5193 3512 100 MP stroke
5 3 6 4 5 4 5 3 6 4 5 3 6 4 5 4 
5 3 6 4 5 4 5 3 6 4 5 4 5 3 6 4 
5 4 6 3 5 4 5 4 6 3 5 4 5 4 6 3 
5 4 5 4 6 3 5 4 6 4 5 3 5 4 6 4 
5 3 5 4 6 4 5 3 5 4 6 4 5 3 6 4 
5 4 5 3 6 4 5 4 5 3 6 4 5 4 5 3 
6 4 5 4 5 3 6 4 5 4 6 3 5 4 5 4 
6 3 5 4 5 4 6 3 5 4 5 4 6 3 5 4 
6 4 5 4 5 3 6 4 5 4 5 3 6 4 5 4 
5 3 6 4 5 4 6 3 5 4 5 4 6 4 5 3 
5 4 6 4 5 3 5 4 6 4 5 3 5 4 6 4 
5 4 6 3 5 4 5 4 6 3 5 4 5 4 6 4 
5 3 5 4 6 4 4662 3148 100 MP stroke
5 3 6 4 5 4 5 4 6 3 5 4 5 4 6 4 
5 3 5 4 6 4 5 4 6 3 5 4 5 4 6 3 
5 4 5 4 6 4 5 3 5 4 6 4 5 4 5 4 
6 3 5 4 6 4 5 4 5 3 6 4 5 4 5 4 
6 3 5 4 5 4 6 4 5 4 6 3 5 4 5 4 
6 4 5 4 5 3 6 4 5 4 5 4 6 4 5 3 
6 4 5 4 5 4 6 4 5 4 5 3 6 4 5 4 
5 4 6 4 5 4 6 4 5 3 5 4 6 4 5 4 
5 4 6 4 5 4 5 4 6 3 5 4 5 4 6 4 
5 4 6 4 5 4 5 4 6 4 5 4 5 3 6 4 
5 4 5 4 6 4 5 4 6 4 5 4 5 4 6 4 
5 4 5 4 6 4 5 4 5 4 6 4 5 4 6 4 
5 4 5 4 6 4 4131 2768 100 MP stroke
5 4 5 4 6 4 5 4 5 4 6 5 5 4 5 4 
6 4 5 4 6 4 5 4 5 4 6 4 5 5 5 4 
6 4 5 4 5 4 6 4 5 5 6 4 5 4 5 4 
6 5 5 4 5 4 6 4 5 5 5 4 6 4 5 4 
6 5 5 4 5 4 6 5 5 4 5 5 6 4 5 4 
5 5 6 4 5 5 5 4 6 5 5 4 6 5 5 4 
5 5 6 4 5 5 5 4 6 5 5 5 5 4 6 5 
5 5 6 4 5 5 5 5 6 4 5 5 5 5 6 5 
5 5 5 5 6 4 5 5 6 5 5 5 5 5 6 5 
5 5 5 5 6 5 5 6 5 5 6 5 5 5 6 5 
5 6 5 5 6 5 5 6 5 5 6 6 5 5 5 6 
6 5 5 6 5 5 6 6 5 6 6 6 5 5 5 6 
6 6 5 6 5 6 3601 2302 100 MP stroke
6 7 5 6 5 6 6 6 5 7 6 6 5 6 5 7 
6 7 5 6 5 7 6 7 5 7 5 7 6 7 5 8 
6 7 5 7 5 8 6 8 5 8 5 7 6 9 5 8 
5 8 6 9 5 8 5 9 6 9 5 10 6 9 5 10 
5 9 6 11 5 10 5 11 6 11 5 11 5 12 6 12 
5 12 6 13 5 13 5 14 6 14 5 15 5 16 6 16 
5 18 5 18 6 19 5 21 6 22 5 23 5 26 6 28 
5 31 5 34 6 39 5 46 5 53 6 67 5 88 6 131 
5 256 5 37 6 -273 5 -133 5 -87 6 -65 5 -51 5 -42 
6 -36 5 -31 5 -27 6 -25 5 -22 6 -20 5 -19 5 -17 
6 -16 5 -14 5 -14 6 -13 5 -12 5 -11 6 -11 5 -10 
6 -10 5 -9 5 -9 6 -9 5 -8 5 -7 6 -8 5 -7 
5 -6 6 -7 5 -6 3070 1939 100 MP stroke
6 -6 5 -6 5 -6 6 -5 5 -5 5 -6 6 -4 5 -5 
5 -5 6 -4 5 -5 5 -4 6 -4 5 -4 6 -4 5 -3 
5 -4 6 -4 5 -3 5 -3 6 -4 5 -3 5 -3 6 -3 
5 -3 6 -3 5 -3 5 -2 6 -3 5 -3 5 -2 6 -3 
5 -2 5 -3 6 -2 5 -2 6 -2 5 -3 5 -2 6 -2 
5 -2 5 -2 6 -2 5 -2 5 -2 6 -1 5 -2 5 -2 
6 -2 5 -1 6 -2 5 -2 5 -1 6 -2 5 -1 5 -2 
6 -1 5 -2 5 -1 6 -1 5 -2 6 -1 5 -1 5 -2 
6 -1 5 -1 5 -1 6 -2 5 -1 5 -1 6 -1 5 -1 
6 -1 5 -1 5 -1 6 -1 5 -1 5 -1 6 -1 5 -1 
5 -1 6 -1 5 -1 6 -1 5 -1 5 -1 6 -1 5 -1 
5 0 6 -1 5 -1 5 -1 6 -1 5 0 5 -1 6 -1 
5 0 6 -1 5 -1 2539 2154 100 MP stroke
5 -1 6 0 5 -1 5 -1 6 0 5 -1 5 0 6 -1 
5 -1 6 0 5 -1 5 0 6 -1 5 -1 5 0 6 -1 
5 0 5 -1 6 0 5 -1 6 0 5 -1 5 0 6 -1 
5 0 5 -1 6 0 5 0 5 -1 6 0 5 -1 5 0 
6 -1 5 0 6 0 5 -1 5 0 6 -1 5 0 5 0 
6 -1 5 0 5 0 6 -1 5 0 6 0 5 -1 5 0 
6 0 5 -1 5 0 6 0 5 -1 5 0 6 0 5 -1 
6 0 5 0 5 0 6 -1 5 0 5 0 6 0 5 -1 
5 0 6 0 5 0 5 -1 6 0 5 0 6 0 5 -1 
5 0 6 0 5 0 5 -1 6 0 5 0 5 0 6 0 
5 -1 6 0 5 0 5 0 6 0 5 -1 5 0 6 0 
5 0 5 0 6 0 5 -1 6 0 5 0 5 0 6 0 
5 0 5 -1 6 0 2008 2189 100 MP stroke
5 0 5 0 6 0 5 0 6 0 5 -1 5 0 6 0 
5 0 5 0 6 0 5 0 5 -1 6 0 5 0 5 0 
6 0 5 0 6 0 5 0 5 -1 6 0 5 0 5 0 
6 0 5 0 5 0 6 0 5 0 6 0 5 -1 5 0 
6 0 5 0 5 0 6 0 5 0 5 0 6 0 5 0 
6 -1 5 0 5 0 6 0 5 0 5 0 6 0 5 0 
5 0 6 0 5 0 5 0 6 0 5 -1 6 0 5 0 
5 0 6 0 5 0 5 0 6 0 5 0 5 0 6 0 
5 0 6 0 5 0 5 0 6 0 5 -1 5 0 6 0 
5 0 5 0 6 0 5 0 6 0 5 0 5 0 6 0 
5 0 5 0 6 0 5 0 5 0 6 0 5 0 5 0 
6 -1 5 0 6 0 5 0 5 0 6 0 5 0 5 0 
6 0 5 0 5 0 1478 2197 100 MP stroke
6 0 5 0 6 0 5 0 5 0 6 0 5 0 5 0 
6 0 5 0 5 0 6 0 5 0 6 0 5 0 5 0 
6 0 5 -1 5 0 6 0 5 0 5 0 6 0 5 0 
6 0 5 0 5 0 6 0 5 0 5 0 6 0 5 0 
5 0 6 0 5 0 5 0 6 0 5 0 6 0 5 0 
5 0 6 0 5 0 5 0 6 0 5 0 5 0 6 0 
5 0 6 0 5 0 5 0 6 0 5 0 5 0 6 0 
5 0 5 0 6 0 5 0 6 0 5 0 5 -1 6 0 
5 0 5 0 6 0 5 0 5 0 6 0 5 0 5 0 
6 0 5 0 6 0 5 0 5 0 6 0 5 0 5 0 
6 0 5 0 5 0 6 0 5 0 6 0 5 0 5 0 
6 0 5 0 5 0 6 0 5 0 5 0 6 0 5 0 
6 0 5 0 5 0 947 2199 100 MP stroke
6 0 5 0 5 0 6 0 5 0 5 0 6 0 5 0 
5 0 899 2199 10 MP stroke
DA
/c9 { 1.000000 0.000000 0.000000 sr} bdef
c9
6 4 5 4 6 3 5 4 5 3 6 4 5 4 5 3 
6 4 5 4 5 3 6 4 5 4 6 3 5 4 5 4 
6 3 5 4 5 3 6 4 5 4 5 3 6 4 5 4 
6 3 5 4 5 4 6 3 5 4 5 4 6 3 5 4 
5 4 6 3 5 4 6 3 5 4 5 4 6 3 5 4 
5 4 6 3 5 4 5 4 6 3 5 4 5 4 6 3 
5 4 6 4 5 3 5 4 6 4 5 3 5 4 6 4 
5 3 5 4 6 4 5 3 6 4 5 4 5 3 6 4 
5 3 5 4 6 4 5 3 5 4 6 4 5 3 6 4 
5 4 5 3 6 4 5 4 5 3 6 4 5 4 5 3 
6 4 5 4 5 3 6 4 5 4 6 3 5 4 5 4 
6 4 5 3 5 4 6 4 5 3 5 4 6 4 5 3 
6 4 5 4 5 3 5724 3288 100 MP stroke
6 4 5 4 5 3 6 4 5 4 5 3 6 4 5 4 
6 3 5 4 5 4 6 4 5 3 5 4 6 4 5 3 
5 4 6 4 5 3 6 4 5 4 5 4 6 3 5 4 
5 4 6 3 5 4 5 4 6 4 5 3 5 4 6 4 
5 3 6 4 5 4 5 4 6 3 5 4 5 4 6 3 
5 4 5 4 6 4 5 3 6 4 5 4 5 4 6 3 
5 4 5 4 6 4 5 3 5 4 6 4 5 3 6 4 
5 4 5 4 6 4 5 3 5 4 6 4 5 4 5 3 
6 4 5 4 5 4 6 3 5 4 6 4 5 4 5 4 
6 3 5 4 5 4 6 4 5 3 5 4 6 4 5 4 
6 4 5 3 5 4 6 4 5 4 5 4 6 4 5 3 
5 4 6 4 5 4 6 4 5 4 5 3 6 4 5 4 
5 4 6 4 5 4 5193 2916 100 MP stroke
5 4 6 3 5 4 5 4 6 4 5 4 6 4 5 4 
5 4 6 3 5 4 5 4 6 4 5 4 5 4 6 4 
5 4 6 4 5 4 5 4 6 4 5 4 5 4 6 4 
5 3 5 4 6 4 5 4 6 4 5 4 5 4 6 4 
5 4 5 4 6 4 5 4 5 4 6 5 5 4 6 4 
5 4 5 4 6 4 5 4 5 4 6 4 5 4 5 4 
6 4 5 5 5 4 6 4 5 4 6 4 5 4 5 4 
6 5 5 4 5 4 6 4 5 4 5 5 6 4 5 4 
6 4 5 5 5 4 6 4 5 5 5 4 6 4 5 5 
5 4 6 4 5 5 6 4 5 4 5 5 6 4 5 5 
5 4 6 5 5 4 5 5 6 4 5 5 5 4 6 5 
5 4 6 5 5 5 5 4 6 5 5 4 5 5 6 5 
5 5 5 4 6 5 4662 2502 100 MP stroke
5 5 6 5 5 4 5 5 6 5 5 5 5 5 6 5 
5 5 5 5 6 5 5 5 6 5 5 5 5 5 6 5 
5 6 5 5 6 5 5 5 5 6 6 5 5 5 5 6 
6 5 5 6 6 5 5 6 5 6 6 5 5 6 5 6 
6 6 5 5 5 6 6 6 5 6 6 6 5 7 5 6 
6 6 5 6 5 7 6 6 5 7 5 6 6 7 5 7 
6 7 5 6 5 7 6 8 5 7 5 7 6 7 5 8 
5 8 6 7 5 8 6 8 5 8 5 9 6 8 5 9 
5 8 6 9 5 9 5 10 6 9 5 10 5 10 6 10 
5 11 6 10 5 11 5 12 6 12 5 12 5 12 6 13 
5 14 5 14 6 14 5 15 6 16 5 17 5 18 6 18 
5 20 5 21 6 22 5 25 5 26 6 29 5 32 6 36 
5 41 5 47 6 58 4131 1462 100 MP stroke
5 73 5 99 6 156 5 358 5 -251 6 -203 5 -113 5 -78 
6 -59 5 -48 6 -40 5 -34 5 -30 6 -26 5 -24 5 -21 
6 -20 5 -18 5 -16 6 -16 5 -14 6 -13 5 -13 5 -12 
6 -11 5 -11 5 -10 6 -9 5 -9 5 -9 6 -8 5 -8 
6 -8 5 -7 5 -7 6 -7 5 -6 5 -6 6 -6 5 -6 
5 -6 6 -5 5 -5 5 -5 6 -5 5 -5 6 -4 5 -5 
5 -4 6 -4 5 -4 5 -4 6 -4 5 -4 5 -3 6 -4 
5 -3 6 -4 5 -3 5 -3 6 -3 5 -3 5 -3 6 -3 
5 -3 5 -2 6 -3 5 -3 6 -2 5 -3 5 -2 6 -2 
5 -3 5 -2 6 -2 5 -2 5 -2 6 -2 5 -2 6 -2 
5 -2 5 -2 6 -2 5 -2 5 -2 6 -1 5 -2 5 -2 
6 -2 5 -1 5 -2 6 -1 5 -2 6 -1 5 -2 5 -1 
6 -2 5 -1 5 -1 3601 2117 100 MP stroke
6 -2 5 -1 5 -1 6 -1 5 -2 6 -1 5 -1 5 -1 
6 -1 5 -1 5 -2 6 -1 5 -1 5 -1 6 -1 5 -1 
6 -1 5 -1 5 -1 6 -1 5 -1 5 -1 6 0 5 -1 
5 -1 6 -1 5 -1 5 -1 6 0 5 -1 6 -1 5 -1 
5 -1 6 0 5 -1 5 -1 6 0 5 -1 5 -1 6 0 
5 -1 6 -1 5 0 5 -1 6 -1 5 0 5 -1 6 0 
5 -1 5 -1 6 0 5 -1 6 0 5 -1 5 0 6 -1 
5 0 5 -1 6 0 5 -1 5 0 6 -1 5 0 6 -1 
5 0 5 -1 6 0 5 0 5 -1 6 0 5 -1 5 0 
6 -1 5 0 5 0 6 -1 5 0 6 0 5 -1 5 0 
6 -1 5 0 5 0 6 -1 5 0 5 0 6 -1 5 0 
6 0 5 0 5 -1 6 0 5 0 5 -1 6 0 5 0 
5 0 6 -1 5 0 3070 2181 100 MP stroke
6 0 5 -1 5 0 6 0 5 0 5 -1 6 0 5 0 
5 0 6 -1 5 0 5 0 6 0 5 0 6 -1 5 0 
5 0 6 0 5 0 5 -1 6 0 5 0 5 0 6 0 
5 -1 6 0 5 0 5 0 6 0 5 0 5 -1 6 0 
5 0 5 0 6 0 5 0 6 -1 5 0 5 0 6 0 
5 0 5 0 6 -1 5 0 5 0 6 0 5 0 5 0 
6 0 5 0 6 -1 5 0 5 0 6 0 5 0 5 0 
6 0 5 0 5 -1 6 0 5 0 6 0 5 0 5 0 
6 0 5 0 5 0 6 -1 5 0 5 0 6 0 5 0 
6 0 5 0 5 0 6 0 5 0 5 0 6 -1 5 0 
5 0 6 0 5 0 6 0 5 0 5 0 6 0 5 0 
5 0 6 0 5 0 5 -1 6 0 5 0 5 0 6 0 
5 0 6 0 5 0 2539 2195 100 MP stroke
5 0 6 0 5 0 5 0 6 0 5 0 5 0 6 -1 
5 0 6 0 5 0 5 0 6 0 5 0 5 0 6 0 
5 0 5 0 6 0 5 0 6 0 5 0 5 0 6 0 
5 0 5 0 6 0 5 -1 5 0 6 0 5 0 5 0 
6 0 5 0 6 0 5 0 5 0 6 0 5 0 5 0 
6 0 5 0 5 0 6 0 5 0 6 0 5 0 5 0 
6 0 5 0 5 0 6 0 5 0 5 0 6 0 5 -1 
6 0 5 0 5 0 6 0 5 0 5 0 6 0 5 0 
5 0 6 0 5 0 5 0 6 0 5 0 6 0 5 0 
5 0 6 0 5 0 5 0 6 0 5 0 5 0 6 0 
5 0 6 0 5 0 5 0 6 0 5 0 5 0 6 0 
5 0 5 0 6 0 5 0 6 0 5 0 5 0 6 0 
5 0 5 0 6 0 2008 2198 100 MP stroke
5 0 5 -1 6 0 5 0 6 0 5 0 5 0 6 0 
5 0 5 0 6 0 5 0 5 0 6 0 5 0 5 0 
6 0 5 0 6 0 5 0 5 0 6 0 5 0 5 0 
6 0 5 0 5 0 6 0 5 0 6 0 5 0 5 0 
6 0 5 0 5 0 6 0 5 0 5 0 6 0 5 0 
6 0 5 0 5 0 6 0 5 0 5 0 6 0 5 0 
5 0 6 0 5 0 5 0 6 0 5 0 6 0 5 0 
5 0 6 0 5 0 5 0 6 0 5 0 5 0 6 0 
5 0 6 0 5 0 5 0 6 0 5 0 5 0 6 0 
5 0 5 0 6 0 5 0 6 0 5 0 5 0 6 0 
5 0 5 0 6 0 5 0 5 0 6 0 5 0 5 0 
6 0 5 0 6 0 5 0 5 0 6 0 5 0 5 0 
6 0 5 0 5 0 1478 2199 100 MP stroke
6 0 5 0 6 0 5 0 5 0 6 0 5 0 5 0 
6 0 5 0 5 0 6 0 5 0 6 0 5 0 5 0 
6 0 5 0 5 0 6 0 5 0 5 0 6 0 5 0 
6 0 5 0 5 0 6 0 5 0 5 0 6 0 5 0 
5 0 6 0 5 0 5 0 6 0 5 0 6 0 5 0 
5 0 6 0 5 0 5 0 6 0 5 0 5 0 6 0 
5 0 6 0 5 0 5 0 6 -1 5 0 5 0 6 0 
5 0 5 0 6 0 5 0 6 0 5 0 5 0 6 0 
5 0 5 0 6 0 5 0 5 0 6 0 5 0 5 0 
6 0 5 0 6 0 5 0 5 0 6 0 5 0 5 0 
6 0 5 0 5 0 6 0 5 0 6 0 5 0 5 0 
6 0 5 0 5 0 6 0 5 0 5 0 6 0 5 0 
6 0 5 0 5 0 947 2200 100 MP stroke
6 0 5 0 5 0 6 0 5 0 5 0 6 0 5 0 
5 0 899 2200 10 MP stroke
DD
/c10 { 0.000000 1.000000 0.000000 sr} bdef
c10
6 4 5 3 6 4 5 4 5 4 6 3 5 4 5 4 
6 4 5 4 5 3 6 4 5 4 6 4 5 3 5 4 
6 4 5 4 5 4 6 3 5 4 5 4 6 4 5 4 
6 3 5 4 5 4 6 4 5 4 5 4 6 3 5 4 
5 4 6 4 5 4 6 4 5 4 5 3 6 4 5 4 
5 4 6 4 5 4 5 4 6 3 5 4 5 4 6 4 
5 4 6 4 5 4 5 4 6 4 5 4 5 3 6 4 
5 4 5 4 6 4 5 4 6 4 5 4 5 4 6 4 
5 4 5 4 6 4 5 4 5 4 6 4 5 4 6 4 
5 4 5 4 6 4 5 4 5 4 6 4 5 4 5 4 
6 4 5 4 5 4 6 5 5 4 6 4 5 4 5 4 
6 4 5 4 5 4 6 4 5 5 5 4 6 4 5 4 
6 4 5 5 5 4 5724 2676 100 MP stroke
6 4 5 4 5 4 6 5 5 4 5 4 6 4 5 5 
6 4 5 4 5 5 6 4 5 4 5 5 6 4 5 5 
5 4 6 4 5 5 6 4 5 5 5 4 6 5 5 4 
5 5 6 4 5 5 5 4 6 5 5 4 5 5 6 5 
5 4 6 5 5 5 5 4 6 5 5 5 5 5 6 4 
5 5 5 5 6 5 5 5 6 5 5 4 5 5 6 5 
5 5 5 5 6 5 5 5 5 6 6 5 5 5 6 5 
5 5 5 5 6 6 5 5 5 5 6 6 5 5 5 6 
6 5 5 6 5 5 6 6 5 6 6 5 5 6 5 6 
6 6 5 6 5 6 6 6 5 6 5 6 6 6 5 6 
6 7 5 6 5 6 6 7 5 6 5 7 6 7 5 7 
5 7 6 7 5 7 6 7 5 7 5 8 6 7 5 8 
5 7 6 8 5 8 5193 2148 100 MP stroke
5 8 6 9 5 8 5 9 6 8 5 9 6 9 5 10 
5 9 6 10 5 10 5 10 6 10 5 11 5 11 6 11 
5 12 6 12 5 13 5 13 6 13 5 14 5 14 6 16 
5 15 5 17 6 17 5 19 6 19 5 21 5 23 6 24 
5 26 5 28 6 32 5 35 5 40 6 47 5 57 6 70 
5 95 5 146 6 318 5 -149 5 -223 6 -119 5 -81 5 -62 
6 -48 5 -41 5 -35 6 -30 5 -27 6 -24 5 -22 5 -19 
6 -19 5 -16 5 -16 6 -14 5 -14 5 -13 6 -12 5 -11 
6 -10 5 -11 5 -9 6 -9 5 -9 5 -8 6 -8 5 -8 
5 -7 6 -7 5 -7 6 -6 5 -7 5 -6 6 -5 5 -6 
5 -5 6 -6 5 -5 5 -5 6 -4 5 -5 5 -4 6 -5 
5 -4 6 -4 5 -4 5 -4 6 -3 5 -4 5 -3 6 -4 
5 -3 5 -3 6 -4 4662 2037 100 MP stroke
5 -3 6 -3 5 -3 5 -3 6 -2 5 -3 5 -3 6 -2 
5 -3 5 -2 6 -3 5 -2 6 -2 5 -3 5 -2 6 -2 
5 -2 5 -2 6 -2 5 -2 5 -2 6 -2 5 -2 5 -2 
6 -2 5 -1 6 -2 5 -2 5 -1 6 -2 5 -2 5 -1 
6 -2 5 -1 5 -2 6 -1 5 -1 6 -2 5 -1 5 -1 
6 -2 5 -1 5 -1 6 -2 5 -1 5 -1 6 -1 5 -1 
6 -1 5 -1 5 -2 6 -1 5 -1 5 -1 6 -1 5 -1 
5 -1 6 -1 5 -1 6 0 5 -1 5 -1 6 -1 5 -1 
5 -1 6 -1 5 -1 5 0 6 -1 5 -1 5 -1 6 0 
5 -1 6 -1 5 -1 5 0 6 -1 5 -1 5 0 6 -1 
5 -1 5 0 6 -1 5 -1 6 0 5 -1 5 0 6 -1 
5 -1 5 0 6 -1 5 0 5 -1 6 0 5 -1 6 0 
5 -1 5 0 6 -1 4131 2167 100 MP stroke
5 0 5 -1 6 0 5 -1 5 0 6 -1 5 0 5 0 
6 -1 5 0 6 -1 5 0 5 0 6 -1 5 0 5 -1 
6 0 5 0 5 -1 6 0 5 0 6 -1 5 0 5 0 
6 -1 5 0 5 0 6 -1 5 0 5 0 6 -1 5 0 
6 0 5 -1 5 0 6 0 5 0 5 -1 6 0 5 0 
5 -1 6 0 5 0 5 0 6 -1 5 0 6 0 5 0 
5 0 6 -1 5 0 5 0 6 0 5 -1 5 0 6 0 
5 0 6 0 5 -1 5 0 6 0 5 0 5 0 6 -1 
5 0 5 0 6 0 5 0 6 0 5 -1 5 0 6 0 
5 0 5 0 6 0 5 -1 5 0 6 0 5 0 6 0 
5 0 5 -1 6 0 5 0 5 0 6 0 5 0 5 0 
6 0 5 -1 5 0 6 0 5 0 6 0 5 0 5 0 
6 0 5 -1 5 0 3601 2192 100 MP stroke
6 0 5 0 5 0 6 0 5 0 6 0 5 0 5 -1 
6 0 5 0 5 0 6 0 5 0 5 0 6 0 5 0 
6 0 5 0 5 -1 6 0 5 0 5 0 6 0 5 0 
5 0 6 0 5 0 5 0 6 0 5 0 6 0 5 -1 
5 0 6 0 5 0 5 0 6 0 5 0 5 0 6 0 
5 0 6 0 5 0 5 0 6 0 5 0 5 -1 6 0 
5 0 5 0 6 0 5 0 6 0 5 0 5 0 6 0 
5 0 5 0 6 0 5 0 5 0 6 0 5 0 6 0 
5 0 5 0 6 -1 5 0 5 0 6 0 5 0 5 0 
6 0 5 0 5 0 6 0 5 0 6 0 5 0 5 0 
6 0 5 0 5 0 6 0 5 0 5 0 6 0 5 0 
6 0 5 0 5 0 6 0 5 0 5 0 6 -1 5 0 
5 0 6 0 5 0 3070 2198 100 MP stroke
6 0 5 0 5 0 6 0 5 0 5 0 6 0 5 0 
5 0 6 0 5 0 5 0 6 0 5 0 6 0 5 0 
5 0 6 0 5 0 5 0 6 0 5 0 5 0 6 0 
5 0 6 0 5 0 5 0 6 0 5 0 5 0 6 0 
5 0 5 0 6 0 5 0 6 0 5 0 5 0 6 0 
5 -1 5 0 6 0 5 0 5 0 6 0 5 0 5 0 
6 0 5 0 6 0 5 0 5 0 6 0 5 0 5 0 
6 0 5 0 5 0 6 0 5 0 6 0 5 0 5 0 
6 0 5 0 5 0 6 0 5 0 5 0 6 0 5 0 
6 0 5 0 5 0 6 0 5 0 5 0 6 0 5 0 
5 0 6 0 5 0 6 0 5 0 5 0 6 0 5 0 
5 0 6 0 5 0 5 0 6 0 5 0 5 0 6 0 
5 0 6 0 5 0 2539 2199 100 MP stroke
5 0 6 0 5 0 5 0 6 0 5 0 5 0 6 0 
5 0 6 0 5 0 5 0 6 0 5 0 5 0 6 0 
5 0 5 0 6 0 5 0 6 0 5 0 5 0 6 0 
5 0 5 0 6 0 5 0 5 0 6 0 5 0 5 0 
6 0 5 0 6 0 5 0 5 0 6 0 5 0 5 0 
6 0 5 0 5 0 6 0 5 0 6 0 5 0 5 0 
6 0 5 0 5 0 6 0 5 0 5 0 6 0 5 0 
6 0 5 0 5 0 6 0 5 0 5 0 6 0 5 0 
5 0 6 0 5 0 5 0 6 0 5 0 6 0 5 0 
5 0 6 0 5 0 5 0 6 0 5 0 5 0 6 0 
5 0 6 0 5 0 5 0 6 0 5 0 5 0 6 0 
5 0 5 0 6 0 5 -1 6 0 5 0 5 0 6 0 
5 0 5 0 6 0 2008 2200 100 MP stroke
5 0 5 0 6 0 5 0 6 0 5 0 5 0 6 0 
5 0 5 0 6 0 5 0 5 0 6 0 5 0 5 0 
6 0 5 0 6 0 5 0 5 0 6 0 5 0 5 0 
6 0 5 0 5 0 6 0 5 0 6 0 5 0 5 0 
6 0 5 0 5 0 6 0 5 0 5 0 6 0 5 0 
6 0 5 0 5 0 6 0 5 0 5 0 6 0 5 0 
5 0 6 0 5 0 5 0 6 0 5 0 6 0 5 0 
5 0 6 0 5 0 5 0 6 0 5 0 5 0 6 0 
5 0 6 0 5 0 5 0 6 0 5 0 5 0 6 0 
5 0 5 0 6 0 5 0 6 0 5 0 5 0 6 0 
5 0 5 0 6 0 5 0 5 0 6 0 5 0 5 0 
6 0 5 0 6 0 5 0 5 0 6 0 5 0 5 0 
6 0 5 0 5 0 1478 2200 100 MP stroke
6 0 5 0 6 0 5 0 5 0 6 0 5 0 5 0 
6 0 5 0 5 0 6 0 5 0 6 0 5 0 5 0 
6 0 5 0 5 0 6 0 5 0 5 0 6 0 5 0 
6 0 5 0 5 0 6 0 5 0 5 0 6 0 5 0 
5 0 6 0 5 0 5 0 6 0 5 0 6 0 5 0 
5 0 6 0 5 0 5 0 6 0 5 0 5 0 6 0 
5 0 6 0 5 0 5 0 6 0 5 0 5 0 6 0 
5 0 5 0 6 0 5 0 6 0 5 0 5 0 6 0 
5 0 5 0 6 0 5 0 5 0 6 0 5 0 5 0 
6 0 5 0 6 0 5 0 5 0 6 0 5 0 5 0 
6 0 5 0 5 0 6 0 5 0 6 0 5 0 5 0 
6 0 5 0 5 0 6 0 5 0 5 0 6 0 5 0 
6 0 5 0 5 0 947 2200 100 MP stroke
6 0 5 0 5 0 6 0 5 0 5 0 6 0 5 0 
5 0 899 2200 10 MP stroke
gr

c10
DD
0 sg
%%IncludeResource: font Helvetica
/Helvetica /ISOLatin1Encoding 120 FMSR

3559 4940 mt 
(f) s
 558 2634 mt  -90 rotate
(|H\(f\)|) s
90 rotate
2465  294 mt 
(Risposta in frequenza di filtri a Q costante) s
SO

end %%Color Dict

eplot
%%EndObject

epage
end

showpage

%%Trailer
%%EOF
