%!PS-Adobe-2.0 EPSF-1.2
%%Creator: MATLAB, The Mathworks, Inc. Version 7.5.0.338 (R2007b). Operating System: Linux 2.6.35-32-generic #67-Ubuntu SMP Mon Mar 5 19:39:49 UTC 2012 x86_64.
%%Title: ./filtri_chebyshev-II_zoom.eps
%%CreationDate: 04/20/2012  16:44:40
%%DocumentNeededFonts: Helvetica
%%DocumentProcessColors: Cyan Magenta Yellow Black
%%Extensions: CMYK
%%Pages: 1
%%BoundingBox:    43   196   543   608
%%EndComments

%%BeginProlog
% MathWorks dictionary
/MathWorks 160 dict begin
% definition operators
/bdef {bind def} bind def
/ldef {load def} bind def
/xdef {exch def} bdef
/xstore {exch store} bdef
% operator abbreviations
/c  /clip ldef
/cc /concat ldef
/cp /closepath ldef
/gr /grestore ldef
/gs /gsave ldef
/mt /moveto ldef
/np /newpath ldef
/cm /currentmatrix ldef
/sm /setmatrix ldef
/rm /rmoveto ldef
/rl /rlineto ldef
/s {show newpath} bdef
/sc {setcmykcolor} bdef
/sr /setrgbcolor ldef
/sg /setgray ldef
/w /setlinewidth ldef
/j /setlinejoin ldef
/cap /setlinecap ldef
/rc {rectclip} bdef
/rf {rectfill} bdef
% page state control
/pgsv () def
/bpage {/pgsv save def} bdef
/epage {pgsv restore} bdef
/bplot /gsave ldef
/eplot {stroke grestore} bdef
% orientation switch
/portraitMode 0 def /landscapeMode 1 def /rotateMode 2 def
% coordinate system mappings
/dpi2point 0 def
% font control
/FontSize 0 def
/FMS {/FontSize xstore findfont [FontSize 0 0 FontSize neg 0 0]
  makefont setfont} bdef
/reencode {exch dup where {pop load} {pop StandardEncoding} ifelse
  exch dup 3 1 roll findfont dup length dict begin
  { 1 index /FID ne {def}{pop pop} ifelse } forall
  /Encoding exch def currentdict end definefont pop} bdef
/isroman {findfont /CharStrings get /Agrave known} bdef
/FMSR {3 1 roll 1 index dup isroman {reencode} {pop pop} ifelse
  exch FMS} bdef
/csm {1 dpi2point div -1 dpi2point div scale neg translate
 dup landscapeMode eq {pop -90 rotate}
  {rotateMode eq {90 rotate} if} ifelse} bdef
% line types: solid, dotted, dashed, dotdash
/SO { [] 0 setdash } bdef
/DO { [.5 dpi2point mul 4 dpi2point mul] 0 setdash } bdef
/DA { [6 dpi2point mul] 0 setdash } bdef
/DD { [.5 dpi2point mul 4 dpi2point mul 6 dpi2point mul 4
  dpi2point mul] 0 setdash } bdef
% macros for lines and objects
/L {lineto stroke} bdef
/MP {3 1 roll moveto 1 sub {rlineto} repeat} bdef
/AP {{rlineto} repeat} bdef
/PDlw -1 def
/W {/PDlw currentlinewidth def setlinewidth} def
/PP {closepath eofill} bdef
/DP {closepath stroke} bdef
/MR {4 -2 roll moveto dup  0 exch rlineto exch 0 rlineto
  neg 0 exch rlineto closepath} bdef
/FR {MR stroke} bdef
/PR {MR fill} bdef
/L1i {{currentfile picstr readhexstring pop} image} bdef
/tMatrix matrix def
/MakeOval {newpath tMatrix currentmatrix pop translate scale
0 0 1 0 360 arc tMatrix setmatrix} bdef
/FO {MakeOval stroke} bdef
/PO {MakeOval fill} bdef
/PD {currentlinewidth 2 div 0 360 arc fill
   PDlw -1 eq not {PDlw w /PDlw -1 def} if} def
/FA {newpath tMatrix currentmatrix pop translate scale
  0 0 1 5 -2 roll arc tMatrix setmatrix stroke} bdef
/PA {newpath tMatrix currentmatrix pop	translate 0 0 moveto scale
  0 0 1 5 -2 roll arc closepath tMatrix setmatrix fill} bdef
/FAn {newpath tMatrix currentmatrix pop translate scale
  0 0 1 5 -2 roll arcn tMatrix setmatrix stroke} bdef
/PAn {newpath tMatrix currentmatrix pop translate 0 0 moveto scale
  0 0 1 5 -2 roll arcn closepath tMatrix setmatrix fill} bdef
/vradius 0 def /hradius 0 def /lry 0 def
/lrx 0 def /uly 0 def /ulx 0 def /rad 0 def
/MRR {/vradius xdef /hradius xdef /lry xdef /lrx xdef /uly xdef
  /ulx xdef newpath tMatrix currentmatrix pop ulx hradius add uly
  vradius add translate hradius vradius scale 0 0 1 180 270 arc 
  tMatrix setmatrix lrx hradius sub uly vradius add translate
  hradius vradius scale 0 0 1 270 360 arc tMatrix setmatrix
  lrx hradius sub lry vradius sub translate hradius vradius scale
  0 0 1 0 90 arc tMatrix setmatrix ulx hradius add lry vradius sub
  translate hradius vradius scale 0 0 1 90 180 arc tMatrix setmatrix
  closepath} bdef
/FRR {MRR stroke } bdef
/PRR {MRR fill } bdef
/MlrRR {/lry xdef /lrx xdef /uly xdef /ulx xdef /rad lry uly sub 2 div def
  newpath tMatrix currentmatrix pop ulx rad add uly rad add translate
  rad rad scale 0 0 1 90 270 arc tMatrix setmatrix lrx rad sub lry rad
  sub translate rad rad scale 0 0 1 270 90 arc tMatrix setmatrix
  closepath} bdef
/FlrRR {MlrRR stroke } bdef
/PlrRR {MlrRR fill } bdef
/MtbRR {/lry xdef /lrx xdef /uly xdef /ulx xdef /rad lrx ulx sub 2 div def
  newpath tMatrix currentmatrix pop ulx rad add uly rad add translate
  rad rad scale 0 0 1 180 360 arc tMatrix setmatrix lrx rad sub lry rad
  sub translate rad rad scale 0 0 1 0 180 arc tMatrix setmatrix
  closepath} bdef
/FtbRR {MtbRR stroke } bdef
/PtbRR {MtbRR fill } bdef
/stri 6 array def /dtri 6 array def
/smat 6 array def /dmat 6 array def
/tmat1 6 array def /tmat2 6 array def /dif 3 array def
/asub {/ind2 exch def /ind1 exch def dup dup
  ind1 get exch ind2 get sub exch } bdef
/tri_to_matrix {
  2 0 asub 3 1 asub 4 0 asub 5 1 asub
  dup 0 get exch 1 get 7 -1 roll astore } bdef
/compute_transform {
  dmat dtri tri_to_matrix tmat1 invertmatrix 
  smat stri tri_to_matrix tmat2 concatmatrix } bdef
/ds {stri astore pop} bdef
/dt {dtri astore pop} bdef
/db {2 copy /cols xdef /rows xdef mul dup 3 mul string
  currentfile exch readhexstring pop
  dup 0 3 index getinterval /rbmap xdef
  dup 2 index dup getinterval /gbmap xdef
  1 index dup 2 mul exch getinterval /bbmap xdef pop pop}bdef
/it {gs np dtri aload pop moveto lineto lineto cp c
  cols rows 8 compute_transform 
  rbmap gbmap bbmap true 3 colorimage gr}bdef
/il {newpath moveto lineto stroke}bdef
currentdict end def
%%EndProlog

%%BeginSetup
MathWorks begin

0 cap

end
%%EndSetup

%%Page: 1 1
%%BeginPageSetup
%%PageBoundingBox:    43   196   543   608
MathWorks begin
bpage
%%EndPageSetup

%%BeginObject: obj1
bplot

/dpi2point 12 def
portraitMode 0216 7344 csm

  302    46  6003  4946 MR c np
86 dict begin %Colortable dictionary
/c0 { 0.000000 0.000000 0.000000 sr} bdef
/c1 { 1.000000 1.000000 1.000000 sr} bdef
/c2 { 0.900000 0.000000 0.000000 sr} bdef
/c3 { 0.000000 0.820000 0.000000 sr} bdef
/c4 { 0.000000 0.000000 0.800000 sr} bdef
/c5 { 0.910000 0.820000 0.320000 sr} bdef
/c6 { 1.000000 0.260000 0.820000 sr} bdef
/c7 { 0.000000 0.820000 0.820000 sr} bdef
c0
1 j
1 sg
   0    0 6913 5186 PR
6 w
0 4226 5356 0 0 -4226 899 4615 4 MP
PP
-5356 0 0 4226 5356 0 0 -4226 899 4615 5 MP stroke
4 w
DO
0 sg
3604 4615 mt 3604  389 L
3604  389 mt 3604  389 L
 899 4215 mt 6255 4215 L
6255 4215 mt 6255 4215 L
 899 3483 mt 6255 3483 L
6255 3483 mt 6255 3483 L
 899 2750 mt 6255 2750 L
6255 2750 mt 6255 2750 L
 899 2018 mt 6255 2018 L
6255 2018 mt 6255 2018 L
 899 1286 mt 6255 1286 L
6255 1286 mt 6255 1286 L
 899  554 mt 6255  554 L
6255  554 mt 6255  554 L
SO
6 w
 899 4615 mt 6255 4615 L
 899  389 mt 6255  389 L
 899 4615 mt  899  389 L
6255 4615 mt 6255  389 L
 899 4615 mt 6255 4615 L
 899 4615 mt  899  389 L
3604 4615 mt 3604 4588 L
3604  389 mt 3604  415 L
DO
3604 4615 mt 3604  389 L
3604  389 mt 3604  389 L
SO
3438 4615 mt 3438 4588 L
3438  389 mt 3438  415 L
DO
3438 4615 mt 3438  389 L
3438  389 mt 3438  389 L
SO
3253 4615 mt 3253 4588 L
3253  389 mt 3253  415 L
DO
3253 4615 mt 3253  389 L
3253  389 mt 3253  389 L
SO
3042 4615 mt 3042 4588 L
3042  389 mt 3042  415 L
DO
3042 4615 mt 3042  389 L
3042  389 mt 3042  389 L
SO
2800 4615 mt 2800 4588 L
2800  389 mt 2800  415 L
DO
2800 4615 mt 2800  389 L
2800  389 mt 2800  389 L
SO
2513 4615 mt 2513 4588 L
2513  389 mt 2513  415 L
DO
2513 4615 mt 2513  389 L
2513  389 mt 2513  389 L
SO
2161 4615 mt 2161 4588 L
2161  389 mt 2161  415 L
DO
2161 4615 mt 2161  389 L
2161  389 mt 2161  389 L
SO
1708 4615 mt 1708 4588 L
1708  389 mt 1708  415 L
DO
1708 4615 mt 1708  389 L
1708  389 mt 1708  389 L
SO
1070 4615 mt 1070 4588 L
1070  389 mt 1070  415 L
DO
1070 4615 mt 1070  389 L
1070  389 mt 1070  389 L
SO
3604 4615 mt 3604 4561 L
3604  389 mt 3604  442 L
%%IncludeResource: font Helvetica
/Helvetica /ISOLatin1Encoding 120 FMSR

3516 4797 mt 
(10) s
%%IncludeResource: font Helvetica
/Helvetica /ISOLatin1Encoding 80 FMSR

3649 4723 mt 
(0) s
4695 4615 mt 4695 4588 L
4695  389 mt 4695  415 L
DO
4695 4615 mt 4695  389 L
4695  389 mt 4695  389 L
SO
5334 4615 mt 5334 4588 L
5334  389 mt 5334  415 L
DO
5334 4615 mt 5334  389 L
5334  389 mt 5334  389 L
SO
5787 4615 mt 5787 4588 L
5787  389 mt 5787  415 L
DO
5787 4615 mt 5787  389 L
5787  389 mt 5787  389 L
SO
6138 4615 mt 6138 4588 L
6138  389 mt 6138  415 L
DO
6138 4615 mt 6138  389 L
6138  389 mt 6138  389 L
SO
 899 4615 mt  899 4615 L
 899 4615 mt  899 4615 L
DO
 899 4615 mt  899 4615 L
 899 4615 mt  899 4615 L
SO
 899 4615 mt  899 4615 L
 899 4615 mt  899 4615 L
DO
 899 4615 mt  899 4615 L
 899 4615 mt  899 4615 L
SO
 899 4615 mt  899 4615 L
 899 4615 mt  899 4615 L
DO
 899 4615 mt  899 4615 L
 899 4615 mt  899 4615 L
SO
 899 4615 mt  899 4615 L
 899 4615 mt  899 4615 L
DO
 899 4615 mt  899 4615 L
 899 4615 mt  899 4615 L
SO
 899 4615 mt  899 4615 L
 899 4615 mt  899 4615 L
DO
 899 4615 mt  899 4615 L
 899 4615 mt  899 4615 L
SO
 899 4615 mt  899 4615 L
 899 4615 mt  899 4615 L
DO
 899 4615 mt  899 4615 L
 899 4615 mt  899 4615 L
SO
 899 4615 mt  899 4615 L
 899 4615 mt  899 4615 L
DO
 899 4615 mt  899 4615 L
 899 4615 mt  899 4615 L
SO
 899 4615 mt  899 4615 L
 899 4615 mt  899 4615 L
DO
 899 4615 mt  899 4615 L
 899 4615 mt  899 4615 L
SO
 899 4615 mt  899 4615 L
 899 4615 mt  899 4615 L
DO
 899 4615 mt  899 4615 L
 899 4615 mt  899 4615 L
SO
 899 4215 mt  952 4215 L
6255 4215 mt 6201 4215 L
%%IncludeResource: font Helvetica
/Helvetica /ISOLatin1Encoding 120 FMSR

 574 4259 mt 
(10) s
%%IncludeResource: font Helvetica
/Helvetica /ISOLatin1Encoding 80 FMSR

 707 4185 mt 
(-0.4) s
 899 4615 mt  899 4615 L
 899 4615 mt  899 4615 L
DO
 899 4615 mt  899 4615 L
 899 4615 mt  899 4615 L
SO
 899 4615 mt  899 4615 L
 899 4615 mt  899 4615 L
DO
 899 4615 mt  899 4615 L
 899 4615 mt  899 4615 L
SO
 899 4615 mt  899 4615 L
 899 4615 mt  899 4615 L
DO
 899 4615 mt  899 4615 L
 899 4615 mt  899 4615 L
SO
 899 4615 mt  899 4615 L
 899 4615 mt  899 4615 L
DO
 899 4615 mt  899 4615 L
 899 4615 mt  899 4615 L
SO
 899 4615 mt  899 4615 L
 899 4615 mt  899 4615 L
DO
 899 4615 mt  899 4615 L
 899 4615 mt  899 4615 L
SO
 899 4615 mt  899 4615 L
 899 4615 mt  899 4615 L
DO
 899 4615 mt  899 4615 L
 899 4615 mt  899 4615 L
SO
 899 4615 mt  899 4615 L
 899 4615 mt  899 4615 L
DO
 899 4615 mt  899 4615 L
 899 4615 mt  899 4615 L
SO
 899 4615 mt  899 4615 L
 899 4615 mt  899 4615 L
DO
 899 4615 mt  899 4615 L
 899 4615 mt  899 4615 L
SO
 899 4615 mt  899 4615 L
 899 4615 mt  899 4615 L
DO
 899 4615 mt  899 4615 L
 899 4615 mt  899 4615 L
SO
 899 3483 mt  952 3483 L
6255 3483 mt 6201 3483 L
%%IncludeResource: font Helvetica
/Helvetica /ISOLatin1Encoding 120 FMSR

 574 3527 mt 
(10) s
%%IncludeResource: font Helvetica
/Helvetica /ISOLatin1Encoding 80 FMSR

 707 3453 mt 
(-0.3) s
 899 4615 mt  899 4615 L
 899 4615 mt  899 4615 L
DO
 899 4615 mt  899 4615 L
 899 4615 mt  899 4615 L
SO
 899 4615 mt  899 4615 L
 899 4615 mt  899 4615 L
DO
 899 4615 mt  899 4615 L
 899 4615 mt  899 4615 L
SO
 899 4615 mt  899 4615 L
 899 4615 mt  899 4615 L
DO
 899 4615 mt  899 4615 L
 899 4615 mt  899 4615 L
SO
 899 4615 mt  899 4615 L
 899 4615 mt  899 4615 L
DO
 899 4615 mt  899 4615 L
 899 4615 mt  899 4615 L
SO
 899 4615 mt  899 4615 L
 899 4615 mt  899 4615 L
DO
 899 4615 mt  899 4615 L
 899 4615 mt  899 4615 L
SO
 899 4615 mt  899 4615 L
 899 4615 mt  899 4615 L
DO
 899 4615 mt  899 4615 L
 899 4615 mt  899 4615 L
SO
 899 4615 mt  899 4615 L
 899 4615 mt  899 4615 L
DO
 899 4615 mt  899 4615 L
 899 4615 mt  899 4615 L
SO
 899 4615 mt  899 4615 L
 899 4615 mt  899 4615 L
DO
 899 4615 mt  899 4615 L
 899 4615 mt  899 4615 L
SO
 899 4615 mt  899 4615 L
 899 4615 mt  899 4615 L
DO
 899 4615 mt  899 4615 L
 899 4615 mt  899 4615 L
SO
 899 2750 mt  952 2750 L
6255 2750 mt 6201 2750 L
%%IncludeResource: font Helvetica
/Helvetica /ISOLatin1Encoding 120 FMSR

 574 2794 mt 
(10) s
%%IncludeResource: font Helvetica
/Helvetica /ISOLatin1Encoding 80 FMSR

 707 2720 mt 
(-0.2) s
 899 4615 mt  899 4615 L
 899 4615 mt  899 4615 L
DO
 899 4615 mt  899 4615 L
 899 4615 mt  899 4615 L
SO
 899 4615 mt  899 4615 L
 899 4615 mt  899 4615 L
DO
 899 4615 mt  899 4615 L
 899 4615 mt  899 4615 L
SO
 899 4615 mt  899 4615 L
 899 4615 mt  899 4615 L
DO
 899 4615 mt  899 4615 L
 899 4615 mt  899 4615 L
SO
 899 4615 mt  899 4615 L
 899 4615 mt  899 4615 L
DO
 899 4615 mt  899 4615 L
 899 4615 mt  899 4615 L
SO
 899 4615 mt  899 4615 L
 899 4615 mt  899 4615 L
DO
 899 4615 mt  899 4615 L
 899 4615 mt  899 4615 L
SO
 899 4615 mt  899 4615 L
 899 4615 mt  899 4615 L
DO
 899 4615 mt  899 4615 L
 899 4615 mt  899 4615 L
SO
 899 4615 mt  899 4615 L
 899 4615 mt  899 4615 L
DO
 899 4615 mt  899 4615 L
 899 4615 mt  899 4615 L
SO
 899 4615 mt  899 4615 L
 899 4615 mt  899 4615 L
DO
 899 4615 mt  899 4615 L
 899 4615 mt  899 4615 L
SO
 899 4615 mt  899 4615 L
 899 4615 mt  899 4615 L
DO
 899 4615 mt  899 4615 L
 899 4615 mt  899 4615 L
SO
 899 2018 mt  952 2018 L
6255 2018 mt 6201 2018 L
%%IncludeResource: font Helvetica
/Helvetica /ISOLatin1Encoding 120 FMSR

 574 2062 mt 
(10) s
%%IncludeResource: font Helvetica
/Helvetica /ISOLatin1Encoding 80 FMSR

 707 1988 mt 
(-0.1) s
 899 4615 mt  899 4615 L
 899 4615 mt  899 4615 L
DO
 899 4615 mt  899 4615 L
 899 4615 mt  899 4615 L
SO
 899 4615 mt  899 4615 L
 899 4615 mt  899 4615 L
DO
 899 4615 mt  899 4615 L
 899 4615 mt  899 4615 L
SO
 899 4615 mt  899 4615 L
 899 4615 mt  899 4615 L
DO
 899 4615 mt  899 4615 L
 899 4615 mt  899 4615 L
SO
 899 4615 mt  899 4615 L
 899 4615 mt  899 4615 L
DO
 899 4615 mt  899 4615 L
 899 4615 mt  899 4615 L
SO
 899 4615 mt  899 4615 L
 899 4615 mt  899 4615 L
DO
 899 4615 mt  899 4615 L
 899 4615 mt  899 4615 L
SO
 899 4615 mt  899 4615 L
 899 4615 mt  899 4615 L
DO
 899 4615 mt  899 4615 L
 899 4615 mt  899 4615 L
SO
 899 4615 mt  899 4615 L
 899 4615 mt  899 4615 L
DO
 899 4615 mt  899 4615 L
 899 4615 mt  899 4615 L
SO
 899 4615 mt  899 4615 L
 899 4615 mt  899 4615 L
DO
 899 4615 mt  899 4615 L
 899 4615 mt  899 4615 L
SO
 899 4615 mt  899 4615 L
 899 4615 mt  899 4615 L
DO
 899 4615 mt  899 4615 L
 899 4615 mt  899 4615 L
SO
 899 1286 mt  952 1286 L
6255 1286 mt 6201 1286 L
%%IncludeResource: font Helvetica
/Helvetica /ISOLatin1Encoding 120 FMSR

 640 1330 mt 
(10) s
%%IncludeResource: font Helvetica
/Helvetica /ISOLatin1Encoding 80 FMSR

 773 1256 mt 
(0) s
 899 4615 mt  899 4615 L
 899 4615 mt  899 4615 L
DO
 899 4615 mt  899 4615 L
 899 4615 mt  899 4615 L
SO
 899 4615 mt  899 4615 L
 899 4615 mt  899 4615 L
DO
 899 4615 mt  899 4615 L
 899 4615 mt  899 4615 L
SO
 899 4615 mt  899 4615 L
 899 4615 mt  899 4615 L
DO
 899 4615 mt  899 4615 L
 899 4615 mt  899 4615 L
SO
 899 4615 mt  899 4615 L
 899 4615 mt  899 4615 L
DO
 899 4615 mt  899 4615 L
 899 4615 mt  899 4615 L
SO
 899 4615 mt  899 4615 L
 899 4615 mt  899 4615 L
DO
 899 4615 mt  899 4615 L
 899 4615 mt  899 4615 L
SO
 899 4615 mt  899 4615 L
 899 4615 mt  899 4615 L
DO
 899 4615 mt  899 4615 L
 899 4615 mt  899 4615 L
SO
 899 4615 mt  899 4615 L
 899 4615 mt  899 4615 L
DO
 899 4615 mt  899 4615 L
 899 4615 mt  899 4615 L
SO
 899 4615 mt  899 4615 L
 899 4615 mt  899 4615 L
DO
 899 4615 mt  899 4615 L
 899 4615 mt  899 4615 L
SO
 899 4615 mt  899 4615 L
 899 4615 mt  899 4615 L
DO
 899 4615 mt  899 4615 L
 899 4615 mt  899 4615 L
SO
 899  554 mt  952  554 L
6255  554 mt 6201  554 L
%%IncludeResource: font Helvetica
/Helvetica /ISOLatin1Encoding 120 FMSR

 620  598 mt 
(10) s
%%IncludeResource: font Helvetica
/Helvetica /ISOLatin1Encoding 80 FMSR

 753  524 mt 
(0.1) s
 899 4615 mt  899 4615 L
 899 4615 mt  899 4615 L
DO
 899 4615 mt  899 4615 L
 899 4615 mt  899 4615 L
SO
 899 4615 mt  899 4615 L
 899 4615 mt  899 4615 L
DO
 899 4615 mt  899 4615 L
 899 4615 mt  899 4615 L
SO
 899 4615 mt  899 4615 L
 899 4615 mt  899 4615 L
DO
 899 4615 mt  899 4615 L
 899 4615 mt  899 4615 L
SO
 899 4615 mt  899 4615 L
 899 4615 mt  899 4615 L
DO
 899 4615 mt  899 4615 L
 899 4615 mt  899 4615 L
SO
 899 4615 mt  899 4615 L
 899 4615 mt  899 4615 L
DO
 899 4615 mt  899 4615 L
 899 4615 mt  899 4615 L
SO
 899 4615 mt  899 4615 L
 899 4615 mt  899 4615 L
DO
 899 4615 mt  899 4615 L
 899 4615 mt  899 4615 L
SO
 899 4615 mt  899 4615 L
 899 4615 mt  899 4615 L
DO
 899 4615 mt  899 4615 L
 899 4615 mt  899 4615 L
SO
 899 4615 mt  899 4615 L
 899 4615 mt  899 4615 L
DO
 899 4615 mt  899 4615 L
 899 4615 mt  899 4615 L
SO
 899 4615 mt  899 4615 L
 899 4615 mt  899 4615 L
DO
 899 4615 mt  899 4615 L
 899 4615 mt  899 4615 L
SO
 899 4615 mt 6255 4615 L
 899  389 mt 6255  389 L
 899 4615 mt  899  389 L
6255 4615 mt 6255  389 L
gs 899 389 5357 4227 MR c np
/c8 { 1.000000 0.000000 0.000000 sr} bdef
c8
6 205 11 299 11 266 11 238 11 213 11 192 11 173 10 155 
11 141 11 127 11 115 11 104 11 94 11 86 11 77 11 70 
10 64 11 58 11 53 11 48 11 43 11 40 11 36 11 34 
11 30 10 28 11 25 11 23 11 21 11 20 11 18 11 17 
11 15 11 14 10 13 11 12 11 11 11 10 11 9 11 9 
11 8 11 7 11 7 10 7 11 6 11 5 11 6 11 4 
11 5 11 4 11 4 11 4 10 3 11 3 11 3 11 3 
11 3 11 2 11 2 11 2 11 2 10 2 11 2 11 2 
11 1 11 2 11 1 11 1 11 2 11 1 10 1 11 1 
11 1 11 1 11 1 11 0 11 1 11 1 11 1 10 0 
11 1 11 0 11 1 11 0 11 1 11 0 11 1 10 0 
11 1 11 0 11 0 11 1 11 0 11 0 11 1 11 0 
10 0 11 0 11 1 2657 1290 100 MP stroke
11 0 11 0 11 0 11 0 11 1 11 0 10 0 11 0 
11 0 11 0 11 0 11 1 11 0 11 0 11 0 10 0 
11 0 11 0 11 0 11 0 11 0 11 0 11 1 11 0 
10 0 11 0 11 0 11 0 11 0 11 0 11 0 11 0 
11 0 10 0 11 0 11 0 11 0 11 0 11 0 11 0 
11 0 11 0 10 0 11 0 11 1 11 0 11 0 11 0 
11 0 11 0 11 0 10 0 11 0 11 0 11 0 11 0 
11 0 11 0 11 0 11 0 10 0 11 0 11 0 11 0 
11 0 11 0 11 0 11 0 11 0 10 0 11 0 11 0 
11 0 11 0 11 0 11 0 11 0 11 0 10 0 11 0 
11 0 11 0 11 0 11 0 11 0 11 0 10 0 11 0 
11 0 11 0 11 0 11 0 11 0 11 0 11 0 10 0 
11 0 11 0 11 0 1579 1286 100 MP stroke
11 0 11 0 11 0 11 0 11 0 10 0 11 0 11 0 
11 0 11 0 11 0 11 0 11 0 11 0 10 0 11 0 
11 0 11 0 11 0 11 0 11 0 11 0 11 0 10 0 
11 0 11 0 11 0 11 0 11 0 11 0 11 0 11 0 
10 0 11 0 11 0 11 0 11 0 11 0 11 0 11 0 
11 0 10 0 11 0 11 0 11 0 11 0 11 0 11 0 
11 0 11 0 10 0 11 0 11 0 11 0 11 0 11 0 
11 0 11 0 11 0 10 0 11 0 11 0 5 0 899 1286 64 MP stroke
6 8 11 15 11 16 11 15 11 15 11 15 11 16 11 15 
10 15 11 14 11 15 11 15 11 15 11 14 11 15 11 14 
11 15 10 14 11 14 11 14 11 14 11 14 11 14 11 14 
11 14 11 13 10 14 11 14 11 13 11 13 11 14 11 13 
11 13 11 13 11 13 10 13 11 13 11 12 11 13 11 13 
11 12 11 13 11 12 10 12 11 12 11 12 11 12 11 12 
11 12 11 12 11 11 11 12 10 11 11 11 11 12 11 11 
11 11 11 11 11 11 11 11 11 10 10 11 11 10 11 11 
11 10 11 10 11 11 11 10 11 10 11 10 10 9 11 10 
11 10 11 9 11 9 11 10 11 9 11 9 11 9 10 9 
11 9 11 8 11 9 11 8 11 9 11 8 11 8 11 8 
10 8 11 8 11 8 11 7 11 8 11 7 11 8 11 7 
11 7 10 7 11 7 5183 2558 100 MP stroke
11 7 11 6 11 7 11 6 11 6 11 7 11 6 10 6 
11 5 11 6 11 6 11 5 11 5 11 6 11 5 11 5 
10 4 11 5 11 5 11 4 11 4 11 4 11 4 11 4 
11 4 10 3 11 4 11 3 11 3 11 3 11 3 11 2 
11 3 10 2 11 2 11 2 11 2 11 1 11 1 11 1 
11 1 11 1 10 1 11 0 11 0 11 0 11 -1 11 0 
11 -1 11 -1 11 -2 10 -1 11 -2 11 -3 11 -2 11 -3 
11 -3 11 -4 11 -4 11 -4 10 -5 11 -5 11 -5 11 -6 
11 -7 11 -6 11 -8 11 -8 11 -8 10 -9 11 -9 11 -11 
11 -10 11 -12 11 -12 11 -13 11 -14 11 -15 10 -15 11 -17 
11 -18 11 -18 11 -20 11 -21 11 -23 11 -24 11 -25 10 -27 
11 -29 11 -31 11 -33 11 -35 11 -37 11 -40 11 -43 11 -46 
10 -49 11 -53 11 -57 4105 3243 100 MP stroke
11 -62 11 -66 11 -72 11 -77 11 -84 11 -92 10 -100 11 -110 
11 -120 11 -132 11 -146 11 -162 9 -150 3965 4616 14 MP stroke
/c9 { 0.000000 1.000000 0.000000 sr} bdef
c9
5 272 11 505 10 411 11 337 11 279 11 231 11 193 11 161 
11 135 11 113 11 96 10 80 11 69 11 58 11 49 11 43 
11 36 11 31 11 27 11 24 10 20 11 18 11 15 11 14 
11 12 11 10 11 10 11 8 11 7 10 6 11 6 11 5 
11 5 11 4 11 4 11 3 11 3 11 3 10 2 11 2 
11 2 11 2 11 1 11 2 11 1 11 1 11 2 10 1 
11 1 11 0 11 1 11 1 11 0 11 1 11 1 11 0 
10 1 11 0 11 0 11 1 11 0 11 0 11 1 11 0 
11 0 10 0 11 0 11 1 11 0 11 0 11 0 11 0 
11 0 11 0 10 1 11 0 11 0 11 0 11 0 11 0 
11 0 11 0 10 0 11 0 11 0 11 0 11 0 11 0 
11 0 11 1 11 0 10 0 11 0 11 0 11 0 11 0 
11 0 11 0 11 0 2602 1286 100 MP stroke
11 0 10 0 11 0 11 0 11 0 11 0 11 0 11 0 
11 0 11 0 10 0 11 0 11 0 11 0 11 0 11 0 
11 0 11 0 11 0 10 0 11 0 11 0 11 0 11 0 
11 0 11 0 11 0 11 0 10 0 11 0 11 0 11 0 
11 0 11 0 11 0 11 0 11 0 10 0 11 0 11 0 
11 0 11 0 11 0 11 0 11 0 11 0 10 0 11 0 
11 0 11 0 11 0 11 0 11 0 11 0 11 0 10 0 
11 0 11 0 11 0 11 0 11 0 11 0 11 0 11 0 
10 0 11 0 11 0 11 0 11 0 11 0 11 0 11 0 
11 0 10 0 11 0 11 0 11 0 11 0 11 0 11 0 
11 0 10 0 11 0 11 0 11 0 11 0 11 0 11 0 
11 0 11 0 10 0 11 0 11 0 11 0 11 0 11 0 
11 0 11 0 11 0 1524 1286 100 MP stroke
10 0 11 0 11 0 11 0 11 0 11 0 11 0 11 0 
11 0 10 0 11 0 11 0 11 0 11 0 11 0 11 0 
11 0 11 0 10 0 11 0 11 0 11 0 11 0 11 0 
11 0 11 0 11 0 10 0 11 0 11 0 11 0 11 0 
11 0 11 0 11 0 11 0 10 0 11 0 11 0 11 0 
11 0 11 0 11 0 11 0 11 0 10 0 11 0 11 0 
11 0 11 0 11 0 11 0 11 0 11 0 10 0 11 0 
11 0 5 0 899 1286 59 MP stroke
3 35 11 98 11 93 11 91 11 86 11 83 11 80 10 77 
11 74 11 71 11 68 11 66 11 64 11 61 11 58 11 57 
10 54 11 52 11 51 11 48 11 47 11 45 11 43 11 41 
11 40 10 39 11 37 11 35 11 34 11 33 11 31 11 30 
11 29 11 28 10 26 11 26 11 24 11 23 11 22 11 21 
11 20 11 18 11 18 10 17 11 16 11 15 11 14 11 13 
11 11 11 11 11 10 11 9 10 8 11 7 11 6 11 5 
11 4 11 3 11 1 11 1 11 -1 10 -2 11 -3 11 -5 
11 -6 11 -8 11 -10 11 -11 11 -14 11 -15 10 -18 11 -20 
11 -24 11 -26 11 -30 11 -33 11 -38 11 -42 11 -48 10 -54 
11 -62 11 -69 11 -79 11 -90 11 -103 11 -119 11 -138 11 -160 
10 -188 11 -223 11 -267 11 -322 3800 4616 93 MP stroke
6 -5 11 -11 11 -10 11 -11 11 -11 11 -11 11 -11 11 -12 
10 -12 11 -12 11 -12 11 -13 11 -13 11 -13 11 -14 11 -14 
11 -14 10 -15 11 -14 11 -16 11 -15 11 -16 11 -17 11 -16 
11 -18 11 -17 10 -18 11 -19 11 -19 11 -19 11 -20 11 -21 
11 -21 11 -21 11 -22 10 -23 11 -23 11 -24 11 -25 11 -25 
11 -26 11 -27 11 -27 10 -28 11 -29 11 -30 11 -31 11 -32 
11 -32 11 -34 11 -35 11 -35 10 -37 11 -38 11 -39 11 -41 
11 -42 11 -43 11 -45 11 -46 11 -47 10 -50 11 -51 11 -53 
11 -55 11 -57 1 -8 5541 4616 68 MP stroke
0 sg
1 108 11 799 11 577 11 426 11 318 11 240 11 181 11 139 
11 107 10 83 11 65 11 52 11 41 11 32 11 27 11 21 
11 18 11 14 10 13 11 10 11 8 11 7 11 6 11 5 
11 4 11 4 11 3 10 3 11 2 11 2 11 2 11 1 
11 2 11 1 11 1 11 1 10 1 11 0 11 1 11 1 
11 0 11 0 11 1 11 0 11 0 10 1 11 0 11 0 
11 0 11 0 11 1 11 0 11 0 11 0 10 0 11 0 
11 0 11 0 11 0 11 0 11 1 11 0 11 0 10 0 
11 0 11 0 11 0 11 0 11 0 11 0 11 0 11 0 
10 0 11 0 11 0 11 0 11 0 11 0 11 0 11 0 
10 0 11 0 11 0 11 0 11 0 11 0 11 0 11 0 
11 0 10 0 11 0 11 0 11 0 11 0 11 0 11 0 
11 0 11 0 10 0 2581 1286 100 MP stroke
11 0 11 0 11 0 11 0 11 0 11 0 11 0 11 0 
10 0 11 0 11 0 11 0 11 0 11 0 11 0 11 0 
11 0 10 0 11 0 11 0 11 0 11 0 11 0 11 0 
11 0 11 0 10 0 11 0 11 0 11 0 11 0 11 0 
11 0 11 0 11 0 10 0 11 0 11 0 11 0 11 0 
11 0 11 0 11 0 11 0 10 0 11 0 11 0 11 0 
11 0 11 0 11 0 11 0 11 0 10 0 11 0 11 0 
11 0 11 0 11 0 11 0 11 0 11 0 10 0 11 0 
11 0 11 0 11 0 11 0 11 0 11 0 11 0 10 0 
11 0 11 0 11 0 11 0 11 0 11 0 11 0 10 0 
11 0 11 0 11 0 11 0 11 0 11 0 11 0 11 0 
10 0 11 0 11 0 11 0 11 0 11 0 11 0 11 0 
11 0 10 0 11 0 1503 1286 100 MP stroke
11 0 11 0 11 0 11 0 11 0 11 0 11 0 10 0 
11 0 11 0 11 0 11 0 11 0 11 0 11 0 11 0 
10 0 11 0 11 0 11 0 11 0 11 0 11 0 11 0 
11 0 10 0 11 0 11 0 11 0 11 0 11 0 11 0 
11 0 11 0 10 0 11 0 11 0 11 0 11 0 11 0 
11 0 11 0 11 0 10 0 11 0 11 0 11 0 11 0 
11 0 11 0 11 0 11 0 10 0 11 0 11 0 5 0 
899 1286 57 MP stroke
8 140 11 183 11 167 11 154 11 141 10 131 11 121 11 111 
11 103 11 96 11 88 11 82 11 75 11 70 10 64 11 60 
11 55 11 50 11 47 11 42 11 39 11 35 11 32 10 28 
11 25 11 22 11 19 11 16 11 13 11 9 11 7 11 3 
10 -1 11 -4 11 -8 11 -13 11 -18 11 -23 11 -30 11 -36 
11 -45 10 -55 11 -67 11 -81 11 -99 11 -122 11 -150 11 -187 
11 -238 10 -306 11 -405 7 -340 3728 4616 53 MP stroke
6 5 11 9 11 9 11 9 11 9 11 9 11 9 11 9 
10 8 11 9 11 8 11 8 11 8 11 8 11 8 11 8 
11 8 10 8 11 7 11 8 11 7 11 7 11 7 11 7 
11 7 11 7 10 7 11 6 11 7 11 6 11 6 11 6 
11 7 11 5 11 6 10 6 11 5 11 6 11 5 11 5 
11 6 11 5 11 4 10 5 11 5 11 4 11 4 11 5 
11 4 11 4 11 4 11 3 10 4 11 3 11 4 11 3 
11 3 11 2 11 3 11 3 11 2 10 2 11 2 11 2 
11 2 11 2 11 1 11 1 11 1 11 1 10 1 11 0 
11 1 11 0 11 0 11 0 11 -1 11 -1 11 0 10 -2 
11 -1 11 -2 11 -1 11 -3 11 -2 11 -3 11 -2 11 -4 
10 -3 11 -4 11 -4 11 -4 11 -5 11 -5 11 -6 11 -6 
11 -6 10 -6 11 -7 5183 2466 100 MP stroke
11 -8 11 -8 11 -8 11 -9 11 -9 11 -10 11 -10 10 -11 
11 -12 11 -12 11 -13 11 -14 11 -14 11 -15 11 -16 11 -16 
10 -18 11 -18 11 -20 11 -20 11 -22 11 -23 11 -23 11 -26 
11 -26 10 -28 11 -30 11 -31 11 -33 11 -35 11 -36 11 -39 
11 -41 10 -44 11 -46 11 -49 11 -52 11 -55 11 -58 11 -63 
11 -66 11 -71 10 -75 11 -81 11 -86 11 -93 11 -100 11 -107 
11 -115 11 -125 11 -134 5 -76 4622 4616 53 MP stroke
DA
/c10 { 0.000000 0.000000 1.000000 sr} bdef
c10
5357 0 899 2388 2 MP stroke
gr

c10
DA
0 sg
%%IncludeResource: font Helvetica
/Helvetica /ISOLatin1Encoding 120 FMSR

 438 2667 mt  -90 rotate
(|H) s
90 rotate
%%IncludeResource: font Helvetica
/Helvetica /ISOLatin1Encoding 96 FMSR

 498 2550 mt  -90 rotate
(N) s
90 rotate
%%IncludeResource: font Helvetica
/Helvetica /ISOLatin1Encoding 120 FMSR

 438 2481 mt  -90 rotate
(\(f\)|) s
90 rotate
3559 4940 mt 
(f) s
2379  240 mt 
(Modulo dei filtri di Chebyshev-II per f) s
%%IncludeResource: font Helvetica
/Helvetica /ISOLatin1Encoding 96 FMSR

4352  300 mt 
(c) s
%%IncludeResource: font Helvetica
/Helvetica /ISOLatin1Encoding 120 FMSR

4400  240 mt 
(=1, ) s
%%IncludeResource: font Symbol
/Symbol /ISOLatin1Encoding 120 FMSR

4603  240 mt 
(e) s
%%IncludeResource: font Helvetica
/Helvetica /ISOLatin1Encoding 120 FMSR

4655  240 mt 
(=1) s
SO

end %%Color Dict

eplot
%%EndObject

epage
end

showpage

%%Trailer
%%EOF
