%!PS-Adobe-2.0 EPSF-1.2
%%Creator: MATLAB, The Mathworks, Inc. Version 7.5.0.338 (R2007b). Operating System: Linux 2.6.35-32-generic #67-Ubuntu SMP Mon Mar 5 19:39:49 UTC 2012 x86_64.
%%Title: ./filtri_ellittici.eps
%%CreationDate: 04/23/2012  13:32:31
%%DocumentNeededFonts: Helvetica
%%DocumentProcessColors: Cyan Magenta Yellow Black
%%Extensions: CMYK
%%Pages: 1
%%BoundingBox:    53   196   550   602
%%EndComments

%%BeginProlog
% MathWorks dictionary
/MathWorks 160 dict begin
% definition operators
/bdef {bind def} bind def
/ldef {load def} bind def
/xdef {exch def} bdef
/xstore {exch store} bdef
% operator abbreviations
/c  /clip ldef
/cc /concat ldef
/cp /closepath ldef
/gr /grestore ldef
/gs /gsave ldef
/mt /moveto ldef
/np /newpath ldef
/cm /currentmatrix ldef
/sm /setmatrix ldef
/rm /rmoveto ldef
/rl /rlineto ldef
/s {show newpath} bdef
/sc {setcmykcolor} bdef
/sr /setrgbcolor ldef
/sg /setgray ldef
/w /setlinewidth ldef
/j /setlinejoin ldef
/cap /setlinecap ldef
/rc {rectclip} bdef
/rf {rectfill} bdef
% page state control
/pgsv () def
/bpage {/pgsv save def} bdef
/epage {pgsv restore} bdef
/bplot /gsave ldef
/eplot {stroke grestore} bdef
% orientation switch
/portraitMode 0 def /landscapeMode 1 def /rotateMode 2 def
% coordinate system mappings
/dpi2point 0 def
% font control
/FontSize 0 def
/FMS {/FontSize xstore findfont [FontSize 0 0 FontSize neg 0 0]
  makefont setfont} bdef
/reencode {exch dup where {pop load} {pop StandardEncoding} ifelse
  exch dup 3 1 roll findfont dup length dict begin
  { 1 index /FID ne {def}{pop pop} ifelse } forall
  /Encoding exch def currentdict end definefont pop} bdef
/isroman {findfont /CharStrings get /Agrave known} bdef
/FMSR {3 1 roll 1 index dup isroman {reencode} {pop pop} ifelse
  exch FMS} bdef
/csm {1 dpi2point div -1 dpi2point div scale neg translate
 dup landscapeMode eq {pop -90 rotate}
  {rotateMode eq {90 rotate} if} ifelse} bdef
% line types: solid, dotted, dashed, dotdash
/SO { [] 0 setdash } bdef
/DO { [.5 dpi2point mul 4 dpi2point mul] 0 setdash } bdef
/DA { [6 dpi2point mul] 0 setdash } bdef
/DD { [.5 dpi2point mul 4 dpi2point mul 6 dpi2point mul 4
  dpi2point mul] 0 setdash } bdef
% macros for lines and objects
/L {lineto stroke} bdef
/MP {3 1 roll moveto 1 sub {rlineto} repeat} bdef
/AP {{rlineto} repeat} bdef
/PDlw -1 def
/W {/PDlw currentlinewidth def setlinewidth} def
/PP {closepath eofill} bdef
/DP {closepath stroke} bdef
/MR {4 -2 roll moveto dup  0 exch rlineto exch 0 rlineto
  neg 0 exch rlineto closepath} bdef
/FR {MR stroke} bdef
/PR {MR fill} bdef
/L1i {{currentfile picstr readhexstring pop} image} bdef
/tMatrix matrix def
/MakeOval {newpath tMatrix currentmatrix pop translate scale
0 0 1 0 360 arc tMatrix setmatrix} bdef
/FO {MakeOval stroke} bdef
/PO {MakeOval fill} bdef
/PD {currentlinewidth 2 div 0 360 arc fill
   PDlw -1 eq not {PDlw w /PDlw -1 def} if} def
/FA {newpath tMatrix currentmatrix pop translate scale
  0 0 1 5 -2 roll arc tMatrix setmatrix stroke} bdef
/PA {newpath tMatrix currentmatrix pop	translate 0 0 moveto scale
  0 0 1 5 -2 roll arc closepath tMatrix setmatrix fill} bdef
/FAn {newpath tMatrix currentmatrix pop translate scale
  0 0 1 5 -2 roll arcn tMatrix setmatrix stroke} bdef
/PAn {newpath tMatrix currentmatrix pop translate 0 0 moveto scale
  0 0 1 5 -2 roll arcn closepath tMatrix setmatrix fill} bdef
/vradius 0 def /hradius 0 def /lry 0 def
/lrx 0 def /uly 0 def /ulx 0 def /rad 0 def
/MRR {/vradius xdef /hradius xdef /lry xdef /lrx xdef /uly xdef
  /ulx xdef newpath tMatrix currentmatrix pop ulx hradius add uly
  vradius add translate hradius vradius scale 0 0 1 180 270 arc 
  tMatrix setmatrix lrx hradius sub uly vradius add translate
  hradius vradius scale 0 0 1 270 360 arc tMatrix setmatrix
  lrx hradius sub lry vradius sub translate hradius vradius scale
  0 0 1 0 90 arc tMatrix setmatrix ulx hradius add lry vradius sub
  translate hradius vradius scale 0 0 1 90 180 arc tMatrix setmatrix
  closepath} bdef
/FRR {MRR stroke } bdef
/PRR {MRR fill } bdef
/MlrRR {/lry xdef /lrx xdef /uly xdef /ulx xdef /rad lry uly sub 2 div def
  newpath tMatrix currentmatrix pop ulx rad add uly rad add translate
  rad rad scale 0 0 1 90 270 arc tMatrix setmatrix lrx rad sub lry rad
  sub translate rad rad scale 0 0 1 270 90 arc tMatrix setmatrix
  closepath} bdef
/FlrRR {MlrRR stroke } bdef
/PlrRR {MlrRR fill } bdef
/MtbRR {/lry xdef /lrx xdef /uly xdef /ulx xdef /rad lrx ulx sub 2 div def
  newpath tMatrix currentmatrix pop ulx rad add uly rad add translate
  rad rad scale 0 0 1 180 360 arc tMatrix setmatrix lrx rad sub lry rad
  sub translate rad rad scale 0 0 1 0 180 arc tMatrix setmatrix
  closepath} bdef
/FtbRR {MtbRR stroke } bdef
/PtbRR {MtbRR fill } bdef
/stri 6 array def /dtri 6 array def
/smat 6 array def /dmat 6 array def
/tmat1 6 array def /tmat2 6 array def /dif 3 array def
/asub {/ind2 exch def /ind1 exch def dup dup
  ind1 get exch ind2 get sub exch } bdef
/tri_to_matrix {
  2 0 asub 3 1 asub 4 0 asub 5 1 asub
  dup 0 get exch 1 get 7 -1 roll astore } bdef
/compute_transform {
  dmat dtri tri_to_matrix tmat1 invertmatrix 
  smat stri tri_to_matrix tmat2 concatmatrix } bdef
/ds {stri astore pop} bdef
/dt {dtri astore pop} bdef
/db {2 copy /cols xdef /rows xdef mul dup 3 mul string
  currentfile exch readhexstring pop
  dup 0 3 index getinterval /rbmap xdef
  dup 2 index dup getinterval /gbmap xdef
  1 index dup 2 mul exch getinterval /bbmap xdef pop pop}bdef
/it {gs np dtri aload pop moveto lineto lineto cp c
  cols rows 8 compute_transform 
  rbmap gbmap bbmap true 3 colorimage gr}bdef
/il {newpath moveto lineto stroke}bdef
currentdict end def
%%EndProlog

%%BeginSetup
MathWorks begin

0 cap

end
%%EndSetup

%%Page: 1 1
%%BeginPageSetup
%%PageBoundingBox:    53   196   550   602
MathWorks begin
bpage
%%EndPageSetup

%%BeginObject: obj1
bplot

/dpi2point 12 def
portraitMode 0216 7344 csm

  422   109  5971  4883 MR c np
86 dict begin %Colortable dictionary
/c0 { 0.000000 0.000000 0.000000 sr} bdef
/c1 { 1.000000 1.000000 1.000000 sr} bdef
/c2 { 0.900000 0.000000 0.000000 sr} bdef
/c3 { 0.000000 0.820000 0.000000 sr} bdef
/c4 { 0.000000 0.000000 0.800000 sr} bdef
/c5 { 0.910000 0.820000 0.320000 sr} bdef
/c6 { 1.000000 0.260000 0.820000 sr} bdef
/c7 { 0.000000 0.820000 0.820000 sr} bdef
c0
1 j
1 sg
   0    0 6913 5186 PR
6 w
0 4227 5356 0 0 -4227 899 4615 4 MP
PP
-5356 0 0 4227 5356 0 0 -4227 899 4615 5 MP stroke
4 w
DO
0 sg
 899 4615 mt  899  389 L
 899  389 mt  899  389 L
3577 4615 mt 3577  389 L
3577  389 mt 3577  389 L
6255 4615 mt 6255  389 L
6255  389 mt 6255  389 L
 899 4615 mt 6255 4615 L
6255 4615 mt 6255 4615 L
 899 3225 mt 6255 3225 L
6255 3225 mt 6255 3225 L
 899 1836 mt 6255 1836 L
6255 1836 mt 6255 1836 L
 899  446 mt 6255  446 L
6255  446 mt 6255  446 L
SO
6 w
 899 4615 mt 6255 4615 L
 899  388 mt 6255  388 L
 899 4615 mt  899  388 L
6255 4615 mt 6255  388 L
 899 4615 mt 6255 4615 L
 899 4615 mt  899  388 L
 899 4615 mt  899 4588 L
 899  389 mt  899  415 L
DO
 899 4615 mt  899  389 L
 899  389 mt  899  389 L
SO
 899 4615 mt  899 4561 L
 899  389 mt  899  442 L
%%IncludeResource: font Helvetica
/Helvetica /ISOLatin1Encoding 120 FMSR

 787 4797 mt 
(10) s
%%IncludeResource: font Helvetica
/Helvetica /ISOLatin1Encoding 80 FMSR

 920 4723 mt 
(-1) s
1705 4615 mt 1705 4588 L
1705  389 mt 1705  415 L
DO
1705 4615 mt 1705  389 L
1705  389 mt 1705  389 L
SO
2176 4615 mt 2176 4588 L
2176  389 mt 2176  415 L
DO
2176 4615 mt 2176  389 L
2176  389 mt 2176  389 L
SO
2511 4615 mt 2511 4588 L
2511  389 mt 2511  415 L
DO
2511 4615 mt 2511  389 L
2511  389 mt 2511  389 L
SO
2770 4615 mt 2770 4588 L
2770  389 mt 2770  415 L
DO
2770 4615 mt 2770  389 L
2770  389 mt 2770  389 L
SO
2982 4615 mt 2982 4588 L
2982  389 mt 2982  415 L
DO
2982 4615 mt 2982  389 L
2982  389 mt 2982  389 L
SO
3162 4615 mt 3162 4588 L
3162  389 mt 3162  415 L
DO
3162 4615 mt 3162  389 L
3162  389 mt 3162  389 L
SO
3317 4615 mt 3317 4588 L
3317  389 mt 3317  415 L
DO
3317 4615 mt 3317  389 L
3317  389 mt 3317  389 L
SO
3454 4615 mt 3454 4588 L
3454  389 mt 3454  415 L
DO
3454 4615 mt 3454  389 L
3454  389 mt 3454  389 L
SO
3577 4615 mt 3577 4588 L
3577  389 mt 3577  415 L
DO
3577 4615 mt 3577  389 L
3577  389 mt 3577  389 L
SO
3577 4615 mt 3577 4561 L
3577  389 mt 3577  442 L
%%IncludeResource: font Helvetica
/Helvetica /ISOLatin1Encoding 120 FMSR

3489 4797 mt 
(10) s
%%IncludeResource: font Helvetica
/Helvetica /ISOLatin1Encoding 80 FMSR

3622 4723 mt 
(0) s
4383 4615 mt 4383 4588 L
4383  389 mt 4383  415 L
DO
4383 4615 mt 4383  389 L
4383  389 mt 4383  389 L
SO
4854 4615 mt 4854 4588 L
4854  389 mt 4854  415 L
DO
4854 4615 mt 4854  389 L
4854  389 mt 4854  389 L
SO
5189 4615 mt 5189 4588 L
5189  389 mt 5189  415 L
DO
5189 4615 mt 5189  389 L
5189  389 mt 5189  389 L
SO
5448 4615 mt 5448 4588 L
5448  389 mt 5448  415 L
DO
5448 4615 mt 5448  389 L
5448  389 mt 5448  389 L
SO
5660 4615 mt 5660 4588 L
5660  389 mt 5660  415 L
DO
5660 4615 mt 5660  389 L
5660  389 mt 5660  389 L
SO
5840 4615 mt 5840 4588 L
5840  389 mt 5840  415 L
DO
5840 4615 mt 5840  389 L
5840  389 mt 5840  389 L
SO
5995 4615 mt 5995 4588 L
5995  389 mt 5995  415 L
DO
5995 4615 mt 5995  389 L
5995  389 mt 5995  389 L
SO
6132 4615 mt 6132 4588 L
6132  389 mt 6132  415 L
DO
6132 4615 mt 6132  389 L
6132  389 mt 6132  389 L
SO
6255 4615 mt 6255 4588 L
6255  389 mt 6255  415 L
DO
6255 4615 mt 6255  389 L
6255  389 mt 6255  389 L
SO
6255 4615 mt 6255 4561 L
6255  389 mt 6255  442 L
%%IncludeResource: font Helvetica
/Helvetica /ISOLatin1Encoding 120 FMSR

6167 4797 mt 
(10) s
%%IncludeResource: font Helvetica
/Helvetica /ISOLatin1Encoding 80 FMSR

6300 4723 mt 
(1) s
 899 4615 mt  925 4615 L
6255 4615 mt 6228 4615 L
DO
 899 4615 mt 6255 4615 L
6255 4615 mt 6255 4615 L
SO
 899 4615 mt  952 4615 L
6255 4615 mt 6201 4615 L
%%IncludeResource: font Helvetica
/Helvetica /ISOLatin1Encoding 120 FMSR

 640 4659 mt 
(10) s
%%IncludeResource: font Helvetica
/Helvetica /ISOLatin1Encoding 80 FMSR

 773 4585 mt 
(-3) s
 899 4196 mt  925 4196 L
6255 4196 mt 6228 4196 L
DO
 899 4196 mt 6255 4196 L
6255 4196 mt 6255 4196 L
SO
 899 3952 mt  925 3952 L
6255 3952 mt 6228 3952 L
DO
 899 3952 mt 6255 3952 L
6255 3952 mt 6255 3952 L
SO
 899 3778 mt  925 3778 L
6255 3778 mt 6228 3778 L
DO
 899 3778 mt 6255 3778 L
6255 3778 mt 6255 3778 L
SO
 899 3643 mt  925 3643 L
6255 3643 mt 6228 3643 L
DO
 899 3643 mt 6255 3643 L
6255 3643 mt 6255 3643 L
SO
 899 3533 mt  925 3533 L
6255 3533 mt 6228 3533 L
DO
 899 3533 mt 6255 3533 L
6255 3533 mt 6255 3533 L
SO
 899 3440 mt  925 3440 L
6255 3440 mt 6228 3440 L
DO
 899 3440 mt 6255 3440 L
6255 3440 mt 6255 3440 L
SO
 899 3360 mt  925 3360 L
6255 3360 mt 6228 3360 L
DO
 899 3360 mt 6255 3360 L
6255 3360 mt 6255 3360 L
SO
 899 3289 mt  925 3289 L
6255 3289 mt 6228 3289 L
DO
 899 3289 mt 6255 3289 L
6255 3289 mt 6255 3289 L
SO
 899 3225 mt  925 3225 L
6255 3225 mt 6228 3225 L
DO
 899 3225 mt 6255 3225 L
6255 3225 mt 6255 3225 L
SO
 899 3225 mt  952 3225 L
6255 3225 mt 6201 3225 L
%%IncludeResource: font Helvetica
/Helvetica /ISOLatin1Encoding 120 FMSR

 640 3269 mt 
(10) s
%%IncludeResource: font Helvetica
/Helvetica /ISOLatin1Encoding 80 FMSR

 773 3195 mt 
(-2) s
 899 2807 mt  925 2807 L
6255 2807 mt 6228 2807 L
DO
 899 2807 mt 6255 2807 L
6255 2807 mt 6255 2807 L
SO
 899 2562 mt  925 2562 L
6255 2562 mt 6228 2562 L
DO
 899 2562 mt 6255 2562 L
6255 2562 mt 6255 2562 L
SO
 899 2388 mt  925 2388 L
6255 2388 mt 6228 2388 L
DO
 899 2388 mt 6255 2388 L
6255 2388 mt 6255 2388 L
SO
 899 2254 mt  925 2254 L
6255 2254 mt 6228 2254 L
DO
 899 2254 mt 6255 2254 L
6255 2254 mt 6255 2254 L
SO
 899 2144 mt  925 2144 L
6255 2144 mt 6228 2144 L
DO
 899 2144 mt 6255 2144 L
6255 2144 mt 6255 2144 L
SO
 899 2051 mt  925 2051 L
6255 2051 mt 6228 2051 L
DO
 899 2051 mt 6255 2051 L
6255 2051 mt 6255 2051 L
SO
 899 1970 mt  925 1970 L
6255 1970 mt 6228 1970 L
DO
 899 1970 mt 6255 1970 L
6255 1970 mt 6255 1970 L
SO
 899 1899 mt  925 1899 L
6255 1899 mt 6228 1899 L
DO
 899 1899 mt 6255 1899 L
6255 1899 mt 6255 1899 L
SO
 899 1836 mt  925 1836 L
6255 1836 mt 6228 1836 L
DO
 899 1836 mt 6255 1836 L
6255 1836 mt 6255 1836 L
SO
 899 1836 mt  952 1836 L
6255 1836 mt 6201 1836 L
%%IncludeResource: font Helvetica
/Helvetica /ISOLatin1Encoding 120 FMSR

 640 1880 mt 
(10) s
%%IncludeResource: font Helvetica
/Helvetica /ISOLatin1Encoding 80 FMSR

 773 1806 mt 
(-1) s
 899 1417 mt  925 1417 L
6255 1417 mt 6228 1417 L
DO
 899 1417 mt 6255 1417 L
6255 1417 mt 6255 1417 L
SO
 899 1173 mt  925 1173 L
6255 1173 mt 6228 1173 L
DO
 899 1173 mt 6255 1173 L
6255 1173 mt 6255 1173 L
SO
 899  999 mt  925  999 L
6255  999 mt 6228  999 L
DO
 899  999 mt 6255  999 L
6255  999 mt 6255  999 L
SO
 899  864 mt  925  864 L
6255  864 mt 6228  864 L
DO
 899  864 mt 6255  864 L
6255  864 mt 6255  864 L
SO
 899  754 mt  925  754 L
6255  754 mt 6228  754 L
DO
 899  754 mt 6255  754 L
6255  754 mt 6255  754 L
SO
 899  661 mt  925  661 L
6255  661 mt 6228  661 L
DO
 899  661 mt 6255  661 L
6255  661 mt 6255  661 L
SO
 899  581 mt  925  581 L
6255  581 mt 6228  581 L
DO
 899  581 mt 6255  581 L
6255  581 mt 6255  581 L
SO
 899  510 mt  925  510 L
6255  510 mt 6228  510 L
DO
 899  510 mt 6255  510 L
6255  510 mt 6255  510 L
SO
 899  446 mt  925  446 L
6255  446 mt 6228  446 L
DO
 899  446 mt 6255  446 L
6255  446 mt 6255  446 L
SO
 899  446 mt  952  446 L
6255  446 mt 6201  446 L
%%IncludeResource: font Helvetica
/Helvetica /ISOLatin1Encoding 120 FMSR

 640  490 mt 
(10) s
%%IncludeResource: font Helvetica
/Helvetica /ISOLatin1Encoding 80 FMSR

 773  416 mt 
(0) s
 899 4615 mt 6255 4615 L
 899  388 mt 6255  388 L
 899 4615 mt  899  388 L
6255 4615 mt 6255  388 L
gs 899 388 5357 4228 MR c np
/c8 { 0.000000 0.000000 1.000000 sr} bdef
c8
1 546 6 412 5 254 6 187 5 149 5 126 6 110 5 97 
5 89 6 81 5 75 5 70 6 67 5 63 6 60 5 58 
5 55 6 54 5 52 5 50 6 49 5 48 5 47 6 46 
5 45 6 44 5 44 5 43 6 43 5 42 5 41 6 41 
5 41 5 40 6 40 5 39 6 39 5 39 5 39 6 38 
5 38 5 37 6 37 5 37 5 36 6 35 5 35 5 34 
6 33 5 32 6 31 5 30 5 28 6 27 5 26 5 23 
6 22 5 21 5 18 6 16 5 14 6 13 5 10 5 9 
6 8 5 6 5 4 6 3 5 2 5 2 6 0 5 0 
6 -1 5 -2 5 -1 6 -2 5 -3 5 -2 6 -3 5 -3 
5 -2 6 -3 5 -3 5 -3 6 -2 5 -3 6 -2 5 -3 
5 -2 6 -2 5 -2 5 -2 6 -2 5 -2 5 -1 6 -2 
5 -1 6 -2 5 -1 3370 503 100 MP stroke
5 -1 6 -1 5 -1 5 -1 6 0 5 -1 5 0 6 -1 
5 0 6 0 5 0 5 -1 6 0 5 0 5 1 6 0 
5 0 5 0 6 0 5 1 6 0 5 1 5 0 6 1 
5 0 5 1 6 1 5 0 5 1 6 1 5 0 5 1 
6 1 5 1 6 1 5 1 5 0 6 1 5 1 5 1 
6 1 5 1 5 1 6 1 5 1 6 1 5 1 5 1 
6 1 5 0 5 1 6 1 5 1 5 1 6 1 5 1 
6 1 5 1 5 1 6 1 5 1 5 0 6 1 5 1 
5 1 6 1 5 1 5 0 6 1 5 1 6 1 5 0 
5 1 6 1 5 1 5 0 6 1 5 1 5 0 6 1 
5 1 6 0 5 1 5 0 6 1 5 1 5 0 6 1 
5 0 5 1 6 0 5 1 6 0 5 0 5 1 6 0 
5 1 5 0 6 0 2839 451 100 MP stroke
5 1 5 0 6 0 5 1 5 0 6 0 5 0 6 1 
5 0 5 0 6 0 5 1 5 0 6 0 5 0 5 0 
6 0 5 0 6 1 5 0 5 0 6 0 5 0 5 0 
6 0 5 0 5 0 6 0 5 0 6 0 5 0 5 0 
6 0 5 0 5 0 6 0 5 0 5 0 6 -1 5 0 
6 0 5 0 5 0 6 0 5 0 5 0 6 0 5 -1 
5 0 6 0 5 0 5 0 6 0 5 -1 6 0 5 0 
5 0 6 0 5 -1 5 0 6 0 5 0 5 -1 6 0 
5 0 6 0 5 0 5 -1 6 0 5 0 5 0 6 -1 
5 0 5 0 6 0 5 -1 6 0 5 0 5 -1 6 0 
5 0 5 0 6 -1 5 0 5 0 6 0 5 -1 5 0 
6 0 5 -1 6 0 5 0 5 -1 6 0 5 0 5 0 
6 -1 5 0 5 0 2309 460 100 MP stroke
6 -1 5 0 6 0 5 0 5 -1 6 0 5 0 5 -1 
6 0 5 0 5 -1 6 0 5 0 6 0 5 -1 5 0 
6 0 5 -1 5 0 6 0 5 0 5 -1 6 0 5 0 
5 -1 6 0 5 0 6 -1 5 0 5 0 6 0 5 -1 
5 0 6 0 5 0 5 -1 6 0 5 0 6 -1 5 0 
5 0 6 0 5 -1 5 0 6 0 5 -1 5 0 6 0 
5 0 6 -1 5 0 5 0 6 0 5 -1 5 0 6 0 
5 0 5 -1 6 0 5 0 6 0 5 -1 5 0 6 0 
5 0 5 -1 6 0 5 0 5 0 6 -1 5 0 5 0 
6 0 5 -1 6 0 5 0 5 0 6 0 5 -1 5 0 
6 0 5 0 5 -1 6 0 5 0 6 0 5 0 5 -1 
6 0 5 0 5 0 6 0 5 -1 5 0 6 0 5 0 
6 0 5 -1 5 0 1778 486 100 MP stroke
6 0 5 0 5 0 6 -1 5 0 5 0 6 0 5 0 
5 -1 6 0 5 0 6 0 5 0 5 0 6 -1 5 0 
5 0 6 0 5 0 5 -1 6 0 5 0 6 0 5 0 
5 0 6 -1 5 0 5 0 6 0 5 0 5 0 6 0 
5 -1 6 0 5 0 5 0 6 0 5 0 5 -1 6 0 
5 0 5 0 6 0 5 0 5 0 6 -1 5 0 6 0 
5 0 5 0 6 0 5 0 5 0 6 -1 5 0 5 0 
6 0 5 0 6 0 5 0 5 0 6 -1 5 0 5 0 
6 0 5 0 5 0 6 0 5 0 6 -1 5 0 5 0 
6 0 5 0 5 0 6 0 5 0 5 0 6 -1 5 0 
6 0 5 0 5 0 6 0 5 0 5 0 6 0 5 0 
5 -1 6 0 5 0 5 0 6 0 5 0 6 0 5 0 
5 0 6 0 5 0 1247 499 100 MP stroke
5 -1 6 0 5 0 5 0 6 0 5 0 6 0 5 0 
5 0 6 0 5 0 5 -1 6 0 5 0 5 0 6 0 
5 0 6 0 5 0 5 0 6 0 5 0 5 0 6 0 
5 -1 5 0 6 0 5 0 5 0 6 0 5 0 6 0 
5 0 5 0 6 0 5 0 5 0 6 0 5 0 5 -1 
6 0 5 0 6 0 5 0 5 0 6 0 5 0 5 0 
6 0 5 0 5 0 6 0 5 0 6 0 5 0 5 0 
6 -1 5 0 5 0 6 0 5 0 5 0 6 0 5 0 
5 0 899 504 66 MP stroke
5 117 5 121 5 102 6 87 5 77 5 69 6 62 5 56 
5 52 6 48 5 45 6 42 5 39 5 38 6 35 5 33 
5 32 6 31 5 29 5 28 6 27 5 25 6 25 5 24 
5 23 6 23 5 22 5 21 6 20 5 20 5 19 6 19 
5 18 5 18 6 18 5 17 6 16 5 16 5 16 6 16 
5 15 5 14 6 15 5 14 5 14 6 13 5 14 6 13 
5 12 5 13 6 12 5 12 5 12 6 12 5 11 5 11 
6 11 5 11 6 11 5 10 5 10 6 10 5 10 5 10 
6 9 5 9 5 9 6 9 5 9 6 9 5 8 5 8 
6 8 5 8 5 8 6 8 5 7 5 7 6 7 5 7 
5 7 6 7 5 6 6 6 5 6 5 6 6 6 5 6 
5 5 6 5 5 5 5 5 6 5 5 4 6 5 5 4 
5 3 6 4 5 4 4185 2551 100 MP stroke
5 3 6 3 5 2 5 3 6 2 5 2 6 2 5 1 
5 1 6 1 5 1 5 0 6 0 5 -1 5 -1 6 -1 
5 -2 5 -2 6 -3 5 -3 6 -4 5 -4 5 -5 6 -6 
5 -6 5 -7 6 -8 5 -8 5 -10 6 -10 5 -12 6 -13 
5 -14 5 -16 6 -17 5 -19 5 -21 6 -24 5 -26 5 -29 
6 -33 5 -37 6 -42 5 -48 5 -56 6 -65 5 -78 5 -95 
6 -121 5 -161 5 -237 6 -428 1 -413 3905 4616 54 MP stroke
6 0 5 -1 6 0 5 -1 5 0 6 -1 5 0 5 -1 
6 0 5 -1 5 -1 6 0 5 -1 6 0 5 -1 5 0 
6 -1 5 0 5 -1 6 -1 5 0 5 -1 6 0 5 -1 
6 0 5 -1 5 -1 6 0 5 -1 5 -1 6 0 5 -1 
5 -1 6 0 5 -1 6 -1 5 0 5 -1 6 -1 5 0 
5 -1 6 -1 5 -1 5 0 6 -1 5 -1 5 -1 6 0 
5 -1 6 -1 5 -1 5 0 6 -1 5 -1 5 -1 6 -1 
5 -1 5 0 6 -1 5 -1 6 -1 5 -1 5 -1 6 -1 
5 -1 5 -1 6 -1 5 -1 5 0 6 -1 5 -1 6 -1 
5 -1 5 -1 6 -1 5 -1 5 -2 6 -1 5 -1 5 -1 
6 -1 5 -1 5 -1 6 -1 5 -1 6 -1 5 -2 5 -1 
6 -1 5 -1 5 -1 6 -2 5 -1 5 -1 6 -1 5 -2 
6 -1 5 -1 5 -2 5724 2662 100 MP stroke
6 -1 5 -1 5 -2 6 -1 5 -2 5 -1 6 -1 5 -2 
6 -1 5 -2 5 -1 6 -2 5 -1 5 -2 6 -1 5 -2 
5 -2 6 -1 5 -2 6 -2 5 -1 5 -2 6 -2 5 -2 
5 -1 6 -2 5 -2 5 -2 6 -2 5 -1 5 -2 6 -2 
5 -2 6 -2 5 -2 5 -2 6 -2 5 -2 5 -2 6 -3 
5 -2 5 -2 6 -2 5 -2 6 -3 5 -2 5 -2 6 -3 
5 -2 5 -2 6 -3 5 -2 5 -3 6 -2 5 -3 6 -2 
5 -3 5 -3 6 -3 5 -2 5 -3 6 -3 5 -3 5 -3 
6 -3 5 -3 5 -3 6 -3 5 -3 6 -3 5 -3 5 -3 
6 -4 5 -3 5 -3 6 -4 5 -3 5 -4 6 -3 5 -4 
6 -4 5 -3 5 -4 6 -4 5 -4 5 -4 6 -4 5 -4 
5 -4 6 -4 5 -5 6 -4 5 -4 5 -5 6 -4 5 -5 
5 -5 6 -4 5 -5 5193 2922 100 MP stroke
5 -5 6 -5 5 -5 5 -6 6 -5 5 -5 6 -6 5 -5 
5 -6 6 -6 5 -6 5 -6 6 -6 5 -6 5 -6 6 -7 
5 -7 6 -6 5 -7 5 -7 6 -7 5 -7 5 -8 6 -7 
5 -8 5 -8 6 -8 5 -8 6 -9 5 -9 5 -8 6 -9 
5 -10 5 -9 6 -10 5 -10 5 -10 6 -10 5 -11 6 -11 
5 -11 5 -12 6 -12 5 -12 5 -13 6 -12 5 -14 5 -14 
6 -14 5 -14 5 -16 6 -15 5 -16 6 -17 5 -18 5 -18 
6 -18 5 -20 5 -20 6 -21 5 -22 5 -23 6 -25 5 -25 
6 -27 5 -28 5 -30 6 -31 5 -34 5 -36 6 -38 5 -41 
5 -45 6 -48 5 -53 6 -59 5 -66 5 -74 6 -85 5 -100 
5 -120 3 -82 4756 4616 83 MP stroke
DA
/c9 { 1.000000 0.000000 0.000000 sr} bdef
c9
3 531 5 359 6 228 5 169 5 135 6 111 5 95 5 82 
6 72 5 64 6 55 5 49 5 42 6 35 5 28 5 20 
6 10 5 -2 5 -17 6 -38 5 -72 5 -131 6 -263 5 -903 
6 810 5 609 5 381 6 301 5 264 5 243 6 230 5 217 
5 193 6 149 5 85 6 28 5 -4 5 -15 6 -16 5 -12 
5 -9 6 -5 5 -2 5 1 6 3 5 4 6 5 5 6 
5 6 6 6 5 5 5 6 6 5 5 4 5 4 6 3 
5 2 5 2 6 1 5 1 6 0 5 0 5 -1 6 -1 
5 -2 5 -1 6 -2 5 -2 5 -3 6 -2 5 -3 6 -2 
5 -3 5 -2 6 -3 5 -2 5 -3 6 -2 5 -2 5 -2 
6 -3 5 -2 6 -2 5 -1 5 -2 6 -2 5 -1 5 -2 
6 -1 5 -1 5 -2 6 -1 5 -1 6 0 5 -1 5 -1 
6 -1 5 0 5 -1 3231 509 100 MP stroke
6 0 5 0 5 0 6 -1 5 0 5 0 6 0 5 1 
6 0 5 0 5 0 6 1 5 0 5 0 6 1 5 0 
5 1 6 0 5 1 6 1 5 0 5 1 6 1 5 0 
5 1 6 1 5 1 5 1 6 0 5 1 6 1 5 1 
5 1 6 1 5 1 5 1 6 1 5 1 5 0 6 1 
5 1 5 1 6 1 5 1 6 1 5 1 5 1 6 1 
5 1 5 1 6 0 5 1 5 1 6 1 5 1 6 1 
5 1 5 1 6 0 5 1 5 1 6 1 5 1 5 0 
6 1 5 1 6 1 5 0 5 1 6 1 5 0 5 1 
6 1 5 0 5 1 6 1 5 0 5 1 6 0 5 1 
6 0 5 1 5 0 6 1 5 0 5 1 6 0 5 1 
5 0 6 0 5 1 6 0 5 0 5 1 6 0 5 0 
5 1 6 0 5 0 2700 449 100 MP stroke
5 1 6 0 5 0 6 0 5 0 5 1 6 0 5 0 
5 0 6 0 5 0 5 0 6 1 5 0 6 0 5 0 
5 0 6 0 5 0 5 0 6 0 5 0 5 0 6 0 
5 0 5 0 6 0 5 0 6 0 5 0 5 0 6 0 
5 -1 5 0 6 0 5 0 5 0 6 0 5 0 6 0 
5 0 5 -1 6 0 5 0 5 0 6 0 5 0 5 -1 
6 0 5 0 6 0 5 0 5 -1 6 0 5 0 5 0 
6 -1 5 0 5 0 6 0 5 0 5 -1 6 0 5 0 
6 0 5 -1 5 0 6 0 5 0 5 -1 6 0 5 0 
5 -1 6 0 5 0 6 0 5 -1 5 0 6 0 5 -1 
5 0 6 0 5 0 5 -1 6 0 5 0 6 -1 5 0 
5 0 6 0 5 -1 5 0 6 0 5 -1 5 0 6 0 
5 0 5 -1 6 0 2169 462 100 MP stroke
5 0 6 -1 5 0 5 0 6 -1 5 0 5 0 6 0 
5 -1 5 0 6 0 5 -1 6 0 5 0 5 0 6 -1 
5 0 5 0 6 -1 5 0 5 0 6 -1 5 0 6 0 
5 0 5 -1 6 0 5 0 5 -1 6 0 5 0 5 0 
6 -1 5 0 6 0 5 0 5 -1 6 0 5 0 5 -1 
6 0 5 0 5 0 6 -1 5 0 5 0 6 0 5 -1 
6 0 5 0 5 0 6 -1 5 0 5 0 6 0 5 -1 
5 0 6 0 5 0 6 -1 5 0 5 0 6 0 5 -1 
5 0 6 0 5 0 5 -1 6 0 5 0 6 0 5 0 
5 -1 6 0 5 0 5 0 6 -1 5 0 5 0 6 0 
5 0 5 -1 6 0 5 0 6 0 5 0 5 -1 6 0 
5 0 5 0 6 0 5 -1 5 0 6 0 5 0 6 0 
5 -1 5 0 6 0 1638 487 100 MP stroke
5 0 5 0 6 -1 5 0 5 0 6 0 5 0 6 0 
5 -1 5 0 6 0 5 0 5 0 6 0 5 -1 5 0 
6 0 5 0 5 0 6 0 5 -1 6 0 5 0 5 0 
6 0 5 0 5 -1 6 0 5 0 5 0 6 0 5 0 
6 -1 5 0 5 0 6 0 5 0 5 0 6 0 5 -1 
5 0 6 0 5 0 6 0 5 0 5 0 6 0 5 -1 
5 0 6 0 5 0 5 0 6 0 5 0 6 0 5 -1 
5 0 6 0 5 0 5 0 6 0 5 0 5 0 6 -1 
5 0 5 0 6 0 5 0 6 0 5 0 5 0 6 0 
5 -1 5 0 6 0 5 0 5 0 6 0 5 0 6 0 
5 0 5 0 6 -1 5 0 5 0 6 0 5 0 5 0 
6 0 5 0 6 0 5 0 5 0 6 -1 5 0 5 0 
6 0 5 0 5 0 1108 500 100 MP stroke
6 0 5 0 5 0 6 0 5 0 6 -1 5 0 5 0 
6 0 5 0 5 0 6 0 5 0 5 0 6 0 5 0 
6 0 5 0 5 -1 6 0 5 0 5 0 6 0 5 0 
5 0 6 0 5 0 6 0 5 0 5 0 6 0 5 0 
5 0 6 -1 5 0 5 0 6 0 5 0 5 0 899 503 40 MP stroke
0 1 6 143 5 117 5 98 6 85 5 74 5 67 6 61 
5 55 5 51 6 47 5 44 5 42 6 39 5 36 6 35 
5 33 5 32 6 30 5 29 5 27 6 27 5 26 5 24 
6 24 5 23 6 22 5 22 5 21 6 20 5 20 5 19 
6 19 5 18 5 17 6 18 5 17 6 16 5 16 5 16 
6 15 5 15 5 15 6 14 5 14 5 14 6 13 5 13 
6 13 5 13 5 13 6 12 5 12 5 11 6 12 5 11 
5 11 6 11 5 11 5 10 6 11 5 10 6 10 5 10 
5 9 6 10 5 9 5 9 6 9 5 8 5 9 6 8 
5 8 6 8 5 8 5 8 6 8 5 7 5 7 6 7 
5 7 5 7 6 6 5 7 6 6 5 6 5 6 6 6 
5 5 5 6 6 5 5 5 5 5 6 5 5 4 5 4 
6 4 5 4 6 4 4072 2557 100 MP stroke
5 3 5 4 6 3 5 3 5 2 6 3 5 2 5 2 
6 1 5 1 6 1 5 1 5 1 6 0 5 0 5 -1 
6 -1 5 -1 5 -2 6 -2 5 -3 6 -3 5 -3 5 -4 
6 -5 5 -5 5 -6 6 -6 5 -7 5 -8 6 -9 5 -9 
5 -11 6 -11 5 -13 6 -14 5 -15 5 -17 6 -18 5 -20 
5 -22 6 -24 5 -27 5 -29 6 -33 5 -37 6 -41 5 -46 
5 -53 6 -62 5 -71 5 -85 6 -105 5 -132 5 -177 6 -265 
5 -512 2 -171 3765 4616 59 MP stroke
6 0 5 -1 6 0 5 0 5 -1 6 0 5 -1 5 0 
6 0 5 -1 5 0 6 -1 5 0 6 -1 5 0 5 0 
6 -1 5 0 5 -1 6 0 5 -1 5 0 6 -1 5 0 
6 -1 5 0 5 -1 6 0 5 -1 5 0 6 -1 5 0 
5 -1 6 0 5 -1 6 0 5 -1 5 -1 6 0 5 -1 
5 0 6 -1 5 0 5 -1 6 -1 5 0 5 -1 6 0 
5 -1 6 -1 5 0 5 -1 6 -1 5 0 5 -1 6 -1 
5 0 5 -1 6 -1 5 0 6 -1 5 -1 5 0 6 -1 
5 -1 5 -1 6 0 5 -1 5 -1 6 -1 5 0 6 -1 
5 -1 5 -1 6 -1 5 -1 5 0 6 -1 5 -1 5 -1 
6 -1 5 -1 5 -1 6 0 5 -1 6 -1 5 -1 5 -1 
6 -1 5 -1 5 -1 6 -1 5 -1 5 -1 6 -1 5 -1 
6 -1 5 -1 5 -1 5724 2636 100 MP stroke
6 -1 5 -1 5 -1 6 -1 5 -1 5 -2 6 -1 5 -1 
6 -1 5 -1 5 -1 6 -2 5 -1 5 -1 6 -1 5 -1 
5 -2 6 -1 5 -1 6 -2 5 -1 5 -1 6 -2 5 -1 
5 -1 6 -2 5 -1 5 -2 6 -1 5 -2 5 -1 6 -1 
5 -2 6 -2 5 -1 5 -2 6 -1 5 -2 5 -1 6 -2 
5 -2 5 -1 6 -2 5 -2 6 -2 5 -1 5 -2 6 -2 
5 -2 5 -2 6 -1 5 -2 5 -2 6 -2 5 -2 6 -2 
5 -2 5 -2 6 -2 5 -2 5 -2 6 -3 5 -2 5 -2 
6 -2 5 -2 5 -3 6 -2 5 -2 6 -3 5 -2 5 -2 
6 -3 5 -2 5 -3 6 -2 5 -3 5 -3 6 -2 5 -3 
6 -3 5 -2 5 -3 6 -3 5 -3 5 -3 6 -3 5 -3 
5 -3 6 -3 5 -3 6 -3 5 -3 5 -4 6 -3 5 -3 
5 -4 6 -3 5 -4 5193 2833 100 MP stroke
5 -3 6 -4 5 -3 5 -4 6 -4 5 -4 6 -4 5 -3 
5 -4 6 -4 5 -5 5 -4 6 -4 5 -4 5 -5 6 -4 
5 -5 6 -4 5 -5 5 -5 6 -4 5 -5 5 -5 6 -5 
5 -6 5 -5 6 -5 5 -6 6 -5 5 -6 5 -5 6 -6 
5 -6 5 -6 6 -6 5 -7 5 -6 6 -6 5 -7 6 -7 
5 -7 5 -7 6 -7 5 -7 5 -8 6 -7 5 -8 5 -8 
6 -8 5 -8 5 -9 6 -9 5 -9 6 -9 5 -9 5 -9 
6 -10 5 -10 5 -10 6 -11 5 -11 5 -11 6 -11 5 -12 
6 -12 5 -12 5 -13 6 -13 5 -13 5 -14 6 -14 5 -15 
5 -15 6 -16 5 -17 6 -17 5 -17 5 -18 6 -19 5 -20 
5 -20 6 -22 5 -22 5 -23 6 -25 5 -26 5 -27 6 -28 
5 -30 6 -32 5 -34 5 -37 6 -39 5 -42 5 -45 6 -50 
5 -54 5 -60 6 -68 4662 4173 100 MP stroke
5 -76 6 -88 5 -104 5 -127 2 -48 4639 4616 6 MP stroke
DD
/c10 { 0.000000 1.000000 0.000000 sr} bdef
c10
1 75 5 596 6 301 5 204 5 156 6 125 5 105 6 91 
5 78 5 69 6 61 5 53 5 46 6 40 5 33 5 26 
6 18 5 8 5 -3 6 -18 5 -38 6 -68 5 -118 5 -217 
6 -518 5 -201 5 804 6 315 5 16 5 -125 6 1705 5 540 
6 -53 5 26 5 29 6 9 5 -7 5 -14 6 -15 5 -12 
5 -8 6 -5 5 -2 6 0 5 2 5 4 6 5 5 5 
5 6 6 6 5 6 5 5 6 5 5 5 5 3 6 4 
5 2 6 2 5 2 5 1 6 0 5 0 5 -1 6 -1 
5 -1 5 -2 6 -2 5 -2 6 -2 5 -2 5 -3 6 -2 
5 -3 5 -2 6 -3 5 -2 5 -3 6 -2 5 -2 6 -3 
5 -2 5 -2 6 -2 5 -2 5 -1 6 -2 5 -2 5 -1 
6 -2 5 -1 6 -1 5 -1 5 -1 6 -1 5 -1 5 -1 
6 0 5 -1 5 0 3215 508 100 MP stroke
6 -1 5 0 5 0 6 0 5 -1 6 0 5 0 5 1 
6 0 5 0 5 0 6 0 5 1 5 0 6 1 5 0 
6 1 5 0 5 1 6 0 5 1 5 1 6 0 5 1 
5 1 6 1 5 0 6 1 5 1 5 1 6 1 5 1 
5 1 6 0 5 1 5 1 6 1 5 1 5 1 6 1 
5 1 6 1 5 1 5 1 6 1 5 0 5 1 6 1 
5 1 5 1 6 1 5 1 6 1 5 1 5 1 6 0 
5 1 5 1 6 1 5 1 5 1 6 0 5 1 6 1 
5 1 5 0 6 1 5 1 5 1 6 0 5 1 5 1 
6 0 5 1 5 1 6 0 5 1 6 0 5 1 5 1 
6 0 5 1 5 0 6 1 5 0 5 0 6 1 5 0 
6 1 5 0 5 1 6 0 5 0 5 1 6 0 5 0 
5 1 6 0 5 0 2684 449 100 MP stroke
6 0 5 1 5 0 6 0 5 0 5 0 6 1 5 0 
5 0 6 0 5 0 6 0 5 0 5 1 6 0 5 0 
5 0 6 0 5 0 5 0 6 0 5 0 5 0 6 0 
5 0 6 0 5 0 5 0 6 0 5 0 5 0 6 0 
5 0 5 -1 6 0 5 0 6 0 5 0 5 0 6 0 
5 0 5 -1 6 0 5 0 5 0 6 0 5 0 6 -1 
5 0 5 0 6 0 5 0 5 -1 6 0 5 0 5 0 
6 0 5 -1 5 0 6 0 5 0 6 -1 5 0 5 0 
6 0 5 -1 5 0 6 0 5 0 5 -1 6 0 5 0 
6 0 5 -1 5 0 6 0 5 -1 5 0 6 0 5 0 
5 -1 6 0 5 0 6 -1 5 0 5 0 6 0 5 -1 
5 0 6 0 5 -1 5 0 6 0 5 0 5 -1 6 0 
5 0 6 -1 5 0 2153 462 100 MP stroke
5 0 6 -1 5 0 5 0 6 0 5 -1 5 0 6 0 
5 -1 6 0 5 0 5 0 6 -1 5 0 5 0 6 -1 
5 0 5 0 6 -1 5 0 6 0 5 0 5 -1 6 0 
5 0 5 -1 6 0 5 0 5 0 6 -1 5 0 6 0 
5 0 5 -1 6 0 5 0 5 -1 6 0 5 0 5 0 
6 -1 5 0 5 0 6 0 5 -1 6 0 5 0 5 0 
6 -1 5 0 5 0 6 -1 5 0 5 0 6 0 5 -1 
6 0 5 0 5 0 6 0 5 -1 5 0 6 0 5 0 
5 -1 6 0 5 0 6 0 5 -1 5 0 6 0 5 0 
5 -1 6 0 5 0 5 0 6 0 5 -1 5 0 6 0 
5 0 6 0 5 -1 5 0 6 0 5 0 5 -1 6 0 
5 0 5 0 6 0 5 -1 6 0 5 0 5 0 6 0 
5 -1 5 0 6 0 1622 487 100 MP stroke
5 0 5 0 6 0 5 -1 6 0 5 0 5 0 6 0 
5 -1 5 0 6 0 5 0 5 0 6 0 5 -1 5 0 
6 0 5 0 6 0 5 0 5 -1 6 0 5 0 5 0 
6 0 5 0 5 -1 6 0 5 0 6 0 5 0 5 0 
6 0 5 -1 5 0 6 0 5 0 5 0 6 0 5 0 
6 -1 5 0 5 0 6 0 5 0 5 0 6 0 5 -1 
5 0 6 0 5 0 6 0 5 0 5 0 6 0 5 -1 
5 0 6 0 5 0 5 0 6 0 5 0 5 0 6 0 
5 -1 6 0 5 0 5 0 6 0 5 0 5 0 6 0 
5 0 5 -1 6 0 5 0 6 0 5 0 5 0 6 0 
5 0 5 0 6 0 5 -1 5 0 6 0 5 0 6 0 
5 0 5 0 6 0 5 0 5 0 6 -1 5 0 5 0 
6 0 5 0 5 0 1092 500 100 MP stroke
6 0 5 0 6 0 5 0 5 0 6 0 5 -1 5 0 
6 0 5 0 5 0 6 0 5 0 6 0 5 0 5 0 
6 0 5 0 5 0 6 -1 5 0 5 0 6 0 5 0 
6 0 5 0 5 0 6 0 5 0 5 0 6 0 5 0 
5 0 6 0 5 -1 5 0 899 503 37 MP stroke
3 70 5 129 5 108 6 91 5 80 5 71 6 64 5 58 
5 53 6 50 5 46 6 42 5 40 5 38 6 36 5 34 
5 33 6 30 5 30 5 28 6 27 5 27 6 25 5 24 
5 23 6 23 5 22 5 21 6 21 5 20 5 19 6 19 
5 19 6 18 5 17 5 17 6 17 5 16 5 16 6 16 
5 15 5 15 6 14 5 14 6 14 5 14 5 13 6 13 
5 13 5 13 6 12 5 12 5 12 6 12 5 11 5 11 
6 11 5 11 6 11 5 10 5 10 6 10 5 10 5 10 
6 9 5 10 5 9 6 9 5 8 6 9 5 9 5 8 
6 8 5 8 5 8 6 7 5 8 5 7 6 7 5 7 
6 7 5 7 5 6 6 7 5 6 5 6 6 6 5 5 
5 6 6 5 5 5 5 5 6 5 5 4 6 5 5 4 
5 4 6 4 5 4 4051 2555 100 MP stroke
5 3 6 3 5 3 5 3 6 2 5 2 6 2 5 2 
5 2 6 1 5 1 5 0 6 1 5 0 5 -1 6 0 
5 -1 6 -2 5 -2 5 -2 6 -3 5 -3 5 -4 6 -4 
5 -5 5 -5 6 -6 5 -7 5 -7 6 -9 5 -9 6 -10 
5 -10 5 -12 6 -13 5 -15 5 -15 6 -18 5 -18 5 -21 
6 -23 5 -25 6 -27 5 -31 5 -34 6 -38 5 -43 5 -49 
6 -56 5 -64 5 -76 6 -91 5 -112 6 -145 5 -200 5 -316 
4 -554 3747 4616 58 MP stroke
6 -1 5 0 6 -1 5 0 5 0 6 -1 5 0 5 -1 
6 0 5 0 5 -1 6 0 5 -1 6 0 5 0 5 -1 
6 0 5 -1 5 0 6 -1 5 0 5 -1 6 0 5 0 
6 -1 5 0 5 -1 6 0 5 -1 5 0 6 -1 5 0 
5 -1 6 0 5 -1 6 0 5 -1 5 -1 6 0 5 -1 
5 0 6 -1 5 0 5 -1 6 0 5 -1 5 -1 6 0 
5 -1 6 0 5 -1 5 -1 6 0 5 -1 5 -1 6 0 
5 -1 5 -1 6 0 5 -1 6 -1 5 0 5 -1 6 -1 
5 0 5 -1 6 -1 5 -1 5 0 6 -1 5 -1 6 -1 
5 0 5 -1 6 -1 5 -1 5 0 6 -1 5 -1 5 -1 
6 -1 5 -1 5 0 6 -1 5 -1 6 -1 5 -1 5 -1 
6 -1 5 -1 5 -1 6 -1 5 0 5 -1 6 -1 5 -1 
6 -1 5 -1 5 -1 5724 2632 100 MP stroke
6 -1 5 -1 5 -1 6 -2 5 -1 5 -1 6 -1 5 -1 
6 -1 5 -1 5 -1 6 -1 5 -2 5 -1 6 -1 5 -1 
5 -1 6 -2 5 -1 6 -1 5 -1 5 -2 6 -1 5 -1 
5 -2 6 -1 5 -1 5 -2 6 -1 5 -1 5 -2 6 -1 
5 -2 6 -1 5 -2 5 -1 6 -2 5 -1 5 -2 6 -1 
5 -2 5 -2 6 -1 5 -2 6 -2 5 -1 5 -2 6 -2 
5 -1 5 -2 6 -2 5 -2 5 -2 6 -1 5 -2 6 -2 
5 -2 5 -2 6 -2 5 -2 5 -2 6 -2 5 -2 5 -2 
6 -2 5 -3 5 -2 6 -2 5 -2 6 -2 5 -3 5 -2 
6 -2 5 -3 5 -2 6 -3 5 -2 5 -3 6 -2 5 -3 
6 -2 5 -3 5 -3 6 -2 5 -3 5 -3 6 -3 5 -2 
5 -3 6 -3 5 -3 6 -3 5 -3 5 -3 6 -3 5 -4 
5 -3 6 -3 5 -3 5193 2820 100 MP stroke
5 -4 6 -3 5 -4 5 -3 6 -4 5 -3 6 -4 5 -4 
5 -4 6 -3 5 -4 5 -4 6 -4 5 -4 5 -4 6 -5 
5 -4 6 -4 5 -5 5 -4 6 -5 5 -4 5 -5 6 -5 
5 -5 5 -5 6 -5 5 -5 6 -5 5 -5 5 -6 6 -5 
5 -6 5 -5 6 -6 5 -6 5 -6 6 -6 5 -6 6 -6 
5 -7 5 -6 6 -7 5 -7 5 -7 6 -7 5 -7 5 -8 
6 -7 5 -8 5 -8 6 -8 5 -8 6 -8 5 -9 5 -9 
6 -9 5 -9 5 -9 6 -10 5 -10 5 -10 6 -10 5 -11 
6 -11 5 -11 5 -11 6 -12 5 -12 5 -13 6 -13 5 -13 
5 -13 6 -15 5 -14 6 -15 5 -16 5 -16 6 -16 5 -17 
5 -18 6 -19 5 -19 5 -20 6 -21 5 -22 5 -22 6 -24 
5 -25 6 -27 5 -27 5 -30 6 -31 5 -32 5 -36 6 -37 
5 -40 5 -44 6 -47 4662 3963 100 MP stroke
5 -52 6 -56 5 -64 5 -71 6 -81 5 -95 5 -113 5 -121 
4620 4616 9 MP stroke
gr

c10
DD
0 sg
%%IncludeResource: font Helvetica
/Helvetica /ISOLatin1Encoding 120 FMSR

3559 4940 mt 
(f) s
 558 2634 mt  -90 rotate
(|H\(f\)|) s
90 rotate
2641  293 mt 
(Risposta in frequenza di filtri ellittici) s
 882 4658 mt 
( ) s
6239  430 mt 
( ) s
SO
1 sg
0 480 729 0 0 -480 5466 928 4 MP
PP
-729 0 0 480 729 0 0 -480 5466 928 5 MP stroke
4 w
DO
SO
6 w
0 sg
5466  928 mt 6195  928 L
5466  448 mt 6195  448 L
5466  928 mt 5466  448 L
6195  928 mt 6195  448 L
5466  928 mt 6195  928 L
5466  928 mt 5466  448 L
5466  928 mt 6195  928 L
5466  448 mt 6195  448 L
5466  928 mt 5466  448 L
6195  928 mt 6195  448 L
5925  581 mt 
(N=4) s
gs 5466 448 730 481 MR c np
c8
353 0 5536 538 2 MP stroke
gr

c8
0 sg
5925  731 mt 
(N=6) s
gs 5466 448 730 481 MR c np
DA
c9
353 0 5536 688 2 MP stroke
SO
gr

c9
0 sg
5925  880 mt 
(N=8) s
gs 5466 448 730 481 MR c np
DD
c10
353 0 5536 837 2 MP stroke
SO
gr

c10

end %%Color Dict

eplot
%%EndObject

epage
end

showpage

%%Trailer
%%EOF
