%!PS-Adobe-2.0 EPSF-1.2
%%Creator: MATLAB, The Mathworks, Inc. Version 7.5.0.338 (R2007b). Operating System: Linux 2.6.35-32-generic #67-Ubuntu SMP Mon Mar 5 19:39:49 UTC 2012 x86_64.
%%Title: ./filtri_chebyshev-II.eps
%%CreationDate: 04/20/2012  16:44:03
%%DocumentNeededFonts: Helvetica
%%DocumentProcessColors: Cyan Magenta Yellow Black
%%Extensions: CMYK
%%Pages: 1
%%BoundingBox:    48   196   550   608
%%EndComments

%%BeginProlog
% MathWorks dictionary
/MathWorks 160 dict begin
% definition operators
/bdef {bind def} bind def
/ldef {load def} bind def
/xdef {exch def} bdef
/xstore {exch store} bdef
% operator abbreviations
/c  /clip ldef
/cc /concat ldef
/cp /closepath ldef
/gr /grestore ldef
/gs /gsave ldef
/mt /moveto ldef
/np /newpath ldef
/cm /currentmatrix ldef
/sm /setmatrix ldef
/rm /rmoveto ldef
/rl /rlineto ldef
/s {show newpath} bdef
/sc {setcmykcolor} bdef
/sr /setrgbcolor ldef
/sg /setgray ldef
/w /setlinewidth ldef
/j /setlinejoin ldef
/cap /setlinecap ldef
/rc {rectclip} bdef
/rf {rectfill} bdef
% page state control
/pgsv () def
/bpage {/pgsv save def} bdef
/epage {pgsv restore} bdef
/bplot /gsave ldef
/eplot {stroke grestore} bdef
% orientation switch
/portraitMode 0 def /landscapeMode 1 def /rotateMode 2 def
% coordinate system mappings
/dpi2point 0 def
% font control
/FontSize 0 def
/FMS {/FontSize xstore findfont [FontSize 0 0 FontSize neg 0 0]
  makefont setfont} bdef
/reencode {exch dup where {pop load} {pop StandardEncoding} ifelse
  exch dup 3 1 roll findfont dup length dict begin
  { 1 index /FID ne {def}{pop pop} ifelse } forall
  /Encoding exch def currentdict end definefont pop} bdef
/isroman {findfont /CharStrings get /Agrave known} bdef
/FMSR {3 1 roll 1 index dup isroman {reencode} {pop pop} ifelse
  exch FMS} bdef
/csm {1 dpi2point div -1 dpi2point div scale neg translate
 dup landscapeMode eq {pop -90 rotate}
  {rotateMode eq {90 rotate} if} ifelse} bdef
% line types: solid, dotted, dashed, dotdash
/SO { [] 0 setdash } bdef
/DO { [.5 dpi2point mul 4 dpi2point mul] 0 setdash } bdef
/DA { [6 dpi2point mul] 0 setdash } bdef
/DD { [.5 dpi2point mul 4 dpi2point mul 6 dpi2point mul 4
  dpi2point mul] 0 setdash } bdef
% macros for lines and objects
/L {lineto stroke} bdef
/MP {3 1 roll moveto 1 sub {rlineto} repeat} bdef
/AP {{rlineto} repeat} bdef
/PDlw -1 def
/W {/PDlw currentlinewidth def setlinewidth} def
/PP {closepath eofill} bdef
/DP {closepath stroke} bdef
/MR {4 -2 roll moveto dup  0 exch rlineto exch 0 rlineto
  neg 0 exch rlineto closepath} bdef
/FR {MR stroke} bdef
/PR {MR fill} bdef
/L1i {{currentfile picstr readhexstring pop} image} bdef
/tMatrix matrix def
/MakeOval {newpath tMatrix currentmatrix pop translate scale
0 0 1 0 360 arc tMatrix setmatrix} bdef
/FO {MakeOval stroke} bdef
/PO {MakeOval fill} bdef
/PD {currentlinewidth 2 div 0 360 arc fill
   PDlw -1 eq not {PDlw w /PDlw -1 def} if} def
/FA {newpath tMatrix currentmatrix pop translate scale
  0 0 1 5 -2 roll arc tMatrix setmatrix stroke} bdef
/PA {newpath tMatrix currentmatrix pop	translate 0 0 moveto scale
  0 0 1 5 -2 roll arc closepath tMatrix setmatrix fill} bdef
/FAn {newpath tMatrix currentmatrix pop translate scale
  0 0 1 5 -2 roll arcn tMatrix setmatrix stroke} bdef
/PAn {newpath tMatrix currentmatrix pop translate 0 0 moveto scale
  0 0 1 5 -2 roll arcn closepath tMatrix setmatrix fill} bdef
/vradius 0 def /hradius 0 def /lry 0 def
/lrx 0 def /uly 0 def /ulx 0 def /rad 0 def
/MRR {/vradius xdef /hradius xdef /lry xdef /lrx xdef /uly xdef
  /ulx xdef newpath tMatrix currentmatrix pop ulx hradius add uly
  vradius add translate hradius vradius scale 0 0 1 180 270 arc 
  tMatrix setmatrix lrx hradius sub uly vradius add translate
  hradius vradius scale 0 0 1 270 360 arc tMatrix setmatrix
  lrx hradius sub lry vradius sub translate hradius vradius scale
  0 0 1 0 90 arc tMatrix setmatrix ulx hradius add lry vradius sub
  translate hradius vradius scale 0 0 1 90 180 arc tMatrix setmatrix
  closepath} bdef
/FRR {MRR stroke } bdef
/PRR {MRR fill } bdef
/MlrRR {/lry xdef /lrx xdef /uly xdef /ulx xdef /rad lry uly sub 2 div def
  newpath tMatrix currentmatrix pop ulx rad add uly rad add translate
  rad rad scale 0 0 1 90 270 arc tMatrix setmatrix lrx rad sub lry rad
  sub translate rad rad scale 0 0 1 270 90 arc tMatrix setmatrix
  closepath} bdef
/FlrRR {MlrRR stroke } bdef
/PlrRR {MlrRR fill } bdef
/MtbRR {/lry xdef /lrx xdef /uly xdef /ulx xdef /rad lrx ulx sub 2 div def
  newpath tMatrix currentmatrix pop ulx rad add uly rad add translate
  rad rad scale 0 0 1 180 360 arc tMatrix setmatrix lrx rad sub lry rad
  sub translate rad rad scale 0 0 1 0 180 arc tMatrix setmatrix
  closepath} bdef
/FtbRR {MtbRR stroke } bdef
/PtbRR {MtbRR fill } bdef
/stri 6 array def /dtri 6 array def
/smat 6 array def /dmat 6 array def
/tmat1 6 array def /tmat2 6 array def /dif 3 array def
/asub {/ind2 exch def /ind1 exch def dup dup
  ind1 get exch ind2 get sub exch } bdef
/tri_to_matrix {
  2 0 asub 3 1 asub 4 0 asub 5 1 asub
  dup 0 get exch 1 get 7 -1 roll astore } bdef
/compute_transform {
  dmat dtri tri_to_matrix tmat1 invertmatrix 
  smat stri tri_to_matrix tmat2 concatmatrix } bdef
/ds {stri astore pop} bdef
/dt {dtri astore pop} bdef
/db {2 copy /cols xdef /rows xdef mul dup 3 mul string
  currentfile exch readhexstring pop
  dup 0 3 index getinterval /rbmap xdef
  dup 2 index dup getinterval /gbmap xdef
  1 index dup 2 mul exch getinterval /bbmap xdef pop pop}bdef
/it {gs np dtri aload pop moveto lineto lineto cp c
  cols rows 8 compute_transform 
  rbmap gbmap bbmap true 3 colorimage gr}bdef
/il {newpath moveto lineto stroke}bdef
currentdict end def
%%EndProlog

%%BeginSetup
MathWorks begin

0 cap

end
%%EndSetup

%%Page: 1 1
%%BeginPageSetup
%%PageBoundingBox:    48   196   550   608
MathWorks begin
bpage
%%EndPageSetup

%%BeginObject: obj1
bplot

/dpi2point 12 def
portraitMode 0216 7344 csm

  368    45  6025  4947 MR c np
86 dict begin %Colortable dictionary
/c0 { 0.000000 0.000000 0.000000 sr} bdef
/c1 { 1.000000 1.000000 1.000000 sr} bdef
/c2 { 0.900000 0.000000 0.000000 sr} bdef
/c3 { 0.000000 0.820000 0.000000 sr} bdef
/c4 { 0.000000 0.000000 0.800000 sr} bdef
/c5 { 0.910000 0.820000 0.320000 sr} bdef
/c6 { 1.000000 0.260000 0.820000 sr} bdef
/c7 { 0.000000 0.820000 0.820000 sr} bdef
c0
1 j
1 sg
   0    0 6913 5186 PR
6 w
0 4226 5356 0 0 -4226 899 4615 4 MP
PP
-5356 0 0 4226 5356 0 0 -4226 899 4615 5 MP stroke
4 w
DO
0 sg
 899 4615 mt  899  389 L
 899  389 mt  899  389 L
2684 4615 mt 2684  389 L
2684  389 mt 2684  389 L
4469 4615 mt 4469  389 L
4469  389 mt 4469  389 L
6255 4615 mt 6255  389 L
6255  389 mt 6255  389 L
 899 4615 mt 6255 4615 L
6255 4615 mt 6255 4615 L
 899 2778 mt 6255 2778 L
6255 2778 mt 6255 2778 L
 899  941 mt 6255  941 L
6255  941 mt 6255  941 L
SO
6 w
 899 4615 mt 6255 4615 L
 899  389 mt 6255  389 L
 899 4615 mt  899  389 L
6255 4615 mt 6255  389 L
 899 4615 mt 6255 4615 L
 899 4615 mt  899  389 L
 899 4615 mt  899 4588 L
 899  389 mt  899  415 L
DO
 899 4615 mt  899  389 L
 899  389 mt  899  389 L
SO
 899 4615 mt  899 4561 L
 899  389 mt  899  442 L
%%IncludeResource: font Helvetica
/Helvetica /ISOLatin1Encoding 120 FMSR

 787 4797 mt 
(10) s
%%IncludeResource: font Helvetica
/Helvetica /ISOLatin1Encoding 80 FMSR

 920 4723 mt 
(-1) s
1436 4615 mt 1436 4588 L
1436  389 mt 1436  415 L
DO
1436 4615 mt 1436  389 L
1436  389 mt 1436  389 L
SO
1750 4615 mt 1750 4588 L
1750  389 mt 1750  415 L
DO
1750 4615 mt 1750  389 L
1750  389 mt 1750  389 L
SO
1973 4615 mt 1973 4588 L
1973  389 mt 1973  415 L
DO
1973 4615 mt 1973  389 L
1973  389 mt 1973  389 L
SO
2146 4615 mt 2146 4588 L
2146  389 mt 2146  415 L
DO
2146 4615 mt 2146  389 L
2146  389 mt 2146  389 L
SO
2288 4615 mt 2288 4588 L
2288  389 mt 2288  415 L
DO
2288 4615 mt 2288  389 L
2288  389 mt 2288  389 L
SO
2407 4615 mt 2407 4588 L
2407  389 mt 2407  415 L
DO
2407 4615 mt 2407  389 L
2407  389 mt 2407  389 L
SO
2511 4615 mt 2511 4588 L
2511  389 mt 2511  415 L
DO
2511 4615 mt 2511  389 L
2511  389 mt 2511  389 L
SO
2602 4615 mt 2602 4588 L
2602  389 mt 2602  415 L
DO
2602 4615 mt 2602  389 L
2602  389 mt 2602  389 L
SO
2684 4615 mt 2684 4588 L
2684  389 mt 2684  415 L
DO
2684 4615 mt 2684  389 L
2684  389 mt 2684  389 L
SO
2684 4615 mt 2684 4561 L
2684  389 mt 2684  442 L
%%IncludeResource: font Helvetica
/Helvetica /ISOLatin1Encoding 120 FMSR

2596 4797 mt 
(10) s
%%IncludeResource: font Helvetica
/Helvetica /ISOLatin1Encoding 80 FMSR

2729 4723 mt 
(0) s
3221 4615 mt 3221 4588 L
3221  389 mt 3221  415 L
DO
3221 4615 mt 3221  389 L
3221  389 mt 3221  389 L
SO
3536 4615 mt 3536 4588 L
3536  389 mt 3536  415 L
DO
3536 4615 mt 3536  389 L
3536  389 mt 3536  389 L
SO
3759 4615 mt 3759 4588 L
3759  389 mt 3759  415 L
DO
3759 4615 mt 3759  389 L
3759  389 mt 3759  389 L
SO
3932 4615 mt 3932 4588 L
3932  389 mt 3932  415 L
DO
3932 4615 mt 3932  389 L
3932  389 mt 3932  389 L
SO
4073 4615 mt 4073 4588 L
4073  389 mt 4073  415 L
DO
4073 4615 mt 4073  389 L
4073  389 mt 4073  389 L
SO
4193 4615 mt 4193 4588 L
4193  389 mt 4193  415 L
DO
4193 4615 mt 4193  389 L
4193  389 mt 4193  389 L
SO
4296 4615 mt 4296 4588 L
4296  389 mt 4296  415 L
DO
4296 4615 mt 4296  389 L
4296  389 mt 4296  389 L
SO
4387 4615 mt 4387 4588 L
4387  389 mt 4387  415 L
DO
4387 4615 mt 4387  389 L
4387  389 mt 4387  389 L
SO
4469 4615 mt 4469 4588 L
4469  389 mt 4469  415 L
DO
4469 4615 mt 4469  389 L
4469  389 mt 4469  389 L
SO
4469 4615 mt 4469 4561 L
4469  389 mt 4469  442 L
%%IncludeResource: font Helvetica
/Helvetica /ISOLatin1Encoding 120 FMSR

4381 4797 mt 
(10) s
%%IncludeResource: font Helvetica
/Helvetica /ISOLatin1Encoding 80 FMSR

4514 4723 mt 
(1) s
5007 4615 mt 5007 4588 L
5007  389 mt 5007  415 L
DO
5007 4615 mt 5007  389 L
5007  389 mt 5007  389 L
SO
5321 4615 mt 5321 4588 L
5321  389 mt 5321  415 L
DO
5321 4615 mt 5321  389 L
5321  389 mt 5321  389 L
SO
5544 4615 mt 5544 4588 L
5544  389 mt 5544  415 L
DO
5544 4615 mt 5544  389 L
5544  389 mt 5544  389 L
SO
5717 4615 mt 5717 4588 L
5717  389 mt 5717  415 L
DO
5717 4615 mt 5717  389 L
5717  389 mt 5717  389 L
SO
5858 4615 mt 5858 4588 L
5858  389 mt 5858  415 L
DO
5858 4615 mt 5858  389 L
5858  389 mt 5858  389 L
SO
5978 4615 mt 5978 4588 L
5978  389 mt 5978  415 L
DO
5978 4615 mt 5978  389 L
5978  389 mt 5978  389 L
SO
6081 4615 mt 6081 4588 L
6081  389 mt 6081  415 L
DO
6081 4615 mt 6081  389 L
6081  389 mt 6081  389 L
SO
6173 4615 mt 6173 4588 L
6173  389 mt 6173  415 L
DO
6173 4615 mt 6173  389 L
6173  389 mt 6173  389 L
SO
6255 4615 mt 6255 4588 L
6255  389 mt 6255  415 L
DO
6255 4615 mt 6255  389 L
6255  389 mt 6255  389 L
SO
6255 4615 mt 6255 4561 L
6255  389 mt 6255  442 L
%%IncludeResource: font Helvetica
/Helvetica /ISOLatin1Encoding 120 FMSR

6167 4797 mt 
(10) s
%%IncludeResource: font Helvetica
/Helvetica /ISOLatin1Encoding 80 FMSR

6300 4723 mt 
(2) s
 899 4615 mt  925 4615 L
6255 4615 mt 6228 4615 L
DO
 899 4615 mt 6255 4615 L
6255 4615 mt 6255 4615 L
SO
 899 4615 mt  952 4615 L
6255 4615 mt 6201 4615 L
%%IncludeResource: font Helvetica
/Helvetica /ISOLatin1Encoding 120 FMSR

 640 4659 mt 
(10) s
%%IncludeResource: font Helvetica
/Helvetica /ISOLatin1Encoding 80 FMSR

 773 4585 mt 
(-2) s
 899 4062 mt  925 4062 L
6255 4062 mt 6228 4062 L
DO
 899 4062 mt 6255 4062 L
6255 4062 mt 6255 4062 L
SO
 899 3738 mt  925 3738 L
6255 3738 mt 6228 3738 L
DO
 899 3738 mt 6255 3738 L
6255 3738 mt 6255 3738 L
SO
 899 3509 mt  925 3509 L
6255 3509 mt 6228 3509 L
DO
 899 3509 mt 6255 3509 L
6255 3509 mt 6255 3509 L
SO
 899 3331 mt  925 3331 L
6255 3331 mt 6228 3331 L
DO
 899 3331 mt 6255 3331 L
6255 3331 mt 6255 3331 L
SO
 899 3185 mt  925 3185 L
6255 3185 mt 6228 3185 L
DO
 899 3185 mt 6255 3185 L
6255 3185 mt 6255 3185 L
SO
 899 3062 mt  925 3062 L
6255 3062 mt 6228 3062 L
DO
 899 3062 mt 6255 3062 L
6255 3062 mt 6255 3062 L
SO
 899 2956 mt  925 2956 L
6255 2956 mt 6228 2956 L
DO
 899 2956 mt 6255 2956 L
6255 2956 mt 6255 2956 L
SO
 899 2862 mt  925 2862 L
6255 2862 mt 6228 2862 L
DO
 899 2862 mt 6255 2862 L
6255 2862 mt 6255 2862 L
SO
 899 2778 mt  925 2778 L
6255 2778 mt 6228 2778 L
DO
 899 2778 mt 6255 2778 L
6255 2778 mt 6255 2778 L
SO
 899 2778 mt  952 2778 L
6255 2778 mt 6201 2778 L
%%IncludeResource: font Helvetica
/Helvetica /ISOLatin1Encoding 120 FMSR

 640 2822 mt 
(10) s
%%IncludeResource: font Helvetica
/Helvetica /ISOLatin1Encoding 80 FMSR

 773 2748 mt 
(-1) s
 899 2225 mt  925 2225 L
6255 2225 mt 6228 2225 L
DO
 899 2225 mt 6255 2225 L
6255 2225 mt 6255 2225 L
SO
 899 1902 mt  925 1902 L
6255 1902 mt 6228 1902 L
DO
 899 1902 mt 6255 1902 L
6255 1902 mt 6255 1902 L
SO
 899 1672 mt  925 1672 L
6255 1672 mt 6228 1672 L
DO
 899 1672 mt 6255 1672 L
6255 1672 mt 6255 1672 L
SO
 899 1494 mt  925 1494 L
6255 1494 mt 6228 1494 L
DO
 899 1494 mt 6255 1494 L
6255 1494 mt 6255 1494 L
SO
 899 1349 mt  925 1349 L
6255 1349 mt 6228 1349 L
DO
 899 1349 mt 6255 1349 L
6255 1349 mt 6255 1349 L
SO
 899 1226 mt  925 1226 L
6255 1226 mt 6228 1226 L
DO
 899 1226 mt 6255 1226 L
6255 1226 mt 6255 1226 L
SO
 899 1119 mt  925 1119 L
6255 1119 mt 6228 1119 L
DO
 899 1119 mt 6255 1119 L
6255 1119 mt 6255 1119 L
SO
 899 1025 mt  925 1025 L
6255 1025 mt 6228 1025 L
DO
 899 1025 mt 6255 1025 L
6255 1025 mt 6255 1025 L
SO
 899  941 mt  925  941 L
6255  941 mt 6228  941 L
DO
 899  941 mt 6255  941 L
6255  941 mt 6255  941 L
SO
 899  941 mt  952  941 L
6255  941 mt 6201  941 L
%%IncludeResource: font Helvetica
/Helvetica /ISOLatin1Encoding 120 FMSR

 640  985 mt 
(10) s
%%IncludeResource: font Helvetica
/Helvetica /ISOLatin1Encoding 80 FMSR

 773  911 mt 
(0) s
 899  389 mt  925  389 L
6255  389 mt 6228  389 L
DO
 899  389 mt 6255  389 L
6255  389 mt 6255  389 L
SO
 899 4615 mt 6255 4615 L
 899  389 mt 6255  389 L
 899 4615 mt  899  389 L
6255 4615 mt 6255  389 L
gs 899 388 5357 4228 MR c np
/c8 { 1.000000 0.000000 0.000000 sr} bdef
c8
4 854 5 656 6 360 5 251 5 192 6 155 5 130 5 112 
6 96 5 85 6 75 5 67 5 59 6 54 5 48 5 43 
6 39 5 35 5 32 6 29 5 26 6 24 5 21 5 20 
6 17 5 16 5 15 6 13 5 12 5 11 6 10 5 9 
6 8 5 8 5 7 6 6 5 6 5 6 6 4 5 5 
5 4 6 4 5 3 5 4 6 3 5 2 6 3 5 2 
5 3 6 2 5 1 5 2 6 2 5 1 5 2 6 1 
5 1 6 1 5 1 5 1 6 1 5 1 5 1 6 1 
5 0 5 1 6 1 5 0 6 1 5 0 5 1 6 0 
5 1 5 0 6 0 5 1 5 0 6 0 5 1 5 0 
6 0 5 0 6 1 5 0 5 0 6 0 5 0 5 1 
6 0 5 0 5 0 6 0 5 0 6 0 5 0 5 1 
6 0 5 0 5 0 2266 943 100 MP stroke
6 0 5 0 5 0 6 0 5 0 6 0 5 0 5 0 
6 1 5 0 5 0 6 0 5 0 5 0 6 0 5 0 
5 0 6 0 5 0 6 0 5 0 5 0 6 0 5 0 
5 0 6 0 5 0 5 0 6 0 5 0 6 0 5 0 
5 0 6 0 5 0 5 0 6 0 5 0 5 0 6 0 
5 0 6 0 5 0 5 0 6 0 5 0 5 0 6 0 
5 0 5 0 6 0 5 0 6 0 5 1 5 0 6 0 
5 0 5 0 6 0 5 0 5 0 6 0 5 0 5 0 
6 0 5 0 6 0 5 0 5 0 6 0 5 0 5 0 
6 0 5 0 5 0 6 0 5 0 6 0 5 0 5 0 
6 0 5 0 5 0 6 0 5 0 5 0 6 0 5 0 
6 0 5 0 5 0 6 0 5 0 5 0 6 0 5 0 
5 0 6 0 5 0 1735 941 100 MP stroke
5 0 6 0 5 0 6 0 5 0 5 0 6 0 5 0 
5 0 6 0 5 0 5 0 6 0 5 0 6 0 5 0 
5 0 6 0 5 0 5 0 6 0 5 0 5 0 6 0 
5 0 6 0 5 0 5 0 6 0 5 0 5 0 6 0 
5 0 5 0 6 0 5 0 5 0 6 0 5 0 6 0 
5 0 5 0 6 0 5 0 5 0 6 0 5 0 5 0 
6 0 5 0 6 0 5 0 5 0 6 0 5 0 5 0 
6 0 5 0 5 0 6 0 5 0 6 0 5 0 5 0 
6 0 5 0 5 0 6 0 5 0 5 0 6 0 5 0 
6 0 5 0 5 0 6 0 5 0 5 0 6 0 5 0 
5 0 6 0 5 0 5 0 6 0 5 0 6 0 5 0 
5 0 6 0 5 0 5 0 6 0 5 0 5 0 6 0 
5 0 6 0 5 0 1204 941 100 MP stroke
5 0 6 0 5 0 5 0 6 0 5 0 5 0 6 0 
5 0 6 0 5 0 5 0 6 0 5 0 5 0 6 0 
5 0 5 0 6 0 5 0 5 0 6 0 5 0 6 0 
5 0 5 0 6 0 5 0 5 0 6 0 5 0 5 0 
6 0 5 0 6 0 5 0 5 0 6 0 5 0 5 0 
6 0 5 0 5 0 6 0 5 0 6 0 5 0 5 0 
6 0 5 0 5 0 6 0 5 0 5 0 6 0 5 0 
5 0 899 941 58 MP stroke
6 6 5 5 6 6 5 5 5 6 6 5 5 6 5 5 
6 6 5 5 5 6 6 5 5 6 6 5 5 6 5 5 
6 6 5 5 5 6 6 5 5 6 5 5 6 6 5 5 
6 6 5 5 5 6 6 6 5 5 5 6 6 5 5 6 
5 5 6 6 5 5 6 6 5 5 5 6 6 5 5 6 
5 5 6 6 5 5 5 6 6 5 5 6 5 5 6 6 
5 5 6 6 5 5 5 6 6 5 5 6 5 5 6 6 
5 5 5 6 6 5 5 6 6 5 5 6 5 5 6 6 
5 5 5 6 6 5 5 6 5 5 6 6 5 5 6 6 
5 5 5 6 6 5 5 6 5 5 6 6 5 5 5 6 
6 5 5 6 5 5 6 6 5 5 6 6 5 5 5 6 
6 5 5 6 5 5 6 6 5 5 5 5 6 6 5 5 
6 6 5 5 5 6 5724 3194 100 MP stroke
6 5 5 6 5 5 6 6 5 5 5 6 6 5 5 6 
6 5 5 6 5 5 6 6 5 5 5 6 6 5 5 6 
5 5 6 6 5 5 6 6 5 5 5 6 6 5 5 6 
5 5 6 6 5 5 5 6 6 5 5 5 5 6 6 5 
5 6 6 5 5 6 5 5 6 6 5 5 5 6 6 5 
5 6 5 5 6 6 5 5 6 6 5 5 5 5 6 6 
5 5 5 6 6 5 5 6 5 5 6 6 5 5 6 6 
5 5 5 6 6 5 5 6 5 5 6 5 5 6 5 5 
6 6 5 5 5 6 6 5 5 6 6 5 5 5 5 6 
6 5 5 6 5 5 6 6 5 5 5 6 6 5 5 5 
6 6 5 5 5 6 6 5 5 6 5 5 6 6 5 5 
5 5 6 6 5 5 6 6 5 5 5 6 6 5 5 5 
5 6 6 5 5 6 5193 2653 100 MP stroke
5 5 6 5 5 6 5 5 6 6 5 5 6 6 5 5 
5 5 6 6 5 5 5 6 6 5 5 5 5 6 6 5 
5 6 6 5 5 5 5 6 6 5 5 5 5 6 6 5 
5 6 5 5 6 5 5 6 6 5 5 5 5 6 6 5 
5 6 5 5 6 5 5 6 5 5 6 5 5 6 6 5 
5 5 5 6 6 5 5 5 5 6 6 5 5 5 5 6 
6 5 5 5 5 6 6 5 5 5 6 6 5 5 5 5 
6 6 5 5 5 5 6 6 5 5 5 5 6 5 5 6 
6 5 5 5 5 6 6 5 5 5 5 5 6 6 5 5 
5 5 6 5 5 6 6 5 5 5 5 5 6 6 5 5 
5 5 6 5 5 5 5 6 6 5 5 5 5 5 6 5 
5 6 6 5 5 5 5 5 6 5 5 6 5 5 6 5 
5 5 5 5 6 5 4662 2128 100 MP stroke
5 6 6 5 5 5 5 5 6 5 5 5 5 5 6 5 
5 6 5 5 6 5 5 5 6 5 5 5 5 5 6 5 
5 5 5 5 6 5 5 5 5 5 6 5 5 5 5 5 
6 5 5 5 6 5 5 5 5 5 6 5 5 5 5 5 
6 5 5 5 5 5 6 5 5 5 6 5 5 5 5 5 
6 5 5 5 5 4 6 5 5 5 5 5 6 5 5 5 
6 5 5 4 5 5 6 5 5 5 5 5 6 4 5 5 
5 5 6 5 5 5 6 4 5 5 5 5 6 4 5 5 
5 5 6 4 5 5 5 5 6 4 5 5 5 5 6 4 
5 5 6 5 5 4 5 5 6 4 5 5 5 4 6 5 
5 4 5 5 6 4 5 5 6 4 5 5 5 4 6 5 
5 4 5 5 6 4 5 4 5 5 6 4 5 4 6 5 
5 4 5 4 6 5 4131 1653 100 MP stroke
5 4 5 4 6 5 5 4 5 4 6 4 5 4 5 5 
6 4 5 4 6 4 5 4 5 4 6 4 5 4 5 5 
6 4 5 4 5 4 6 4 5 4 6 4 5 4 5 3 
6 4 5 4 5 4 6 4 5 4 5 4 6 4 5 3 
6 4 5 4 5 4 6 3 5 4 5 4 6 3 5 4 
5 4 6 3 5 4 5 4 6 3 5 4 6 3 5 4 
5 3 6 4 5 3 5 4 6 3 5 3 5 4 6 3 
5 3 6 4 5 3 5 3 6 4 5 3 5 3 6 3 
5 3 5 4 6 3 5 3 6 3 5 3 5 3 6 3 
5 3 5 3 6 3 5 3 5 3 6 3 5 3 6 2 
5 3 5 3 6 3 5 3 5 2 6 3 5 3 5 2 
6 3 5 3 5 2 6 3 5 2 6 3 5 2 5 3 
6 2 5 3 5 2 3601 1314 100 MP stroke
6 2 5 3 5 2 6 2 5 3 6 2 5 2 5 2 
6 3 5 2 5 2 6 2 5 2 5 2 6 2 5 2 
6 2 5 2 5 2 6 2 5 2 5 1 6 2 5 2 
5 2 6 2 5 1 5 2 6 2 5 1 6 2 5 1 
5 2 6 1 5 2 5 1 6 2 5 1 5 1 6 2 
5 1 6 1 5 1 5 1 6 2 5 1 5 1 6 1 
5 1 5 1 6 1 5 1 6 0 5 1 5 1 6 1 
5 0 5 1 6 1 5 0 5 1 6 0 5 1 6 0 
5 0 5 1 6 0 5 0 5 0 6 0 5 0 5 0 
6 0 5 0 5 0 6 -1 5 0 6 0 5 -1 5 0 
6 -1 5 -1 5 -1 6 -1 5 -1 5 -1 6 -1 5 -1 
6 -1 5 -2 5 -1 6 -2 5 -2 5 -2 6 -2 5 -2 
5 -3 6 -2 5 -3 3070 1250 100 MP stroke
6 -3 5 -3 5 -3 6 -4 5 -3 5 -4 6 -4 5 -5 
5 -5 6 -5 5 -5 5 -6 6 -6 5 -6 6 -7 5 -7 
5 -8 6 -8 5 -9 5 -9 6 -10 5 -11 5 -11 6 -13 
5 -13 6 -14 5 -16 5 -16 6 -18 5 -20 5 -21 6 -23 
5 -25 5 -27 6 -31 5 -33 6 -36 5 -41 5 -45 6 -51 
5 -58 5 -65 6 -75 5 -87 5 -104 6 -125 5 -155 5 -203 
6 -286 5 -471 5 -1152 2797 4616 52 MP stroke
/c9 { 0.000000 1.000000 0.000000 sr} bdef
c9
0 41 6 593 5 338 5 238 6 184 5 150 5 127 6 110 
5 97 6 87 5 78 5 72 6 65 5 61 5 56 6 53 
5 49 5 47 6 44 5 41 6 39 5 37 5 35 6 34 
5 32 5 31 6 29 5 28 5 26 6 26 5 25 6 23 
5 23 5 22 6 20 5 20 5 20 6 18 5 18 5 17 
6 17 5 16 5 15 6 15 5 14 6 13 5 14 5 12 
6 12 5 12 5 11 6 11 5 11 5 10 6 9 5 9 
6 9 5 9 5 8 6 8 5 7 5 8 6 7 5 6 
5 7 6 6 5 5 6 6 5 5 5 5 6 5 5 4 
5 5 6 4 5 3 5 4 6 3 5 3 5 3 6 2 
5 3 6 2 5 1 5 2 6 1 5 1 5 1 6 0 
5 0 5 0 6 -1 5 0 6 -2 5 -1 5 -2 6 -3 
5 -2 5 -4 6 -4 2898 1237 100 MP stroke
5 -4 5 -5 6 -6 5 -7 6 -7 5 -8 5 -10 6 -11 
5 -12 5 -13 6 -16 5 -17 5 -20 6 -22 5 -26 5 -30 
6 -35 5 -40 6 -47 5 -56 5 -67 6 -81 5 -101 5 -128 
6 -169 5 -237 5 -372 6 -804 5 -141 6 949 5 429 5 279 
6 205 5 159 5 126 6 103 5 85 5 70 6 58 5 48 
6 41 5 33 5 29 6 24 5 20 5 17 6 15 5 12 
5 11 6 9 5 8 6 7 5 5 5 6 6 4 5 4 
5 3 6 3 5 3 5 2 6 2 5 2 5 2 6 1 
5 1 6 2 5 1 5 1 6 0 5 1 5 1 6 0 
5 1 5 0 6 1 5 0 6 1 5 0 5 0 6 1 
5 0 5 0 6 0 5 0 5 1 6 0 5 0 6 0 
5 0 5 0 6 0 5 0 5 1 6 0 5 0 5 0 
6 0 5 0 5 0 2368 942 100 MP stroke
6 0 5 0 6 0 5 0 5 0 6 0 5 0 5 0 
6 0 5 0 5 0 6 0 5 0 6 0 5 0 5 0 
6 0 5 0 5 0 6 0 5 0 5 0 6 0 5 1 
6 0 5 0 5 0 6 0 5 0 5 0 6 0 5 0 
5 0 6 0 5 0 5 0 6 0 5 0 6 0 5 0 
5 0 6 0 5 0 5 0 6 0 5 0 5 0 6 0 
5 0 6 0 5 0 5 0 6 0 5 0 5 0 6 0 
5 0 5 0 6 0 5 0 6 0 5 0 5 0 6 0 
5 0 5 0 6 0 5 0 5 0 6 0 5 0 6 0 
5 0 5 0 6 0 5 0 5 0 6 0 5 0 5 0 
6 0 5 0 5 0 6 0 5 0 6 0 5 0 5 0 
6 0 5 0 5 0 6 0 5 0 5 0 6 0 5 0 
6 0 5 0 5 0 1837 941 100 MP stroke
6 0 5 0 5 0 6 0 5 0 5 0 6 0 5 0 
6 0 5 0 5 0 6 0 5 0 5 0 6 0 5 0 
5 0 6 0 5 0 5 0 6 0 5 0 6 0 5 0 
5 0 6 0 5 0 5 0 6 0 5 0 5 0 6 0 
5 0 6 0 5 0 5 0 6 0 5 0 5 0 6 0 
5 0 5 0 6 0 5 0 6 0 5 0 5 0 6 0 
5 0 5 0 6 0 5 0 5 0 6 0 5 0 5 0 
6 0 5 0 6 0 5 0 5 0 6 0 5 0 5 0 
6 0 5 0 5 0 6 0 5 0 6 0 5 0 5 0 
6 0 5 0 5 0 6 0 5 0 5 0 6 0 5 0 
6 0 5 0 5 0 6 0 5 0 5 0 6 0 5 0 
5 0 6 0 5 0 6 0 5 0 5 0 6 0 5 0 
5 0 6 0 5 0 1306 941 100 MP stroke
5 0 6 0 5 0 5 0 6 0 5 0 6 0 5 0 
5 0 6 0 5 0 5 0 6 0 5 0 5 0 6 0 
5 0 6 0 5 0 5 0 6 0 5 0 5 0 6 0 
5 0 5 0 6 0 5 0 6 0 5 0 5 0 6 0 
5 0 5 0 6 0 5 0 5 0 6 0 5 0 5 0 
6 0 5 0 6 0 5 0 5 0 6 0 5 0 5 0 
6 0 5 0 5 0 6 0 5 0 6 0 5 0 5 0 
6 0 5 0 5 0 6 0 5 0 5 0 6 0 5 0 
6 0 5 0 5 0 6 0 5 0 5 0 6 0 5 0 
5 0 6 0 5 0 5 0 899 941 77 MP stroke
6 0 5 0 6 0 5 0 5 0 6 0 5 0 5 0 
6 0 5 0 5 0 6 0 5 0 6 0 5 0 5 0 
6 0 5 0 5 0 6 0 5 0 5 0 6 0 5 0 
6 0 5 0 5 0 6 0 5 0 5 0 6 0 5 0 
5 0 6 0 5 0 6 0 5 0 5 0 6 0 5 0 
5 0 6 0 5 0 5 0 6 0 5 0 5 0 6 0 
5 0 6 0 5 0 5 0 6 0 5 0 5 0 6 0 
5 0 5 -1 6 0 5 0 6 0 5 0 5 0 6 0 
5 0 5 0 6 0 5 0 5 0 6 0 5 0 6 0 
5 0 5 0 6 0 5 0 5 0 6 0 5 0 5 0 
6 0 5 0 5 0 6 0 5 0 6 0 5 0 5 0 
6 0 5 0 5 0 6 0 5 0 5 0 6 0 5 0 
6 0 5 0 5 0 5724 1219 100 MP stroke
6 0 5 0 5 0 6 0 5 0 5 0 6 0 5 0 
6 0 5 0 5 0 6 0 5 0 5 0 6 0 5 0 
5 0 6 0 5 0 6 0 5 0 5 -1 6 0 5 0 
5 0 6 0 5 0 5 0 6 0 5 0 5 0 6 0 
5 0 6 0 5 0 5 0 6 0 5 0 5 0 6 0 
5 0 5 0 6 0 5 0 6 0 5 0 5 0 6 0 
5 0 5 0 6 0 5 0 5 0 6 0 5 0 6 -1 
5 0 5 0 6 0 5 0 5 0 6 0 5 0 5 0 
6 0 5 0 5 0 6 0 5 0 6 0 5 0 5 0 
6 0 5 0 5 0 6 0 5 0 5 -1 6 0 5 0 
6 0 5 0 5 0 6 0 5 0 5 0 6 0 5 0 
5 0 6 0 5 0 6 0 5 0 5 0 6 -1 5 0 
5 0 6 0 5 0 5193 1223 100 MP stroke
5 0 6 0 5 0 5 0 6 0 5 0 6 0 5 0 
5 0 6 -1 5 0 5 0 6 0 5 0 5 0 6 0 
5 0 6 0 5 0 5 0 6 0 5 -1 5 0 6 0 
5 0 5 0 6 0 5 0 6 0 5 0 5 0 6 -1 
5 0 5 0 6 0 5 0 5 0 6 0 5 0 6 -1 
5 0 5 0 6 0 5 0 5 0 6 0 5 0 5 -1 
6 0 5 0 5 0 6 0 5 0 6 0 5 -1 5 0 
6 0 5 0 5 0 6 0 5 -1 5 0 6 0 5 0 
6 0 5 0 5 -1 6 0 5 0 5 0 6 0 5 -1 
5 0 6 0 5 0 6 0 5 -1 5 0 6 0 5 0 
5 0 6 -1 5 0 5 0 6 0 5 -1 5 0 6 0 
5 0 6 -1 5 0 5 0 6 0 5 -1 5 0 6 0 
5 0 5 -1 6 0 4662 1238 100 MP stroke
5 0 6 -1 5 0 5 0 6 -1 5 0 5 0 6 -1 
5 0 5 0 6 -1 5 0 6 0 5 -1 5 0 6 0 
5 -1 5 0 6 0 5 -1 5 0 6 -1 5 0 5 0 
6 -1 5 0 6 -1 5 0 5 -1 6 0 5 -1 5 0 
6 -1 5 0 5 -1 6 0 5 -1 6 0 5 -1 5 0 
6 -1 5 0 5 -1 6 0 5 -1 5 -1 6 0 5 -1 
6 0 5 -1 5 -1 6 0 5 -1 5 -1 6 0 5 -1 
5 -1 6 0 5 -1 6 -1 5 -1 5 0 6 -1 5 -1 
5 -1 6 -1 5 -1 5 0 6 -1 5 -1 5 -1 6 -1 
5 -1 6 -1 5 -1 5 -1 6 -1 5 -1 5 -1 6 -1 
5 -1 5 -1 6 -1 5 -1 6 -1 5 -1 5 -2 6 -1 
5 -1 5 -1 6 -2 5 -1 5 -1 6 -2 5 -1 6 -1 
5 -2 5 -1 6 -2 4131 1309 100 MP stroke
5 -1 5 -2 6 -1 5 -2 5 -1 6 -2 5 -2 5 -1 
6 -2 5 -2 6 -2 5 -2 5 -2 6 -1 5 -2 5 -2 
6 -2 5 -3 5 -2 6 -2 5 -2 6 -2 5 -3 5 -2 
6 -2 5 -3 5 -2 6 -3 5 -3 5 -2 6 -3 5 -3 
6 -3 5 -3 5 -3 6 -3 5 -3 5 -3 6 -3 5 -3 
5 -4 6 -3 5 -4 5 -4 6 -3 5 -4 6 -4 5 -4 
5 -4 6 -4 5 -5 5 -4 6 -5 5 -4 5 -5 6 -5 
5 -5 6 -5 5 -5 5 -6 6 -5 5 -6 5 -6 6 -6 
5 -6 5 -6 6 -7 5 -7 6 -6 5 -7 5 -8 6 -7 
5 -8 5 -8 6 -8 5 -9 5 -8 6 -9 5 -9 6 -10 
5 -10 5 -10 6 -10 5 -11 5 -11 6 -12 5 -12 5 -12 
6 -13 5 -14 5 -13 6 -15 5 -14 6 -16 5 -16 5 -16 
6 -18 5 -18 5 -19 3601 1892 100 MP stroke
6 -19 5 -21 5 -21 6 -22 5 -24 6 -24 5 -26 5 -27 
6 -28 5 -30 5 -32 6 -34 5 -35 5 -38 6 -41 5 -43 
6 -46 5 -50 5 -54 6 -59 5 -64 5 -71 6 -79 5 -89 
5 -101 6 -118 5 -139 5 -171 6 -220 5 -309 6 -517 0 -172 
3434 4616 33 MP stroke
0 sg
3 610 5 624 5 347 6 242 5 185 6 150 5 126 5 108 
6 94 5 83 5 74 6 67 5 60 5 55 6 50 5 45 
5 42 6 39 5 35 6 33 5 30 5 28 6 26 5 24 
5 22 6 21 5 19 5 17 6 16 5 15 6 14 5 13 
5 11 6 11 5 10 5 9 6 8 5 7 5 6 6 5 
5 5 6 4 5 3 5 3 6 1 5 1 5 0 6 -1 
5 -2 5 -3 6 -5 5 -6 5 -7 6 -9 5 -11 6 -14 
5 -17 5 -20 6 -25 5 -31 5 -37 6 -47 5 -60 5 -77 
6 -101 5 -139 6 -200 5 -318 5 -642 6 -814 5 1287 5 477 
6 290 5 201 5 145 6 106 5 80 6 60 5 46 5 35 
6 27 5 20 5 17 6 13 5 10 5 8 6 7 5 5 
6 5 5 3 5 3 6 3 5 2 5 2 6 1 5 1 
5 1 6 1 5 1 2566 947 100 MP stroke
5 1 6 0 5 1 6 0 5 1 5 0 6 0 5 1 
5 0 6 0 5 0 5 0 6 0 5 1 6 0 5 0 
5 0 6 0 5 0 5 0 6 0 5 0 5 0 6 0 
5 0 6 0 5 0 5 0 6 0 5 0 5 0 6 0 
5 0 5 1 6 0 5 0 5 0 6 0 5 0 6 0 
5 0 5 0 6 0 5 0 5 0 6 0 5 0 5 0 
6 0 5 0 6 0 5 0 5 0 6 0 5 0 5 0 
6 0 5 0 5 0 6 0 5 0 6 0 5 0 5 0 
6 0 5 0 5 0 6 0 5 0 5 0 6 0 5 0 
5 0 6 0 5 0 6 0 5 0 5 0 6 0 5 0 
5 0 6 0 5 0 5 0 6 0 5 0 6 0 5 0 
5 0 6 0 5 0 5 0 6 0 5 0 5 0 6 0 
5 0 6 0 5 0 2035 941 100 MP stroke
5 0 6 0 5 0 5 0 6 0 5 0 5 0 6 0 
5 0 6 0 5 0 5 0 6 0 5 0 5 0 6 0 
5 0 5 0 6 0 5 0 5 0 6 0 5 0 6 0 
5 0 5 0 6 0 5 0 5 0 6 0 5 0 5 0 
6 0 5 0 6 0 5 0 5 0 6 0 5 0 5 0 
6 0 5 0 5 0 6 0 5 0 6 0 5 0 5 0 
6 0 5 0 5 0 6 0 5 0 5 0 6 0 5 0 
5 0 6 0 5 0 6 0 5 0 5 0 6 0 5 0 
5 0 6 0 5 0 5 0 6 0 5 0 6 0 5 0 
5 0 6 0 5 0 5 0 6 0 5 0 5 0 6 0 
5 0 6 0 5 0 5 0 6 0 5 0 5 0 6 0 
5 0 5 0 6 0 5 0 5 0 6 0 5 0 6 0 
5 0 5 0 6 0 1504 941 100 MP stroke
5 0 5 0 6 0 5 0 5 0 6 0 5 0 6 0 
5 0 5 0 6 0 5 0 5 0 6 0 5 0 5 0 
6 0 5 0 6 0 5 0 5 0 6 0 5 0 5 0 
6 0 5 0 5 0 6 0 5 0 6 0 5 0 5 0 
6 0 5 0 5 0 6 0 5 0 5 0 6 0 5 0 
5 0 6 0 5 0 6 0 5 0 5 0 6 0 5 0 
5 0 6 0 5 0 5 0 6 0 5 0 6 0 5 0 
5 0 6 0 5 0 5 0 6 0 5 0 5 0 6 0 
5 0 6 0 5 0 5 0 6 0 5 0 5 0 6 0 
5 0 5 0 6 0 5 0 5 0 6 0 5 0 6 0 
5 0 5 0 6 0 5 0 5 0 6 0 5 0 5 0 
6 0 5 0 6 0 5 0 5 0 6 0 5 0 5 0 
6 0 5 0 5 0 974 941 100 MP stroke
6 0 5 0 6 0 5 0 5 0 6 0 5 0 5 0 
6 0 5 0 5 0 6 0 5 0 5 0 899 941 15 MP stroke
6 5 5 6 6 5 5 6 5 5 6 6 5 5 5 6 
6 5 5 6 5 5 6 6 5 5 6 6 5 5 5 6 
6 5 5 6 5 5 6 6 5 5 5 6 6 5 5 6 
6 5 5 6 5 5 6 6 5 5 5 6 6 5 5 6 
5 5 6 6 5 5 6 6 5 5 5 6 6 5 5 6 
5 5 6 5 5 6 5 5 6 6 5 5 5 6 6 5 
5 6 6 5 5 6 5 5 6 6 5 5 5 6 6 5 
5 6 5 5 6 6 5 5 6 6 5 5 5 6 6 5 
5 5 5 6 6 5 5 6 5 5 6 6 5 5 6 6 
5 5 5 6 6 5 5 6 5 5 6 6 5 5 5 5 
6 6 5 5 5 6 6 5 5 6 6 5 5 6 5 5 
6 6 5 5 5 5 6 6 5 5 5 6 6 5 5 6 
6 5 5 6 5 5 5724 2790 100 MP stroke
6 6 5 5 5 5 6 6 5 5 5 6 6 5 5 6 
6 5 5 5 5 6 6 5 5 6 5 5 6 6 5 5 
5 5 6 6 5 5 6 6 5 5 5 6 6 5 5 5 
5 6 6 5 5 6 5 5 6 5 5 6 5 5 6 6 
5 5 6 6 5 5 5 5 6 6 5 5 5 6 6 5 
5 5 5 6 6 5 5 5 6 6 5 5 5 6 6 5 
5 5 5 6 6 5 5 6 5 5 6 5 5 6 6 5 
5 5 5 6 6 5 5 5 5 6 6 5 5 5 5 6 
6 5 5 6 5 5 6 5 5 6 6 5 5 5 5 6 
6 5 5 5 5 5 6 6 5 5 5 5 6 6 5 5 
6 5 5 6 5 5 6 5 5 6 5 5 6 5 5 5 
5 6 6 5 5 5 6 6 5 5 5 5 6 5 5 6 
5 5 6 5 5 5 5193 2259 100 MP stroke
5 6 6 5 5 5 5 5 6 6 5 5 6 5 5 5 
5 5 6 6 5 5 5 5 6 5 5 5 5 6 6 5 
5 5 6 5 5 5 5 5 6 6 5 5 5 5 6 5 
5 5 5 5 6 6 5 5 6 5 5 5 5 5 6 5 
5 5 5 5 6 5 5 6 5 5 6 5 5 5 6 5 
5 5 5 5 6 5 5 5 5 5 6 5 5 5 5 5 
6 5 5 5 5 5 6 5 5 5 6 5 5 5 5 5 
6 5 5 5 5 5 6 5 5 5 5 5 6 5 5 5 
6 4 5 5 5 5 6 5 5 5 5 5 6 5 5 4 
5 5 6 5 5 5 6 5 5 5 5 4 6 5 5 5 
5 5 6 4 5 5 5 5 6 5 5 4 5 5 6 5 
5 4 6 5 5 5 5 4 6 5 5 5 5 4 6 5 
5 5 5 4 6 5 4662 1766 100 MP stroke
5 4 6 5 5 4 5 5 6 5 5 4 5 5 6 4 
5 5 5 4 6 4 5 5 6 4 5 5 5 4 6 5 
5 4 5 4 6 5 5 4 5 4 6 5 5 4 5 4 
6 5 5 4 6 4 5 4 5 5 6 4 5 4 5 4 
6 4 5 4 5 5 6 4 5 4 6 4 5 4 5 4 
6 4 5 4 5 4 6 4 5 4 5 4 6 4 5 4 
6 4 5 4 5 4 6 4 5 3 5 4 6 4 5 4 
5 4 6 3 5 4 6 4 5 4 5 3 6 4 5 4 
5 3 6 4 5 4 5 3 6 4 5 3 5 4 6 3 
5 4 6 3 5 4 5 3 6 4 5 3 5 3 6 4 
5 3 5 3 6 4 5 3 6 3 5 3 5 4 6 3 
5 3 5 3 6 3 5 3 5 3 6 3 5 4 6 3 
5 3 5 3 6 2 4131 1385 100 MP stroke
5 3 5 3 6 3 5 3 5 3 6 3 5 3 5 2 
6 3 5 3 6 3 5 2 5 3 6 3 5 2 5 3 
6 2 5 3 5 2 6 3 5 2 6 3 5 2 5 3 
6 2 5 3 5 2 6 2 5 3 5 2 6 2 5 2 
6 2 5 3 5 2 6 2 5 2 5 2 6 2 5 2 
5 2 6 2 5 2 5 2 6 2 5 2 6 2 5 1 
5 2 6 2 5 2 5 1 6 2 5 2 5 1 6 2 
5 1 6 2 5 1 5 2 6 1 5 2 5 1 6 2 
5 1 5 1 6 2 5 1 6 1 5 1 5 1 6 1 
5 2 5 1 6 1 5 1 5 1 6 0 5 1 6 1 
5 1 5 1 6 1 5 0 5 1 6 1 5 0 5 1 
6 0 5 1 5 0 6 1 5 0 6 0 5 1 5 0 
6 0 5 0 5 0 3601 1218 100 MP stroke
6 0 5 0 5 0 6 0 5 0 6 0 5 -1 5 0 
6 0 5 -1 5 0 6 -1 5 -1 5 0 6 -1 5 -1 
6 -1 5 -1 5 -1 6 -1 5 -2 5 -1 6 -1 5 -2 
5 -2 6 -1 5 -2 5 -2 6 -2 5 -3 6 -2 5 -2 
5 -3 6 -3 5 -3 5 -3 6 -3 5 -3 5 -4 6 -4 
5 -4 6 -4 5 -4 5 -5 6 -5 5 -5 5 -5 6 -6 
5 -6 5 -6 6 -7 5 -7 6 -7 5 -8 5 -8 6 -9 
5 -9 5 -10 6 -10 5 -11 5 -12 6 -12 5 -13 6 -14 
5 -15 5 -15 6 -17 5 -18 5 -19 6 -20 5 -22 5 -23 
6 -25 5 -27 5 -29 6 -31 5 -34 6 -36 5 -40 5 -44 
6 -48 5 -53 5 -59 6 -65 5 -73 5 -84 6 -96 5 -112 
6 -134 5 -166 5 -213 6 -299 5 -494 3 -842 3099 4616 95 MP stroke
DA
/c10 { 0.000000 0.000000 1.000000 sr} bdef
c10
5356 0 899 1218 2 MP stroke
gr

c10
DA
0 sg
%%IncludeResource: font Helvetica
/Helvetica /ISOLatin1Encoding 120 FMSR

 504 2667 mt  -90 rotate
(|H) s
90 rotate
%%IncludeResource: font Helvetica
/Helvetica /ISOLatin1Encoding 96 FMSR

 564 2550 mt  -90 rotate
(N) s
90 rotate
%%IncludeResource: font Helvetica
/Helvetica /ISOLatin1Encoding 120 FMSR

 504 2481 mt  -90 rotate
(\(f\)|) s
90 rotate
3559 4940 mt 
(f) s
2379  239 mt 
(Modulo dei filtri di Chebyshev-II per f) s
%%IncludeResource: font Helvetica
/Helvetica /ISOLatin1Encoding 96 FMSR

4352  299 mt 
(c) s
%%IncludeResource: font Helvetica
/Helvetica /ISOLatin1Encoding 120 FMSR

4400  239 mt 
(=1, ) s
%%IncludeResource: font Symbol
/Symbol /ISOLatin1Encoding 120 FMSR

4603  239 mt 
(e) s
%%IncludeResource: font Helvetica
/Helvetica /ISOLatin1Encoding 120 FMSR

4655  239 mt 
(=1) s
SO

end %%Color Dict

eplot
%%EndObject

epage
end

showpage

%%Trailer
%%EOF
