%!PS-Adobe-2.0 EPSF-1.2
%%Creator: MATLAB, The Mathworks, Inc. Version 7.5.0.338 (R2007b). Operating System: Linux 2.6.35-32-generic #67-Ubuntu SMP Mon Mar 5 19:39:49 UTC 2012 x86_64.
%%Title: ./filtri_chebyshev_zoom.eps
%%CreationDate: 04/20/2012  14:28:11
%%DocumentNeededFonts: Helvetica
%%DocumentProcessColors: Cyan Magenta Yellow Black
%%Extensions: CMYK
%%Pages: 1
%%BoundingBox:    48   196   543   608
%%EndComments

%%BeginProlog
% MathWorks dictionary
/MathWorks 160 dict begin
% definition operators
/bdef {bind def} bind def
/ldef {load def} bind def
/xdef {exch def} bdef
/xstore {exch store} bdef
% operator abbreviations
/c  /clip ldef
/cc /concat ldef
/cp /closepath ldef
/gr /grestore ldef
/gs /gsave ldef
/mt /moveto ldef
/np /newpath ldef
/cm /currentmatrix ldef
/sm /setmatrix ldef
/rm /rmoveto ldef
/rl /rlineto ldef
/s {show newpath} bdef
/sc {setcmykcolor} bdef
/sr /setrgbcolor ldef
/sg /setgray ldef
/w /setlinewidth ldef
/j /setlinejoin ldef
/cap /setlinecap ldef
/rc {rectclip} bdef
/rf {rectfill} bdef
% page state control
/pgsv () def
/bpage {/pgsv save def} bdef
/epage {pgsv restore} bdef
/bplot /gsave ldef
/eplot {stroke grestore} bdef
% orientation switch
/portraitMode 0 def /landscapeMode 1 def /rotateMode 2 def
% coordinate system mappings
/dpi2point 0 def
% font control
/FontSize 0 def
/FMS {/FontSize xstore findfont [FontSize 0 0 FontSize neg 0 0]
  makefont setfont} bdef
/reencode {exch dup where {pop load} {pop StandardEncoding} ifelse
  exch dup 3 1 roll findfont dup length dict begin
  { 1 index /FID ne {def}{pop pop} ifelse } forall
  /Encoding exch def currentdict end definefont pop} bdef
/isroman {findfont /CharStrings get /Agrave known} bdef
/FMSR {3 1 roll 1 index dup isroman {reencode} {pop pop} ifelse
  exch FMS} bdef
/csm {1 dpi2point div -1 dpi2point div scale neg translate
 dup landscapeMode eq {pop -90 rotate}
  {rotateMode eq {90 rotate} if} ifelse} bdef
% line types: solid, dotted, dashed, dotdash
/SO { [] 0 setdash } bdef
/DO { [.5 dpi2point mul 4 dpi2point mul] 0 setdash } bdef
/DA { [6 dpi2point mul] 0 setdash } bdef
/DD { [.5 dpi2point mul 4 dpi2point mul 6 dpi2point mul 4
  dpi2point mul] 0 setdash } bdef
% macros for lines and objects
/L {lineto stroke} bdef
/MP {3 1 roll moveto 1 sub {rlineto} repeat} bdef
/AP {{rlineto} repeat} bdef
/PDlw -1 def
/W {/PDlw currentlinewidth def setlinewidth} def
/PP {closepath eofill} bdef
/DP {closepath stroke} bdef
/MR {4 -2 roll moveto dup  0 exch rlineto exch 0 rlineto
  neg 0 exch rlineto closepath} bdef
/FR {MR stroke} bdef
/PR {MR fill} bdef
/L1i {{currentfile picstr readhexstring pop} image} bdef
/tMatrix matrix def
/MakeOval {newpath tMatrix currentmatrix pop translate scale
0 0 1 0 360 arc tMatrix setmatrix} bdef
/FO {MakeOval stroke} bdef
/PO {MakeOval fill} bdef
/PD {currentlinewidth 2 div 0 360 arc fill
   PDlw -1 eq not {PDlw w /PDlw -1 def} if} def
/FA {newpath tMatrix currentmatrix pop translate scale
  0 0 1 5 -2 roll arc tMatrix setmatrix stroke} bdef
/PA {newpath tMatrix currentmatrix pop	translate 0 0 moveto scale
  0 0 1 5 -2 roll arc closepath tMatrix setmatrix fill} bdef
/FAn {newpath tMatrix currentmatrix pop translate scale
  0 0 1 5 -2 roll arcn tMatrix setmatrix stroke} bdef
/PAn {newpath tMatrix currentmatrix pop translate 0 0 moveto scale
  0 0 1 5 -2 roll arcn closepath tMatrix setmatrix fill} bdef
/vradius 0 def /hradius 0 def /lry 0 def
/lrx 0 def /uly 0 def /ulx 0 def /rad 0 def
/MRR {/vradius xdef /hradius xdef /lry xdef /lrx xdef /uly xdef
  /ulx xdef newpath tMatrix currentmatrix pop ulx hradius add uly
  vradius add translate hradius vradius scale 0 0 1 180 270 arc 
  tMatrix setmatrix lrx hradius sub uly vradius add translate
  hradius vradius scale 0 0 1 270 360 arc tMatrix setmatrix
  lrx hradius sub lry vradius sub translate hradius vradius scale
  0 0 1 0 90 arc tMatrix setmatrix ulx hradius add lry vradius sub
  translate hradius vradius scale 0 0 1 90 180 arc tMatrix setmatrix
  closepath} bdef
/FRR {MRR stroke } bdef
/PRR {MRR fill } bdef
/MlrRR {/lry xdef /lrx xdef /uly xdef /ulx xdef /rad lry uly sub 2 div def
  newpath tMatrix currentmatrix pop ulx rad add uly rad add translate
  rad rad scale 0 0 1 90 270 arc tMatrix setmatrix lrx rad sub lry rad
  sub translate rad rad scale 0 0 1 270 90 arc tMatrix setmatrix
  closepath} bdef
/FlrRR {MlrRR stroke } bdef
/PlrRR {MlrRR fill } bdef
/MtbRR {/lry xdef /lrx xdef /uly xdef /ulx xdef /rad lrx ulx sub 2 div def
  newpath tMatrix currentmatrix pop ulx rad add uly rad add translate
  rad rad scale 0 0 1 180 360 arc tMatrix setmatrix lrx rad sub lry rad
  sub translate rad rad scale 0 0 1 0 180 arc tMatrix setmatrix
  closepath} bdef
/FtbRR {MtbRR stroke } bdef
/PtbRR {MtbRR fill } bdef
/stri 6 array def /dtri 6 array def
/smat 6 array def /dmat 6 array def
/tmat1 6 array def /tmat2 6 array def /dif 3 array def
/asub {/ind2 exch def /ind1 exch def dup dup
  ind1 get exch ind2 get sub exch } bdef
/tri_to_matrix {
  2 0 asub 3 1 asub 4 0 asub 5 1 asub
  dup 0 get exch 1 get 7 -1 roll astore } bdef
/compute_transform {
  dmat dtri tri_to_matrix tmat1 invertmatrix 
  smat stri tri_to_matrix tmat2 concatmatrix } bdef
/ds {stri astore pop} bdef
/dt {dtri astore pop} bdef
/db {2 copy /cols xdef /rows xdef mul dup 3 mul string
  currentfile exch readhexstring pop
  dup 0 3 index getinterval /rbmap xdef
  dup 2 index dup getinterval /gbmap xdef
  1 index dup 2 mul exch getinterval /bbmap xdef pop pop}bdef
/it {gs np dtri aload pop moveto lineto lineto cp c
  cols rows 8 compute_transform 
  rbmap gbmap bbmap true 3 colorimage gr}bdef
/il {newpath moveto lineto stroke}bdef
currentdict end def
%%EndProlog

%%BeginSetup
MathWorks begin

0 cap

end
%%EndSetup

%%Page: 1 1
%%BeginPageSetup
%%PageBoundingBox:    48   196   543   608
MathWorks begin
bpage
%%EndPageSetup

%%BeginObject: obj1
bplot

/dpi2point 12 def
portraitMode 0216 7344 csm

  368    46  5936  4946 MR c np
86 dict begin %Colortable dictionary
/c0 { 0.000000 0.000000 0.000000 sr} bdef
/c1 { 1.000000 1.000000 1.000000 sr} bdef
/c2 { 0.900000 0.000000 0.000000 sr} bdef
/c3 { 0.000000 0.820000 0.000000 sr} bdef
/c4 { 0.000000 0.000000 0.800000 sr} bdef
/c5 { 0.910000 0.820000 0.320000 sr} bdef
/c6 { 1.000000 0.260000 0.820000 sr} bdef
/c7 { 0.000000 0.820000 0.820000 sr} bdef
c0
1 j
1 sg
   0    0 6913 5186 PR
6 w
0 4226 5357 0 0 -4226 898 4615 4 MP
PP
-5357 0 0 4226 5357 0 0 -4226 898 4615 5 MP stroke
4 w
DO
0 sg
1262 4615 mt 1262  389 L
1262  389 mt 1262  389 L
1990 4615 mt 1990  389 L
1990  389 mt 1990  389 L
2719 4615 mt 2719  389 L
2719  389 mt 2719  389 L
3448 4615 mt 3448  389 L
3448  389 mt 3448  389 L
4177 4615 mt 4177  389 L
4177  389 mt 4177  389 L
4906 4615 mt 4906  389 L
4906  389 mt 4906  389 L
5635 4615 mt 5635  389 L
5635  389 mt 5635  389 L
 898 4004 mt 6255 4004 L
6255 4004 mt 6255 4004 L
 898 1065 mt 6255 1065 L
6255 1065 mt 6255 1065 L
SO
6 w
 898 4615 mt 6255 4615 L
 898  389 mt 6255  389 L
 898 4615 mt  898  389 L
6255 4615 mt 6255  389 L
 898 4615 mt 6255 4615 L
 898 4615 mt  898  389 L
 898 4615 mt  898 4615 L
 898 4615 mt  898 4615 L
DO
 898 4615 mt  898 4615 L
 898 4615 mt  898 4615 L
SO
 898 4615 mt  898 4615 L
 898 4615 mt  898 4615 L
DO
 898 4615 mt  898 4615 L
 898 4615 mt  898 4615 L
SO
 898 4615 mt  898 4615 L
 898 4615 mt  898 4615 L
DO
 898 4615 mt  898 4615 L
 898 4615 mt  898 4615 L
SO
 898 4615 mt  898 4615 L
 898 4615 mt  898 4615 L
DO
 898 4615 mt  898 4615 L
 898 4615 mt  898 4615 L
SO
 898 4615 mt  898 4615 L
 898 4615 mt  898 4615 L
DO
 898 4615 mt  898 4615 L
 898 4615 mt  898 4615 L
SO
 898 4615 mt  898 4615 L
 898 4615 mt  898 4615 L
DO
 898 4615 mt  898 4615 L
 898 4615 mt  898 4615 L
SO
 898 4615 mt  898 4615 L
 898 4615 mt  898 4615 L
DO
 898 4615 mt  898 4615 L
 898 4615 mt  898 4615 L
SO
 898 4615 mt  898 4615 L
 898 4615 mt  898 4615 L
DO
 898 4615 mt  898 4615 L
 898 4615 mt  898 4615 L
SO
 898 4615 mt  898 4615 L
 898 4615 mt  898 4615 L
DO
 898 4615 mt  898 4615 L
 898 4615 mt  898 4615 L
SO
1262 4615 mt 1262 4561 L
1262  389 mt 1262  442 L
%%IncludeResource: font Helvetica
/Helvetica /ISOLatin1Encoding 120 FMSR

1117 4797 mt 
(10) s
%%IncludeResource: font Helvetica
/Helvetica /ISOLatin1Encoding 80 FMSR

1250 4723 mt 
(-0.4) s
 898 4615 mt  898 4615 L
 898 4615 mt  898 4615 L
DO
 898 4615 mt  898 4615 L
 898 4615 mt  898 4615 L
SO
 898 4615 mt  898 4615 L
 898 4615 mt  898 4615 L
DO
 898 4615 mt  898 4615 L
 898 4615 mt  898 4615 L
SO
 898 4615 mt  898 4615 L
 898 4615 mt  898 4615 L
DO
 898 4615 mt  898 4615 L
 898 4615 mt  898 4615 L
SO
 898 4615 mt  898 4615 L
 898 4615 mt  898 4615 L
DO
 898 4615 mt  898 4615 L
 898 4615 mt  898 4615 L
SO
 898 4615 mt  898 4615 L
 898 4615 mt  898 4615 L
DO
 898 4615 mt  898 4615 L
 898 4615 mt  898 4615 L
SO
 898 4615 mt  898 4615 L
 898 4615 mt  898 4615 L
DO
 898 4615 mt  898 4615 L
 898 4615 mt  898 4615 L
SO
 898 4615 mt  898 4615 L
 898 4615 mt  898 4615 L
DO
 898 4615 mt  898 4615 L
 898 4615 mt  898 4615 L
SO
 898 4615 mt  898 4615 L
 898 4615 mt  898 4615 L
DO
 898 4615 mt  898 4615 L
 898 4615 mt  898 4615 L
SO
 898 4615 mt  898 4615 L
 898 4615 mt  898 4615 L
DO
 898 4615 mt  898 4615 L
 898 4615 mt  898 4615 L
SO
1990 4615 mt 1990 4561 L
1990  389 mt 1990  442 L
%%IncludeResource: font Helvetica
/Helvetica /ISOLatin1Encoding 120 FMSR

1845 4797 mt 
(10) s
%%IncludeResource: font Helvetica
/Helvetica /ISOLatin1Encoding 80 FMSR

1978 4723 mt 
(-0.3) s
 898 4615 mt  898 4615 L
 898 4615 mt  898 4615 L
DO
 898 4615 mt  898 4615 L
 898 4615 mt  898 4615 L
SO
 898 4615 mt  898 4615 L
 898 4615 mt  898 4615 L
DO
 898 4615 mt  898 4615 L
 898 4615 mt  898 4615 L
SO
 898 4615 mt  898 4615 L
 898 4615 mt  898 4615 L
DO
 898 4615 mt  898 4615 L
 898 4615 mt  898 4615 L
SO
 898 4615 mt  898 4615 L
 898 4615 mt  898 4615 L
DO
 898 4615 mt  898 4615 L
 898 4615 mt  898 4615 L
SO
 898 4615 mt  898 4615 L
 898 4615 mt  898 4615 L
DO
 898 4615 mt  898 4615 L
 898 4615 mt  898 4615 L
SO
 898 4615 mt  898 4615 L
 898 4615 mt  898 4615 L
DO
 898 4615 mt  898 4615 L
 898 4615 mt  898 4615 L
SO
 898 4615 mt  898 4615 L
 898 4615 mt  898 4615 L
DO
 898 4615 mt  898 4615 L
 898 4615 mt  898 4615 L
SO
 898 4615 mt  898 4615 L
 898 4615 mt  898 4615 L
DO
 898 4615 mt  898 4615 L
 898 4615 mt  898 4615 L
SO
 898 4615 mt  898 4615 L
 898 4615 mt  898 4615 L
DO
 898 4615 mt  898 4615 L
 898 4615 mt  898 4615 L
SO
2719 4615 mt 2719 4561 L
2719  389 mt 2719  442 L
%%IncludeResource: font Helvetica
/Helvetica /ISOLatin1Encoding 120 FMSR

2574 4797 mt 
(10) s
%%IncludeResource: font Helvetica
/Helvetica /ISOLatin1Encoding 80 FMSR

2707 4723 mt 
(-0.2) s
 898 4615 mt  898 4615 L
 898 4615 mt  898 4615 L
DO
 898 4615 mt  898 4615 L
 898 4615 mt  898 4615 L
SO
 898 4615 mt  898 4615 L
 898 4615 mt  898 4615 L
DO
 898 4615 mt  898 4615 L
 898 4615 mt  898 4615 L
SO
 898 4615 mt  898 4615 L
 898 4615 mt  898 4615 L
DO
 898 4615 mt  898 4615 L
 898 4615 mt  898 4615 L
SO
 898 4615 mt  898 4615 L
 898 4615 mt  898 4615 L
DO
 898 4615 mt  898 4615 L
 898 4615 mt  898 4615 L
SO
 898 4615 mt  898 4615 L
 898 4615 mt  898 4615 L
DO
 898 4615 mt  898 4615 L
 898 4615 mt  898 4615 L
SO
 898 4615 mt  898 4615 L
 898 4615 mt  898 4615 L
DO
 898 4615 mt  898 4615 L
 898 4615 mt  898 4615 L
SO
 898 4615 mt  898 4615 L
 898 4615 mt  898 4615 L
DO
 898 4615 mt  898 4615 L
 898 4615 mt  898 4615 L
SO
 898 4615 mt  898 4615 L
 898 4615 mt  898 4615 L
DO
 898 4615 mt  898 4615 L
 898 4615 mt  898 4615 L
SO
 898 4615 mt  898 4615 L
 898 4615 mt  898 4615 L
DO
 898 4615 mt  898 4615 L
 898 4615 mt  898 4615 L
SO
3448 4615 mt 3448 4561 L
3448  389 mt 3448  442 L
%%IncludeResource: font Helvetica
/Helvetica /ISOLatin1Encoding 120 FMSR

3303 4797 mt 
(10) s
%%IncludeResource: font Helvetica
/Helvetica /ISOLatin1Encoding 80 FMSR

3436 4723 mt 
(-0.1) s
 898 4615 mt  898 4615 L
 898 4615 mt  898 4615 L
DO
 898 4615 mt  898 4615 L
 898 4615 mt  898 4615 L
SO
 898 4615 mt  898 4615 L
 898 4615 mt  898 4615 L
DO
 898 4615 mt  898 4615 L
 898 4615 mt  898 4615 L
SO
 898 4615 mt  898 4615 L
 898 4615 mt  898 4615 L
DO
 898 4615 mt  898 4615 L
 898 4615 mt  898 4615 L
SO
 898 4615 mt  898 4615 L
 898 4615 mt  898 4615 L
DO
 898 4615 mt  898 4615 L
 898 4615 mt  898 4615 L
SO
 898 4615 mt  898 4615 L
 898 4615 mt  898 4615 L
DO
 898 4615 mt  898 4615 L
 898 4615 mt  898 4615 L
SO
 898 4615 mt  898 4615 L
 898 4615 mt  898 4615 L
DO
 898 4615 mt  898 4615 L
 898 4615 mt  898 4615 L
SO
 898 4615 mt  898 4615 L
 898 4615 mt  898 4615 L
DO
 898 4615 mt  898 4615 L
 898 4615 mt  898 4615 L
SO
 898 4615 mt  898 4615 L
 898 4615 mt  898 4615 L
DO
 898 4615 mt  898 4615 L
 898 4615 mt  898 4615 L
SO
 898 4615 mt  898 4615 L
 898 4615 mt  898 4615 L
DO
 898 4615 mt  898 4615 L
 898 4615 mt  898 4615 L
SO
4177 4615 mt 4177 4561 L
4177  389 mt 4177  442 L
%%IncludeResource: font Helvetica
/Helvetica /ISOLatin1Encoding 120 FMSR

4089 4797 mt 
(10) s
%%IncludeResource: font Helvetica
/Helvetica /ISOLatin1Encoding 80 FMSR

4222 4723 mt 
(0) s
 898 4615 mt  898 4615 L
 898 4615 mt  898 4615 L
DO
 898 4615 mt  898 4615 L
 898 4615 mt  898 4615 L
SO
 898 4615 mt  898 4615 L
 898 4615 mt  898 4615 L
DO
 898 4615 mt  898 4615 L
 898 4615 mt  898 4615 L
SO
 898 4615 mt  898 4615 L
 898 4615 mt  898 4615 L
DO
 898 4615 mt  898 4615 L
 898 4615 mt  898 4615 L
SO
 898 4615 mt  898 4615 L
 898 4615 mt  898 4615 L
DO
 898 4615 mt  898 4615 L
 898 4615 mt  898 4615 L
SO
 898 4615 mt  898 4615 L
 898 4615 mt  898 4615 L
DO
 898 4615 mt  898 4615 L
 898 4615 mt  898 4615 L
SO
 898 4615 mt  898 4615 L
 898 4615 mt  898 4615 L
DO
 898 4615 mt  898 4615 L
 898 4615 mt  898 4615 L
SO
 898 4615 mt  898 4615 L
 898 4615 mt  898 4615 L
DO
 898 4615 mt  898 4615 L
 898 4615 mt  898 4615 L
SO
 898 4615 mt  898 4615 L
 898 4615 mt  898 4615 L
DO
 898 4615 mt  898 4615 L
 898 4615 mt  898 4615 L
SO
 898 4615 mt  898 4615 L
 898 4615 mt  898 4615 L
DO
 898 4615 mt  898 4615 L
 898 4615 mt  898 4615 L
SO
4906 4615 mt 4906 4561 L
4906  389 mt 4906  442 L
%%IncludeResource: font Helvetica
/Helvetica /ISOLatin1Encoding 120 FMSR

4784 4797 mt 
(10) s
%%IncludeResource: font Helvetica
/Helvetica /ISOLatin1Encoding 80 FMSR

4917 4723 mt 
(0.1) s
 898 4615 mt  898 4615 L
 898 4615 mt  898 4615 L
DO
 898 4615 mt  898 4615 L
 898 4615 mt  898 4615 L
SO
 898 4615 mt  898 4615 L
 898 4615 mt  898 4615 L
DO
 898 4615 mt  898 4615 L
 898 4615 mt  898 4615 L
SO
 898 4615 mt  898 4615 L
 898 4615 mt  898 4615 L
DO
 898 4615 mt  898 4615 L
 898 4615 mt  898 4615 L
SO
 898 4615 mt  898 4615 L
 898 4615 mt  898 4615 L
DO
 898 4615 mt  898 4615 L
 898 4615 mt  898 4615 L
SO
 898 4615 mt  898 4615 L
 898 4615 mt  898 4615 L
DO
 898 4615 mt  898 4615 L
 898 4615 mt  898 4615 L
SO
 898 4615 mt  898 4615 L
 898 4615 mt  898 4615 L
DO
 898 4615 mt  898 4615 L
 898 4615 mt  898 4615 L
SO
 898 4615 mt  898 4615 L
 898 4615 mt  898 4615 L
DO
 898 4615 mt  898 4615 L
 898 4615 mt  898 4615 L
SO
 898 4615 mt  898 4615 L
 898 4615 mt  898 4615 L
DO
 898 4615 mt  898 4615 L
 898 4615 mt  898 4615 L
SO
 898 4615 mt  898 4615 L
 898 4615 mt  898 4615 L
DO
 898 4615 mt  898 4615 L
 898 4615 mt  898 4615 L
SO
5635 4615 mt 5635 4561 L
5635  389 mt 5635  442 L
%%IncludeResource: font Helvetica
/Helvetica /ISOLatin1Encoding 120 FMSR

5513 4797 mt 
(10) s
%%IncludeResource: font Helvetica
/Helvetica /ISOLatin1Encoding 80 FMSR

5646 4723 mt 
(0.2) s
 898 4615 mt  898 4615 L
 898 4615 mt  898 4615 L
DO
 898 4615 mt  898 4615 L
 898 4615 mt  898 4615 L
SO
 898 4615 mt  898 4615 L
 898 4615 mt  898 4615 L
DO
 898 4615 mt  898 4615 L
 898 4615 mt  898 4615 L
SO
 898 4615 mt  898 4615 L
 898 4615 mt  898 4615 L
DO
 898 4615 mt  898 4615 L
 898 4615 mt  898 4615 L
SO
 898 4615 mt  898 4615 L
 898 4615 mt  898 4615 L
DO
 898 4615 mt  898 4615 L
 898 4615 mt  898 4615 L
SO
 898 4615 mt  898 4615 L
 898 4615 mt  898 4615 L
DO
 898 4615 mt  898 4615 L
 898 4615 mt  898 4615 L
SO
 898 4615 mt  898 4615 L
 898 4615 mt  898 4615 L
DO
 898 4615 mt  898 4615 L
 898 4615 mt  898 4615 L
SO
 898 4615 mt  898 4615 L
 898 4615 mt  898 4615 L
DO
 898 4615 mt  898 4615 L
 898 4615 mt  898 4615 L
SO
 898 4615 mt  898 4615 L
 898 4615 mt  898 4615 L
DO
 898 4615 mt  898 4615 L
 898 4615 mt  898 4615 L
SO
 898 4615 mt  898 4615 L
 898 4615 mt  898 4615 L
DO
 898 4615 mt  898 4615 L
 898 4615 mt  898 4615 L
SO
 898 4004 mt  925 4004 L
6255 4004 mt 6228 4004 L
DO
 898 4004 mt 6255 4004 L
6255 4004 mt 6255 4004 L
SO
 898 4138 mt  925 4138 L
6255 4138 mt 6228 4138 L
DO
 898 4138 mt 6255 4138 L
6255 4138 mt 6255 4138 L
SO
 898 4288 mt  925 4288 L
6255 4288 mt 6228 4288 L
DO
 898 4288 mt 6255 4288 L
6255 4288 mt 6255 4288 L
SO
 898 4459 mt  925 4459 L
6255 4459 mt 6228 4459 L
DO
 898 4459 mt 6255 4459 L
6255 4459 mt 6255 4459 L
SO
 898 4004 mt  952 4004 L
6255 4004 mt 6201 4004 L
%%IncludeResource: font Helvetica
/Helvetica /ISOLatin1Encoding 120 FMSR

 640 4048 mt 
(10) s
%%IncludeResource: font Helvetica
/Helvetica /ISOLatin1Encoding 80 FMSR

 773 3974 mt 
(-1) s
 898 3119 mt  925 3119 L
6255 3119 mt 6228 3119 L
DO
 898 3119 mt 6255 3119 L
6255 3119 mt 6255 3119 L
SO
 898 2602 mt  925 2602 L
6255 2602 mt 6228 2602 L
DO
 898 2602 mt 6255 2602 L
6255 2602 mt 6255 2602 L
SO
 898 2234 mt  925 2234 L
6255 2234 mt 6228 2234 L
DO
 898 2234 mt 6255 2234 L
6255 2234 mt 6255 2234 L
SO
 898 1950 mt  925 1950 L
6255 1950 mt 6228 1950 L
DO
 898 1950 mt 6255 1950 L
6255 1950 mt 6255 1950 L
SO
 898 1717 mt  925 1717 L
6255 1717 mt 6228 1717 L
DO
 898 1717 mt 6255 1717 L
6255 1717 mt 6255 1717 L
SO
 898 1520 mt  925 1520 L
6255 1520 mt 6228 1520 L
DO
 898 1520 mt 6255 1520 L
6255 1520 mt 6255 1520 L
SO
 898 1350 mt  925 1350 L
6255 1350 mt 6228 1350 L
DO
 898 1350 mt 6255 1350 L
6255 1350 mt 6255 1350 L
SO
 898 1199 mt  925 1199 L
6255 1199 mt 6228 1199 L
DO
 898 1199 mt 6255 1199 L
6255 1199 mt 6255 1199 L
SO
 898 1065 mt  925 1065 L
6255 1065 mt 6228 1065 L
DO
 898 1065 mt 6255 1065 L
6255 1065 mt 6255 1065 L
SO
 898 1065 mt  952 1065 L
6255 1065 mt 6201 1065 L
%%IncludeResource: font Helvetica
/Helvetica /ISOLatin1Encoding 120 FMSR

 640 1109 mt 
(10) s
%%IncludeResource: font Helvetica
/Helvetica /ISOLatin1Encoding 80 FMSR

 773 1035 mt 
(0) s
 898 4615 mt 6255 4615 L
 898  389 mt 6255  389 L
 898 4615 mt  898  389 L
6255 4615 mt 6255  389 L
gs 898 389 5357 4227 MR c np
/c8 { 1.000000 0.000000 0.000000 sr} bdef
c8
75 110 147 221 147 226 147 233 148 240 147 248 147 259 147 268 
148 281 147 292 147 298 147 294 148 266 147 199 147 102 147 8 
148 -49 147 -71 147 -72 147 -64 148 -53 147 -42 147 -32 147 -24 
148 -15 147 -10 147 -4 147 0 148 4 147 8 147 9 147 12 
148 13 147 15 113 11 898 1435 36 MP stroke
/c9 { 0.000000 1.000000 0.000000 sr} bdef
c9
111 258 147 359 147 381 148 411 147 446 147 487 147 517 148 465 
147 221 147 -55 147 -138 148 -117 147 -76 147 -39 147 -11 148 11 
147 27 147 39 147 47 148 52 147 53 147 51 147 47 148 40 
147 33 147 23 147 14 148 5 147 -3 113 -7 898 1075 31 MP stroke
0 sg
47 157 148 527 147 587 147 671 147 773 148 705 147 85 147 -216 
147 -138 148 -42 147 25 147 70 147 93 148 99 147 84 147 55 
147 16 148 -19 147 -44 147 -56 147 -59 148 -56 147 -50 147 -43 
147 -35 148 -28 147 -21 113 -12 898 1488 29 MP stroke
gr

%%IncludeResource: font Helvetica
/Helvetica /ISOLatin1Encoding 120 FMSR

 504 2667 mt  -90 rotate
(|H) s
90 rotate
%%IncludeResource: font Helvetica
/Helvetica /ISOLatin1Encoding 96 FMSR

 564 2550 mt  -90 rotate
(N) s
90 rotate
%%IncludeResource: font Helvetica
/Helvetica /ISOLatin1Encoding 120 FMSR

 504 2481 mt  -90 rotate
(\(f\)|) s
90 rotate
3558 4940 mt 
(f) s
2394  240 mt 
(Modulo dei filtri di Chebyshev-I per f) s
%%IncludeResource: font Helvetica
/Helvetica /ISOLatin1Encoding 96 FMSR

4333  300 mt 
(c) s
%%IncludeResource: font Helvetica
/Helvetica /ISOLatin1Encoding 120 FMSR

4381  240 mt 
(=1, ) s
%%IncludeResource: font Symbol
/Symbol /ISOLatin1Encoding 120 FMSR

4584  240 mt 
(e) s
%%IncludeResource: font Helvetica
/Helvetica /ISOLatin1Encoding 120 FMSR

4636  240 mt 
(=1) s
gs 898 389 5357 4227 MR c np
DA
/c10 { 0.000000 0.000000 1.000000 sr} bdef
c10
5357 0 898 1507 2 MP stroke
SO
gr

c10

end %%Color Dict

eplot
%%EndObject

epage
end

showpage

%%Trailer
%%EOF
