%!PS-Adobe-2.0 EPSF-1.2
%%Creator: MATLAB, The Mathworks, Inc. Version 7.5.0.338 (R2007b). Operating System: Linux 2.6.35-32-generic #67-Ubuntu SMP Mon Mar 5 19:39:49 UTC 2012 x86_64.
%%Title: ./poli_omega_costante.eps
%%CreationDate: 04/23/2012  16:53:56
%%DocumentNeededFonts: Helvetica
%%DocumentProcessColors: Cyan Magenta Yellow Black
%%Extensions: CMYK
%%Pages: 1
%%BoundingBox:    52   199   543   608
%%EndComments

%%BeginProlog
% MathWorks dictionary
/MathWorks 160 dict begin
% definition operators
/bdef {bind def} bind def
/ldef {load def} bind def
/xdef {exch def} bdef
/xstore {exch store} bdef
% operator abbreviations
/c  /clip ldef
/cc /concat ldef
/cp /closepath ldef
/gr /grestore ldef
/gs /gsave ldef
/mt /moveto ldef
/np /newpath ldef
/cm /currentmatrix ldef
/sm /setmatrix ldef
/rm /rmoveto ldef
/rl /rlineto ldef
/s {show newpath} bdef
/sc {setcmykcolor} bdef
/sr /setrgbcolor ldef
/sg /setgray ldef
/w /setlinewidth ldef
/j /setlinejoin ldef
/cap /setlinecap ldef
/rc {rectclip} bdef
/rf {rectfill} bdef
% page state control
/pgsv () def
/bpage {/pgsv save def} bdef
/epage {pgsv restore} bdef
/bplot /gsave ldef
/eplot {stroke grestore} bdef
% orientation switch
/portraitMode 0 def /landscapeMode 1 def /rotateMode 2 def
% coordinate system mappings
/dpi2point 0 def
% font control
/FontSize 0 def
/FMS {/FontSize xstore findfont [FontSize 0 0 FontSize neg 0 0]
  makefont setfont} bdef
/reencode {exch dup where {pop load} {pop StandardEncoding} ifelse
  exch dup 3 1 roll findfont dup length dict begin
  { 1 index /FID ne {def}{pop pop} ifelse } forall
  /Encoding exch def currentdict end definefont pop} bdef
/isroman {findfont /CharStrings get /Agrave known} bdef
/FMSR {3 1 roll 1 index dup isroman {reencode} {pop pop} ifelse
  exch FMS} bdef
/csm {1 dpi2point div -1 dpi2point div scale neg translate
 dup landscapeMode eq {pop -90 rotate}
  {rotateMode eq {90 rotate} if} ifelse} bdef
% line types: solid, dotted, dashed, dotdash
/SO { [] 0 setdash } bdef
/DO { [.5 dpi2point mul 4 dpi2point mul] 0 setdash } bdef
/DA { [6 dpi2point mul] 0 setdash } bdef
/DD { [.5 dpi2point mul 4 dpi2point mul 6 dpi2point mul 4
  dpi2point mul] 0 setdash } bdef
% macros for lines and objects
/L {lineto stroke} bdef
/MP {3 1 roll moveto 1 sub {rlineto} repeat} bdef
/AP {{rlineto} repeat} bdef
/PDlw -1 def
/W {/PDlw currentlinewidth def setlinewidth} def
/PP {closepath eofill} bdef
/DP {closepath stroke} bdef
/MR {4 -2 roll moveto dup  0 exch rlineto exch 0 rlineto
  neg 0 exch rlineto closepath} bdef
/FR {MR stroke} bdef
/PR {MR fill} bdef
/L1i {{currentfile picstr readhexstring pop} image} bdef
/tMatrix matrix def
/MakeOval {newpath tMatrix currentmatrix pop translate scale
0 0 1 0 360 arc tMatrix setmatrix} bdef
/FO {MakeOval stroke} bdef
/PO {MakeOval fill} bdef
/PD {currentlinewidth 2 div 0 360 arc fill
   PDlw -1 eq not {PDlw w /PDlw -1 def} if} def
/FA {newpath tMatrix currentmatrix pop translate scale
  0 0 1 5 -2 roll arc tMatrix setmatrix stroke} bdef
/PA {newpath tMatrix currentmatrix pop	translate 0 0 moveto scale
  0 0 1 5 -2 roll arc closepath tMatrix setmatrix fill} bdef
/FAn {newpath tMatrix currentmatrix pop translate scale
  0 0 1 5 -2 roll arcn tMatrix setmatrix stroke} bdef
/PAn {newpath tMatrix currentmatrix pop translate 0 0 moveto scale
  0 0 1 5 -2 roll arcn closepath tMatrix setmatrix fill} bdef
/vradius 0 def /hradius 0 def /lry 0 def
/lrx 0 def /uly 0 def /ulx 0 def /rad 0 def
/MRR {/vradius xdef /hradius xdef /lry xdef /lrx xdef /uly xdef
  /ulx xdef newpath tMatrix currentmatrix pop ulx hradius add uly
  vradius add translate hradius vradius scale 0 0 1 180 270 arc 
  tMatrix setmatrix lrx hradius sub uly vradius add translate
  hradius vradius scale 0 0 1 270 360 arc tMatrix setmatrix
  lrx hradius sub lry vradius sub translate hradius vradius scale
  0 0 1 0 90 arc tMatrix setmatrix ulx hradius add lry vradius sub
  translate hradius vradius scale 0 0 1 90 180 arc tMatrix setmatrix
  closepath} bdef
/FRR {MRR stroke } bdef
/PRR {MRR fill } bdef
/MlrRR {/lry xdef /lrx xdef /uly xdef /ulx xdef /rad lry uly sub 2 div def
  newpath tMatrix currentmatrix pop ulx rad add uly rad add translate
  rad rad scale 0 0 1 90 270 arc tMatrix setmatrix lrx rad sub lry rad
  sub translate rad rad scale 0 0 1 270 90 arc tMatrix setmatrix
  closepath} bdef
/FlrRR {MlrRR stroke } bdef
/PlrRR {MlrRR fill } bdef
/MtbRR {/lry xdef /lrx xdef /uly xdef /ulx xdef /rad lrx ulx sub 2 div def
  newpath tMatrix currentmatrix pop ulx rad add uly rad add translate
  rad rad scale 0 0 1 180 360 arc tMatrix setmatrix lrx rad sub lry rad
  sub translate rad rad scale 0 0 1 0 180 arc tMatrix setmatrix
  closepath} bdef
/FtbRR {MtbRR stroke } bdef
/PtbRR {MtbRR fill } bdef
/stri 6 array def /dtri 6 array def
/smat 6 array def /dmat 6 array def
/tmat1 6 array def /tmat2 6 array def /dif 3 array def
/asub {/ind2 exch def /ind1 exch def dup dup
  ind1 get exch ind2 get sub exch } bdef
/tri_to_matrix {
  2 0 asub 3 1 asub 4 0 asub 5 1 asub
  dup 0 get exch 1 get 7 -1 roll astore } bdef
/compute_transform {
  dmat dtri tri_to_matrix tmat1 invertmatrix 
  smat stri tri_to_matrix tmat2 concatmatrix } bdef
/ds {stri astore pop} bdef
/dt {dtri astore pop} bdef
/db {2 copy /cols xdef /rows xdef mul dup 3 mul string
  currentfile exch readhexstring pop
  dup 0 3 index getinterval /rbmap xdef
  dup 2 index dup getinterval /gbmap xdef
  1 index dup 2 mul exch getinterval /bbmap xdef pop pop}bdef
/it {gs np dtri aload pop moveto lineto lineto cp c
  cols rows 8 compute_transform 
  rbmap gbmap bbmap true 3 colorimage gr}bdef
/il {newpath moveto lineto stroke}bdef
currentdict end def
%%EndProlog

%%BeginSetup
MathWorks begin

0 cap

end
%%EndSetup

%%Page: 1 1
%%BeginPageSetup
%%PageBoundingBox:    52   199   543   608
MathWorks begin
bpage
%%EndPageSetup

%%BeginObject: obj1
bplot

/dpi2point 12 def
portraitMode 0216 7344 csm

  410    46  5895  4908 MR c np
86 dict begin %Colortable dictionary
/c0 { 0.000000 0.000000 0.000000 sr} bdef
/c1 { 1.000000 1.000000 1.000000 sr} bdef
/c2 { 0.900000 0.000000 0.000000 sr} bdef
/c3 { 0.000000 0.820000 0.000000 sr} bdef
/c4 { 0.000000 0.000000 0.800000 sr} bdef
/c5 { 0.910000 0.820000 0.320000 sr} bdef
/c6 { 1.000000 0.260000 0.820000 sr} bdef
/c7 { 0.000000 0.820000 0.820000 sr} bdef
c0
1 j
1 sg
   0    0 6913 5186 PR
6 w
0 4225 5355 0 0 -4225 899 4614 4 MP
PP
-5355 0 0 4225 5355 0 0 -4225 899 4614 5 MP stroke
4 w
DO
0 sg
1464 4614 mt 1464  389 L
1464  389 mt 1464  389 L
2520 4614 mt 2520  389 L
2520  389 mt 2520  389 L
3577 4614 mt 3577  389 L
3577  389 mt 3577  389 L
4633 4614 mt 4633  389 L
4633  389 mt 4633  389 L
5689 4614 mt 5689  389 L
5689  389 mt 5689  389 L
 899 4614 mt 6255 4614 L
6255 4614 mt 6255 4614 L
 899 4191 mt 6255 4191 L
6255 4191 mt 6255 4191 L
 899 3769 mt 6255 3769 L
6255 3769 mt 6255 3769 L
 899 3346 mt 6255 3346 L
6255 3346 mt 6255 3346 L
 899 2924 mt 6255 2924 L
6255 2924 mt 6255 2924 L
 899 2502 mt 6255 2502 L
6255 2502 mt 6255 2502 L
 899 2079 mt 6255 2079 L
6255 2079 mt 6255 2079 L
 899 1657 mt 6255 1657 L
6255 1657 mt 6255 1657 L
 899 1234 mt 6255 1234 L
6255 1234 mt 6255 1234 L
 899  812 mt 6255  812 L
6255  812 mt 6255  812 L
 899  389 mt 6255  389 L
6255  389 mt 6255  389 L
SO
6 w
 899 4614 mt 6254 4614 L
 899  389 mt 6254  389 L
 899 4614 mt  899  389 L
6254 4614 mt 6254  389 L
 899 4614 mt 6254 4614 L
 899 4614 mt  899  389 L
1464 4614 mt 1464 4560 L
1464  389 mt 1464  443 L
%%IncludeResource: font Helvetica
/Helvetica /ISOLatin1Encoding 120 FMSR

1311 4759 mt 
(-1.5) s
2520 4614 mt 2520 4560 L
2520  389 mt 2520  443 L
2417 4759 mt 
(-1) s
3577 4614 mt 3577 4560 L
3577  389 mt 3577  443 L
3424 4759 mt 
(-0.5) s
4633 4614 mt 4633 4560 L
4633  389 mt 4633  443 L
4600 4759 mt 
(0) s
5689 4614 mt 5689 4560 L
5689  389 mt 5689  443 L
5606 4759 mt 
(0.5) s
 899 4614 mt  952 4614 L
6255 4614 mt 6201 4614 L
 728 4658 mt 
(-1) s
 899 4191 mt  952 4191 L
6255 4191 mt 6201 4191 L
 628 4235 mt 
(-0.8) s
 899 3769 mt  952 3769 L
6255 3769 mt 6201 3769 L
 628 3813 mt 
(-0.6) s
 899 3346 mt  952 3346 L
6255 3346 mt 6201 3346 L
 628 3390 mt 
(-0.4) s
 899 2924 mt  952 2924 L
6255 2924 mt 6201 2924 L
 628 2968 mt 
(-0.2) s
 899 2502 mt  952 2502 L
6255 2502 mt 6201 2502 L
 798 2546 mt 
(0) s
 899 2079 mt  952 2079 L
6255 2079 mt 6201 2079 L
 698 2123 mt 
(0.2) s
 899 1657 mt  952 1657 L
6255 1657 mt 6201 1657 L
 698 1701 mt 
(0.4) s
 899 1234 mt  952 1234 L
6255 1234 mt 6201 1234 L
 698 1278 mt 
(0.6) s
 899  812 mt  952  812 L
6255  812 mt 6201  812 L
 698  856 mt 
(0.8) s
 899  389 mt  952  389 L
6255  389 mt 6201  389 L
 798  433 mt 
(1) s
 899 4614 mt 6254 4614 L
 899  389 mt 6254  389 L
 899 4614 mt  899  389 L
6254 4614 mt 6254  389 L
gs 899 389 5357 4226 MR c np
gs 3103 806 243 3392 MR c np
/c8 { 0.000000 0.000000 1.000000 sr} bdef
c8
3164  927 mt 3284  927 L
3224  867 mt 3224  987 L
3164 4076 mt 3284 4076 L
3224 4016 mt 3224 4136 L
3182  885 mt 3266  969 L
3266  885 mt 3182  969 L
3182 4034 mt 3266 4118 L
3266 4034 mt 3182 4118 L
gr

c8
gr

c8
gs 4300 279 243 4446 MR c np
/c9 { 1.000000 0.000000 0.000000 sr} bdef
c9
4361  400 mt 4481  400 L
4421  340 mt 4421  460 L
4361 4603 mt 4481 4603 L
4421 4543 mt 4421 4663 L
4379  358 mt 4463  442 L
4463  358 mt 4379  442 L
4379 4561 mt 4463 4645 L
4463 4561 mt 4379 4645 L
gr

c9
gs 899 389 5357 4226 MR c np
gr

gs 4490 268 243 4468 MR c np
/c10 { 0.000000 1.000000 0.000000 sr} bdef
c10
4551  389 mt 4671  389 L
4611  329 mt 4611  449 L
4551 4614 mt 4671 4614 L
4611 4554 mt 4611 4674 L
4569  347 mt 4653  431 L
4653  347 mt 4569  431 L
4569 4572 mt 4653 4656 L
4653 4572 mt 4569 4656 L
gr

c10
gs 899 389 5357 4226 MR c np
gr

gs 4508 268 243 4468 MR c np
0 sg
4569  389 mt 4689  389 L
4629  329 mt 4629  449 L
4569 4614 mt 4689 4614 L
4629 4554 mt 4629 4674 L
4587  347 mt 4671  431 L
4671  347 mt 4587  431 L
4587 4572 mt 4671 4656 L
4671 4572 mt 4587 4656 L
gr

0 sg
gs 899 389 5357 4226 MR c np
DA
c8
67 1 66 4 66 5 66 7 66 9 65 12 65 13 65 16 
64 17 63 20 63 21 62 24 61 25 61 27 59 30 59 31 
58 32 56 35 56 37 54 38 53 40 52 41 50 43 49 45 
48 46 46 48 45 49 43 50 41 52 40 53 38 54 37 56 
34 56 33 58 31 59 30 59 27 61 25 61 24 62 21 63 
20 63 17 64 16 65 13 65 12 65 9 66 7 66 5 66 
4 66 1 67 -1 66 -4 66 -5 66 -7 66 -9 66 -12 65 
-13 65 -16 65 -17 64 -20 63 -21 63 -24 62 -25 61 -27 61 
-30 59 -31 59 -33 58 -34 56 -37 56 -38 54 -40 53 -41 52 
-43 50 -45 49 -46 48 -48 46 -49 45 -50 43 -52 41 -53 40 
-54 38 -56 37 -56 35 -58 32 -59 31 -59 30 -61 27 -61 25 
-62 24 -63 21 -63 20 -64 17 -65 16 -65 13 -65 12 -66 9 
-66 7 -66 5 -66 4 4566 390 100 MP stroke
-67 1 4633 389 2 MP stroke
gr

c8
DA
0 sg
2529  240 mt 
(Posizione dei poli per filtri a ) s
%%IncludeResource: font Symbol
/Symbol /ISOLatin1Encoding 120 FMSR

4018  240 mt 
(w) s
%%IncludeResource: font Helvetica
/Helvetica /ISOLatin1Encoding 96 FMSR

4100  300 mt 
(0) s
%%IncludeResource: font Helvetica
/Helvetica /ISOLatin1Encoding 120 FMSR

4153  240 mt 
( costante) s
3426 4902 mt 
(Re\(p\)) s
 546 2643 mt  -90 rotate
(Im\(p\)) s
90 rotate
SO

end %%Color Dict

eplot
%%EndObject

epage
end

showpage

%%Trailer
%%EOF
