%!PS-Adobe-2.0 EPSF-1.2
%%Creator: MATLAB, The Mathworks, Inc. Version 7.5.0.338 (R2007b). Operating System: Linux 2.6.35-32-generic #67-Ubuntu SMP Mon Mar 5 19:39:49 UTC 2012 x86_64.
%%Title: ./faselin_result.eps
%%CreationDate: 05/11/2012  16:10:51
%%DocumentNeededFonts: Helvetica
%%DocumentProcessColors: Cyan Magenta Yellow Black
%%Extensions: CMYK
%%Pages: 1
%%BoundingBox:    70   215   551   602
%%EndComments

%%BeginProlog
% MathWorks dictionary
/MathWorks 160 dict begin
% definition operators
/bdef {bind def} bind def
/ldef {load def} bind def
/xdef {exch def} bdef
/xstore {exch store} bdef
% operator abbreviations
/c  /clip ldef
/cc /concat ldef
/cp /closepath ldef
/gr /grestore ldef
/gs /gsave ldef
/mt /moveto ldef
/np /newpath ldef
/cm /currentmatrix ldef
/sm /setmatrix ldef
/rm /rmoveto ldef
/rl /rlineto ldef
/s {show newpath} bdef
/sc {setcmykcolor} bdef
/sr /setrgbcolor ldef
/sg /setgray ldef
/w /setlinewidth ldef
/j /setlinejoin ldef
/cap /setlinecap ldef
/rc {rectclip} bdef
/rf {rectfill} bdef
% page state control
/pgsv () def
/bpage {/pgsv save def} bdef
/epage {pgsv restore} bdef
/bplot /gsave ldef
/eplot {stroke grestore} bdef
% orientation switch
/portraitMode 0 def /landscapeMode 1 def /rotateMode 2 def
% coordinate system mappings
/dpi2point 0 def
% font control
/FontSize 0 def
/FMS {/FontSize xstore findfont [FontSize 0 0 FontSize neg 0 0]
  makefont setfont} bdef
/reencode {exch dup where {pop load} {pop StandardEncoding} ifelse
  exch dup 3 1 roll findfont dup length dict begin
  { 1 index /FID ne {def}{pop pop} ifelse } forall
  /Encoding exch def currentdict end definefont pop} bdef
/isroman {findfont /CharStrings get /Agrave known} bdef
/FMSR {3 1 roll 1 index dup isroman {reencode} {pop pop} ifelse
  exch FMS} bdef
/csm {1 dpi2point div -1 dpi2point div scale neg translate
 dup landscapeMode eq {pop -90 rotate}
  {rotateMode eq {90 rotate} if} ifelse} bdef
% line types: solid, dotted, dashed, dotdash
/SO { [] 0 setdash } bdef
/DO { [.5 dpi2point mul 4 dpi2point mul] 0 setdash } bdef
/DA { [6 dpi2point mul] 0 setdash } bdef
/DD { [.5 dpi2point mul 4 dpi2point mul 6 dpi2point mul 4
  dpi2point mul] 0 setdash } bdef
% macros for lines and objects
/L {lineto stroke} bdef
/MP {3 1 roll moveto 1 sub {rlineto} repeat} bdef
/AP {{rlineto} repeat} bdef
/PDlw -1 def
/W {/PDlw currentlinewidth def setlinewidth} def
/PP {closepath eofill} bdef
/DP {closepath stroke} bdef
/MR {4 -2 roll moveto dup  0 exch rlineto exch 0 rlineto
  neg 0 exch rlineto closepath} bdef
/FR {MR stroke} bdef
/PR {MR fill} bdef
/L1i {{currentfile picstr readhexstring pop} image} bdef
/tMatrix matrix def
/MakeOval {newpath tMatrix currentmatrix pop translate scale
0 0 1 0 360 arc tMatrix setmatrix} bdef
/FO {MakeOval stroke} bdef
/PO {MakeOval fill} bdef
/PD {currentlinewidth 2 div 0 360 arc fill
   PDlw -1 eq not {PDlw w /PDlw -1 def} if} def
/FA {newpath tMatrix currentmatrix pop translate scale
  0 0 1 5 -2 roll arc tMatrix setmatrix stroke} bdef
/PA {newpath tMatrix currentmatrix pop	translate 0 0 moveto scale
  0 0 1 5 -2 roll arc closepath tMatrix setmatrix fill} bdef
/FAn {newpath tMatrix currentmatrix pop translate scale
  0 0 1 5 -2 roll arcn tMatrix setmatrix stroke} bdef
/PAn {newpath tMatrix currentmatrix pop translate 0 0 moveto scale
  0 0 1 5 -2 roll arcn closepath tMatrix setmatrix fill} bdef
/vradius 0 def /hradius 0 def /lry 0 def
/lrx 0 def /uly 0 def /ulx 0 def /rad 0 def
/MRR {/vradius xdef /hradius xdef /lry xdef /lrx xdef /uly xdef
  /ulx xdef newpath tMatrix currentmatrix pop ulx hradius add uly
  vradius add translate hradius vradius scale 0 0 1 180 270 arc 
  tMatrix setmatrix lrx hradius sub uly vradius add translate
  hradius vradius scale 0 0 1 270 360 arc tMatrix setmatrix
  lrx hradius sub lry vradius sub translate hradius vradius scale
  0 0 1 0 90 arc tMatrix setmatrix ulx hradius add lry vradius sub
  translate hradius vradius scale 0 0 1 90 180 arc tMatrix setmatrix
  closepath} bdef
/FRR {MRR stroke } bdef
/PRR {MRR fill } bdef
/MlrRR {/lry xdef /lrx xdef /uly xdef /ulx xdef /rad lry uly sub 2 div def
  newpath tMatrix currentmatrix pop ulx rad add uly rad add translate
  rad rad scale 0 0 1 90 270 arc tMatrix setmatrix lrx rad sub lry rad
  sub translate rad rad scale 0 0 1 270 90 arc tMatrix setmatrix
  closepath} bdef
/FlrRR {MlrRR stroke } bdef
/PlrRR {MlrRR fill } bdef
/MtbRR {/lry xdef /lrx xdef /uly xdef /ulx xdef /rad lrx ulx sub 2 div def
  newpath tMatrix currentmatrix pop ulx rad add uly rad add translate
  rad rad scale 0 0 1 180 360 arc tMatrix setmatrix lrx rad sub lry rad
  sub translate rad rad scale 0 0 1 0 180 arc tMatrix setmatrix
  closepath} bdef
/FtbRR {MtbRR stroke } bdef
/PtbRR {MtbRR fill } bdef
/stri 6 array def /dtri 6 array def
/smat 6 array def /dmat 6 array def
/tmat1 6 array def /tmat2 6 array def /dif 3 array def
/asub {/ind2 exch def /ind1 exch def dup dup
  ind1 get exch ind2 get sub exch } bdef
/tri_to_matrix {
  2 0 asub 3 1 asub 4 0 asub 5 1 asub
  dup 0 get exch 1 get 7 -1 roll astore } bdef
/compute_transform {
  dmat dtri tri_to_matrix tmat1 invertmatrix 
  smat stri tri_to_matrix tmat2 concatmatrix } bdef
/ds {stri astore pop} bdef
/dt {dtri astore pop} bdef
/db {2 copy /cols xdef /rows xdef mul dup 3 mul string
  currentfile exch readhexstring pop
  dup 0 3 index getinterval /rbmap xdef
  dup 2 index dup getinterval /gbmap xdef
  1 index dup 2 mul exch getinterval /bbmap xdef pop pop}bdef
/it {gs np dtri aload pop moveto lineto lineto cp c
  cols rows 8 compute_transform 
  rbmap gbmap bbmap true 3 colorimage gr}bdef
/il {newpath moveto lineto stroke}bdef
currentdict end def
%%EndProlog

%%BeginSetup
MathWorks begin

0 cap

end
%%EndSetup

%%Page: 1 1
%%BeginPageSetup
%%PageBoundingBox:    70   215   551   602
MathWorks begin
bpage
%%EndPageSetup

%%BeginObject: obj1
bplot

/dpi2point 12 def
portraitMode 0216 7344 csm

  628   110  5776  4651 MR c np
85 dict begin %Colortable dictionary
/c0 { 0.000000 0.000000 0.000000 sr} bdef
/c1 { 1.000000 1.000000 1.000000 sr} bdef
/c2 { 0.900000 0.000000 0.000000 sr} bdef
/c3 { 0.000000 0.820000 0.000000 sr} bdef
/c4 { 0.000000 0.000000 0.800000 sr} bdef
/c5 { 0.910000 0.820000 0.320000 sr} bdef
/c6 { 1.000000 0.260000 0.820000 sr} bdef
/c7 { 0.000000 0.820000 0.820000 sr} bdef
c0
1 j
1 sg
   0    0 6913 5186 PR
6 w
0 4226 5355 0 0 -4226 899 4615 4 MP
PP
-5355 0 0 4226 5355 0 0 -4226 899 4615 5 MP stroke
4 w
DO
SO
6 w
0 sg
 899 4615 mt 6254 4615 L
 899  389 mt 6254  389 L
 899 4615 mt  899  389 L
6254 4615 mt 6254  389 L
 899 4615 mt 6254 4615 L
 899 4615 mt  899  389 L
 899 4615 mt  899 4561 L
 899  389 mt  899  442 L
%%IncludeResource: font Helvetica
/Helvetica /ISOLatin1Encoding 120 FMSR

 866 4760 mt 
(0) s
1664 4615 mt 1664 4561 L
1664  389 mt 1664  442 L
1598 4760 mt 
(20) s
2429 4615 mt 2429 4561 L
2429  389 mt 2429  442 L
2363 4760 mt 
(40) s
3194 4615 mt 3194 4561 L
3194  389 mt 3194  442 L
3128 4760 mt 
(60) s
3959 4615 mt 3959 4561 L
3959  389 mt 3959  442 L
3893 4760 mt 
(80) s
4724 4615 mt 4724 4561 L
4724  389 mt 4724  442 L
4624 4760 mt 
(100) s
5489 4615 mt 5489 4561 L
5489  389 mt 5489  442 L
5389 4760 mt 
(120) s
6255 4615 mt 6255 4561 L
6255  389 mt 6255  442 L
6155 4760 mt 
(140) s
 899 4615 mt  952 4615 L
6255 4615 mt 6201 4615 L
 628 4659 mt 
(-0.2) s
 899 4011 mt  952 4011 L
6255 4011 mt 6201 4011 L
 798 4055 mt 
(0) s
 899 3407 mt  952 3407 L
6255 3407 mt 6201 3407 L
 698 3451 mt 
(0.2) s
 899 2803 mt  952 2803 L
6255 2803 mt 6201 2803 L
 698 2847 mt 
(0.4) s
 899 2200 mt  952 2200 L
6255 2200 mt 6201 2200 L
 698 2244 mt 
(0.6) s
 899 1596 mt  952 1596 L
6255 1596 mt 6201 1596 L
 698 1640 mt 
(0.8) s
 899  992 mt  952  992 L
6255  992 mt 6201  992 L
 798 1036 mt 
(1) s
 899  389 mt  952  389 L
6255  389 mt 6201  389 L
 698  433 mt 
(1.2) s
 899 4615 mt 6254 4615 L
 899  389 mt 6254  389 L
 899 4615 mt  899  389 L
6254 4615 mt 6254  389 L
gs 899 389 5357 4227 MR c np
DO
38 0 38 0 39 0 38 0 38 0 38 0 39 0 38 0 
38 0 39 0 38 0 38 0 38 0 39 0 38 0 38 0 
38 0 39 0 38 0 38 3019 38 0 39 0 38 0 38 0 
38 0 39 0 38 0 38 0 38 0 39 0 38 0 38 0 
38 0 39 0 38 0 38 0 38 0 39 0 38 0 38 0 
38 0 39 0 38 0 38 0 38 0 39 0 38 0 38 0 
39 0 38 0 38 0 38 0 39 0 38 0 38 0 38 0 
39 0 38 0 38 0 38 -3019 39 0 38 0 38 0 38 0 
39 0 38 0 38 0 38 0 39 0 38 0 38 0 38 0 
39 0 38 0 38 0 38 0 39 0 38 0 38 0 937 4011 80 MP stroke
SO
/c8 { 1.000000 0.000000 0.000000 sr} bdef
c8
38 0 39 0 38 0 38 0 38 0 39 0 38 0 38 0 
38 0 39 0 38 0 38 0 38 0 39 0 38 0 38 0 
38 0 39 0 38 0 38 0 38 1 39 1 38 1 38 1 
38 0 39 -3 38 -8 38 -9 39 -7 38 2 38 14 38 27 
39 33 38 24 38 -2 38 -42 39 -81 38 -99 38 -75 38 3 
39 132 38 291 38 446 38 559 39 601 38 559 38 446 38 291 
39 132 38 3 38 -75 38 -99 39 -81 38 -42 38 -2 38 25 
39 33 38 27 38 14 39 1 38 -8 38 -10 38 -8 39 -5 
38 0 38 5 38 8 39 10 38 8 38 -1 38 -14 39 -27 
38 -33 38 -25 38 2 39 42 38 81 38 99 38 75 39 -3 
38 -132 38 -291 38 -446 39 -559 38 -601 38 -559 38 -446 39 -291 
38 -132 38 -3 38 75 39 99 38 81 38 42 38 2 39 -24 
38 -33 38 -27 39 -14 2084 4032 100 MP stroke
38 -2 38 7 38 9 39 8 38 3 38 0 38 -1 39 -1 
38 -1 38 -1 38 0 39 0 38 0 38 0 38 0 39 0 
38 0 38 0 38 0 39 0 38 0 38 0 38 0 39 0 
38 0 38 0 38 0 39 0 38 0 38 0 937 4011 31 MP stroke
DA
/c9 { 0.000000 0.000000 1.000000 sr} bdef
c9
38 0 39 0 38 0 38 0 38 0 39 0 38 0 38 0 
38 0 39 0 38 0 38 0 38 0 39 0 38 0 38 0 
38 0 39 0 38 0 38 0 38 0 39 0 38 0 38 0 
38 0 39 0 38 0 38 1 39 2 38 1 38 -2 38 -3 
39 -6 38 -5 38 0 38 8 39 15 38 19 38 13 38 -4 
39 -25 38 -45 38 -50 38 -32 39 6 38 58 38 99 38 113 
39 83 38 11 38 -86 38 -177 39 -226 38 -211 38 -120 38 29 
39 205 38 371 38 492 39 545 38 531 38 464 38 363 39 258 
38 163 38 92 38 44 39 17 38 4 38 0 38 2 39 3 
38 6 38 5 38 0 39 -8 38 -15 38 -19 38 -13 39 4 
38 25 38 45 38 50 39 32 38 -6 38 -58 38 -99 39 -113 
38 -83 38 -11 38 86 39 177 38 226 38 211 38 120 39 -29 
38 -205 38 -371 39 -492 2084 1526 100 MP stroke
38 -545 38 -531 38 -464 39 -363 38 -258 38 -163 38 -91 39 -45 
38 -18 38 -6 38 -1 39 0 38 0 38 0 38 0 39 0 
38 0 38 0 38 0 39 0 38 0 38 0 38 0 39 0 
38 0 38 0 38 0 39 0 38 0 38 0 937 4011 31 MP stroke
gr

c9
DA
0 sg
3112  294 mt 
(Azione su un rect) s
 882 4658 mt 
( ) s
6239  431 mt 
( ) s
SO
1 sg
0 480 1186 0 0 -480 5009 929 4 MP
PP
-1186 0 0 480 1186 0 0 -480 5009 929 5 MP stroke
4 w
DO
SO
6 w
0 sg
5009  929 mt 6195  929 L
5009  449 mt 6195  449 L
5009  929 mt 5009  449 L
6195  929 mt 6195  449 L
5009  929 mt 6195  929 L
5009  929 mt 5009  449 L
5009  929 mt 6195  929 L
5009  449 mt 6195  449 L
5009  929 mt 5009  449 L
6195  929 mt 6195  449 L
5474  582 mt 
(Input) s
gs 5009 449 1187 481 MR c np
DO
357 0 5080 539 2 MP stroke
SO
gr

5474  732 mt 
(Fase lineare) s
gs 5009 449 1187 481 MR c np
c8
357 0 5080 689 2 MP stroke
gr

c8
0 sg
5474  881 mt 
(Fase minima) s
gs 5009 449 1187 481 MR c np
DA
c9
357 0 5080 838 2 MP stroke
SO
gr

c9

end %%Color Dict

eplot
%%EndObject

epage
end

showpage

%%Trailer
%%EOF
