%!PS-Adobe-2.0 EPSF-1.2
%%Creator: MATLAB, The Mathworks, Inc. Version 7.5.0.338 (R2007b). Operating System: Linux 2.6.35-32-generic #67-Ubuntu SMP Mon Mar 5 19:39:49 UTC 2012 x86_64.
%%Title: ./filtri_butterworth.eps
%%CreationDate: 04/20/2012  12:26:51
%%DocumentNeededFonts: Helvetica
%%DocumentProcessColors: Cyan Magenta Yellow Black
%%Extensions: CMYK
%%Pages: 1
%%BoundingBox:    53   196   550   602
%%EndComments

%%BeginProlog
% MathWorks dictionary
/MathWorks 160 dict begin
% definition operators
/bdef {bind def} bind def
/ldef {load def} bind def
/xdef {exch def} bdef
/xstore {exch store} bdef
% operator abbreviations
/c  /clip ldef
/cc /concat ldef
/cp /closepath ldef
/gr /grestore ldef
/gs /gsave ldef
/mt /moveto ldef
/np /newpath ldef
/cm /currentmatrix ldef
/sm /setmatrix ldef
/rm /rmoveto ldef
/rl /rlineto ldef
/s {show newpath} bdef
/sc {setcmykcolor} bdef
/sr /setrgbcolor ldef
/sg /setgray ldef
/w /setlinewidth ldef
/j /setlinejoin ldef
/cap /setlinecap ldef
/rc {rectclip} bdef
/rf {rectfill} bdef
% page state control
/pgsv () def
/bpage {/pgsv save def} bdef
/epage {pgsv restore} bdef
/bplot /gsave ldef
/eplot {stroke grestore} bdef
% orientation switch
/portraitMode 0 def /landscapeMode 1 def /rotateMode 2 def
% coordinate system mappings
/dpi2point 0 def
% font control
/FontSize 0 def
/FMS {/FontSize xstore findfont [FontSize 0 0 FontSize neg 0 0]
  makefont setfont} bdef
/reencode {exch dup where {pop load} {pop StandardEncoding} ifelse
  exch dup 3 1 roll findfont dup length dict begin
  { 1 index /FID ne {def}{pop pop} ifelse } forall
  /Encoding exch def currentdict end definefont pop} bdef
/isroman {findfont /CharStrings get /Agrave known} bdef
/FMSR {3 1 roll 1 index dup isroman {reencode} {pop pop} ifelse
  exch FMS} bdef
/csm {1 dpi2point div -1 dpi2point div scale neg translate
 dup landscapeMode eq {pop -90 rotate}
  {rotateMode eq {90 rotate} if} ifelse} bdef
% line types: solid, dotted, dashed, dotdash
/SO { [] 0 setdash } bdef
/DO { [.5 dpi2point mul 4 dpi2point mul] 0 setdash } bdef
/DA { [6 dpi2point mul] 0 setdash } bdef
/DD { [.5 dpi2point mul 4 dpi2point mul 6 dpi2point mul 4
  dpi2point mul] 0 setdash } bdef
% macros for lines and objects
/L {lineto stroke} bdef
/MP {3 1 roll moveto 1 sub {rlineto} repeat} bdef
/AP {{rlineto} repeat} bdef
/PDlw -1 def
/W {/PDlw currentlinewidth def setlinewidth} def
/PP {closepath eofill} bdef
/DP {closepath stroke} bdef
/MR {4 -2 roll moveto dup  0 exch rlineto exch 0 rlineto
  neg 0 exch rlineto closepath} bdef
/FR {MR stroke} bdef
/PR {MR fill} bdef
/L1i {{currentfile picstr readhexstring pop} image} bdef
/tMatrix matrix def
/MakeOval {newpath tMatrix currentmatrix pop translate scale
0 0 1 0 360 arc tMatrix setmatrix} bdef
/FO {MakeOval stroke} bdef
/PO {MakeOval fill} bdef
/PD {currentlinewidth 2 div 0 360 arc fill
   PDlw -1 eq not {PDlw w /PDlw -1 def} if} def
/FA {newpath tMatrix currentmatrix pop translate scale
  0 0 1 5 -2 roll arc tMatrix setmatrix stroke} bdef
/PA {newpath tMatrix currentmatrix pop	translate 0 0 moveto scale
  0 0 1 5 -2 roll arc closepath tMatrix setmatrix fill} bdef
/FAn {newpath tMatrix currentmatrix pop translate scale
  0 0 1 5 -2 roll arcn tMatrix setmatrix stroke} bdef
/PAn {newpath tMatrix currentmatrix pop translate 0 0 moveto scale
  0 0 1 5 -2 roll arcn closepath tMatrix setmatrix fill} bdef
/vradius 0 def /hradius 0 def /lry 0 def
/lrx 0 def /uly 0 def /ulx 0 def /rad 0 def
/MRR {/vradius xdef /hradius xdef /lry xdef /lrx xdef /uly xdef
  /ulx xdef newpath tMatrix currentmatrix pop ulx hradius add uly
  vradius add translate hradius vradius scale 0 0 1 180 270 arc 
  tMatrix setmatrix lrx hradius sub uly vradius add translate
  hradius vradius scale 0 0 1 270 360 arc tMatrix setmatrix
  lrx hradius sub lry vradius sub translate hradius vradius scale
  0 0 1 0 90 arc tMatrix setmatrix ulx hradius add lry vradius sub
  translate hradius vradius scale 0 0 1 90 180 arc tMatrix setmatrix
  closepath} bdef
/FRR {MRR stroke } bdef
/PRR {MRR fill } bdef
/MlrRR {/lry xdef /lrx xdef /uly xdef /ulx xdef /rad lry uly sub 2 div def
  newpath tMatrix currentmatrix pop ulx rad add uly rad add translate
  rad rad scale 0 0 1 90 270 arc tMatrix setmatrix lrx rad sub lry rad
  sub translate rad rad scale 0 0 1 270 90 arc tMatrix setmatrix
  closepath} bdef
/FlrRR {MlrRR stroke } bdef
/PlrRR {MlrRR fill } bdef
/MtbRR {/lry xdef /lrx xdef /uly xdef /ulx xdef /rad lrx ulx sub 2 div def
  newpath tMatrix currentmatrix pop ulx rad add uly rad add translate
  rad rad scale 0 0 1 180 360 arc tMatrix setmatrix lrx rad sub lry rad
  sub translate rad rad scale 0 0 1 0 180 arc tMatrix setmatrix
  closepath} bdef
/FtbRR {MtbRR stroke } bdef
/PtbRR {MtbRR fill } bdef
/stri 6 array def /dtri 6 array def
/smat 6 array def /dmat 6 array def
/tmat1 6 array def /tmat2 6 array def /dif 3 array def
/asub {/ind2 exch def /ind1 exch def dup dup
  ind1 get exch ind2 get sub exch } bdef
/tri_to_matrix {
  2 0 asub 3 1 asub 4 0 asub 5 1 asub
  dup 0 get exch 1 get 7 -1 roll astore } bdef
/compute_transform {
  dmat dtri tri_to_matrix tmat1 invertmatrix 
  smat stri tri_to_matrix tmat2 concatmatrix } bdef
/ds {stri astore pop} bdef
/dt {dtri astore pop} bdef
/db {2 copy /cols xdef /rows xdef mul dup 3 mul string
  currentfile exch readhexstring pop
  dup 0 3 index getinterval /rbmap xdef
  dup 2 index dup getinterval /gbmap xdef
  1 index dup 2 mul exch getinterval /bbmap xdef pop pop}bdef
/it {gs np dtri aload pop moveto lineto lineto cp c
  cols rows 8 compute_transform 
  rbmap gbmap bbmap true 3 colorimage gr}bdef
/il {newpath moveto lineto stroke}bdef
currentdict end def
%%EndProlog

%%BeginSetup
MathWorks begin

0 cap

end
%%EndSetup

%%Page: 1 1
%%BeginPageSetup
%%PageBoundingBox:    53   196   550   602
MathWorks begin
bpage
%%EndPageSetup

%%BeginObject: obj1
bplot

/dpi2point 12 def
portraitMode 0216 7344 csm

  422   109  5971  4883 MR c np
86 dict begin %Colortable dictionary
/c0 { 0.000000 0.000000 0.000000 sr} bdef
/c1 { 1.000000 1.000000 1.000000 sr} bdef
/c2 { 0.900000 0.000000 0.000000 sr} bdef
/c3 { 0.000000 0.820000 0.000000 sr} bdef
/c4 { 0.000000 0.000000 0.800000 sr} bdef
/c5 { 0.910000 0.820000 0.320000 sr} bdef
/c6 { 1.000000 0.260000 0.820000 sr} bdef
/c7 { 0.000000 0.820000 0.820000 sr} bdef
c0
1 j
1 sg
   0    0 6913 5186 PR
6 w
0 4226 5356 0 0 -4226 899 4615 4 MP
PP
-5356 0 0 4226 5356 0 0 -4226 899 4615 5 MP stroke
4 w
DO
SO
6 w
0 sg
 899 4615 mt 6255 4615 L
 899  389 mt 6255  389 L
 899 4615 mt  899  389 L
6255 4615 mt 6255  389 L
 899 4615 mt 6255 4615 L
 899 4615 mt  899  389 L
 899 4615 mt  899 4588 L
 899  389 mt  899  415 L
 899 4615 mt  899 4561 L
 899  389 mt  899  442 L
%%IncludeResource: font Helvetica
/Helvetica /ISOLatin1Encoding 120 FMSR

 787 4797 mt 
(10) s
%%IncludeResource: font Helvetica
/Helvetica /ISOLatin1Encoding 80 FMSR

 920 4723 mt 
(-1) s
1705 4615 mt 1705 4588 L
1705  389 mt 1705  415 L
2176 4615 mt 2176 4588 L
2176  389 mt 2176  415 L
2511 4615 mt 2511 4588 L
2511  389 mt 2511  415 L
2770 4615 mt 2770 4588 L
2770  389 mt 2770  415 L
2982 4615 mt 2982 4588 L
2982  389 mt 2982  415 L
3162 4615 mt 3162 4588 L
3162  389 mt 3162  415 L
3317 4615 mt 3317 4588 L
3317  389 mt 3317  415 L
3454 4615 mt 3454 4588 L
3454  389 mt 3454  415 L
3577 4615 mt 3577 4588 L
3577  389 mt 3577  415 L
3577 4615 mt 3577 4561 L
3577  389 mt 3577  442 L
%%IncludeResource: font Helvetica
/Helvetica /ISOLatin1Encoding 120 FMSR

3489 4797 mt 
(10) s
%%IncludeResource: font Helvetica
/Helvetica /ISOLatin1Encoding 80 FMSR

3622 4723 mt 
(0) s
4383 4615 mt 4383 4588 L
4383  389 mt 4383  415 L
4854 4615 mt 4854 4588 L
4854  389 mt 4854  415 L
5189 4615 mt 5189 4588 L
5189  389 mt 5189  415 L
5448 4615 mt 5448 4588 L
5448  389 mt 5448  415 L
5660 4615 mt 5660 4588 L
5660  389 mt 5660  415 L
5840 4615 mt 5840 4588 L
5840  389 mt 5840  415 L
5995 4615 mt 5995 4588 L
5995  389 mt 5995  415 L
6132 4615 mt 6132 4588 L
6132  389 mt 6132  415 L
6255 4615 mt 6255 4588 L
6255  389 mt 6255  415 L
6255 4615 mt 6255 4561 L
6255  389 mt 6255  442 L
%%IncludeResource: font Helvetica
/Helvetica /ISOLatin1Encoding 120 FMSR

6167 4797 mt 
(10) s
%%IncludeResource: font Helvetica
/Helvetica /ISOLatin1Encoding 80 FMSR

6300 4723 mt 
(1) s
 899 4615 mt  925 4615 L
6255 4615 mt 6228 4615 L
 899 4615 mt  952 4615 L
6255 4615 mt 6201 4615 L
%%IncludeResource: font Helvetica
/Helvetica /ISOLatin1Encoding 120 FMSR

 640 4659 mt 
(10) s
%%IncludeResource: font Helvetica
/Helvetica /ISOLatin1Encoding 80 FMSR

 773 4585 mt 
(-3) s
 899 4214 mt  925 4214 L
6255 4214 mt 6228 4214 L
 899 3980 mt  925 3980 L
6255 3980 mt 6228 3980 L
 899 3813 mt  925 3813 L
6255 3813 mt 6228 3813 L
 899 3684 mt  925 3684 L
6255 3684 mt 6228 3684 L
 899 3579 mt  925 3579 L
6255 3579 mt 6228 3579 L
 899 3490 mt  925 3490 L
6255 3490 mt 6228 3490 L
 899 3413 mt  925 3413 L
6255 3413 mt 6228 3413 L
 899 3345 mt  925 3345 L
6255 3345 mt 6228 3345 L
 899 3284 mt  925 3284 L
6255 3284 mt 6228 3284 L
 899 3284 mt  952 3284 L
6255 3284 mt 6201 3284 L
%%IncludeResource: font Helvetica
/Helvetica /ISOLatin1Encoding 120 FMSR

 640 3328 mt 
(10) s
%%IncludeResource: font Helvetica
/Helvetica /ISOLatin1Encoding 80 FMSR

 773 3254 mt 
(-2) s
 899 2883 mt  925 2883 L
6255 2883 mt 6228 2883 L
 899 2649 mt  925 2649 L
6255 2649 mt 6228 2649 L
 899 2483 mt  925 2483 L
6255 2483 mt 6228 2483 L
 899 2354 mt  925 2354 L
6255 2354 mt 6228 2354 L
 899 2249 mt  925 2249 L
6255 2249 mt 6228 2249 L
 899 2159 mt  925 2159 L
6255 2159 mt 6228 2159 L
 899 2082 mt  925 2082 L
6255 2082 mt 6228 2082 L
 899 2014 mt  925 2014 L
6255 2014 mt 6228 2014 L
 899 1953 mt  925 1953 L
6255 1953 mt 6228 1953 L
 899 1953 mt  952 1953 L
6255 1953 mt 6201 1953 L
%%IncludeResource: font Helvetica
/Helvetica /ISOLatin1Encoding 120 FMSR

 640 1997 mt 
(10) s
%%IncludeResource: font Helvetica
/Helvetica /ISOLatin1Encoding 80 FMSR

 773 1923 mt 
(-1) s
 899 1553 mt  925 1553 L
6255 1553 mt 6228 1553 L
 899 1319 mt  925 1319 L
6255 1319 mt 6228 1319 L
 899 1152 mt  925 1152 L
6255 1152 mt 6228 1152 L
 899 1023 mt  925 1023 L
6255 1023 mt 6228 1023 L
 899  918 mt  925  918 L
6255  918 mt 6228  918 L
 899  829 mt  925  829 L
6255  829 mt 6228  829 L
 899  752 mt  925  752 L
6255  752 mt 6228  752 L
 899  684 mt  925  684 L
6255  684 mt 6228  684 L
 899  623 mt  925  623 L
6255  623 mt 6228  623 L
 899  623 mt  952  623 L
6255  623 mt 6201  623 L
%%IncludeResource: font Helvetica
/Helvetica /ISOLatin1Encoding 120 FMSR

 640  667 mt 
(10) s
%%IncludeResource: font Helvetica
/Helvetica /ISOLatin1Encoding 80 FMSR

 773  593 mt 
(0) s
 899 4615 mt 6255 4615 L
 899  389 mt 6255  389 L
 899 4615 mt  899  389 L
6255 4615 mt 6255  389 L
gs 899 388 5357 4228 MR c np
/c8 { 0.000000 0.000000 1.000000 sr} bdef
c8
110 163 109 163 109 163 110 163 109 163 109 163 110 163 109 163 
109 163 110 163 109 163 109 162 109 163 110 163 109 162 109 162 
110 161 109 160 109 157 110 154 109 147 109 138 110 123 109 103 
109 82 109 59 110 40 109 26 109 15 110 9 109 6 109 3 
110 2 109 1 109 0 110 1 109 0 109 0 109 0 110 0 
109 0 109 0 110 0 109 0 109 0 110 0 109 0 109 0 
109 0 899 623 50 MP stroke
/c9 { 1.000000 0.000000 0.000000 sr} bdef
c9
23 56 109 271 109 272 109 271 110 272 109 271 109 272 110 271 
109 272 109 270 110 269 109 265 109 256 110 235 109 194 109 136 
109 77 110 37 109 16 109 6 110 3 109 1 109 0 110 0 
109 0 109 0 110 0 109 0 109 0 109 0 110 0 109 0 
109 0 110 0 109 0 109 0 110 0 109 0 109 0 109 0 
899 623 41 MP stroke
/c10 { 0.000000 1.000000 0.000000 sr} bdef
c10
1 1 109 381 109 380 110 380 109 380 109 380 110 380 109 378 
109 372 110 353 109 298 109 190 109 83 110 27 109 7 109 2 
110 1 109 0 109 0 110 0 109 0 109 0 110 0 109 0 
109 0 109 0 110 0 109 0 109 0 110 0 109 0 109 0 
110 0 109 0 109 0 109 0 899 623 37 MP stroke
0 sg
73 327 109 489 109 489 110 489 109 488 109 485 110 471 109 408 
109 244 109 81 110 18 109 3 109 1 110 0 109 0 109 0 
110 0 109 0 109 0 110 0 109 0 109 0 109 0 110 0 
109 0 109 0 110 0 109 0 109 0 110 0 109 0 109 0 
109 0 899 623 34 MP stroke
DA
c8
5356 0 899 829 2 MP stroke
gr

c8
DA
0 sg
%%IncludeResource: font Helvetica
/Helvetica /ISOLatin1Encoding 120 FMSR

 558 2634 mt  -90 rotate
(|H\(f\)|) s
90 rotate
3559 4940 mt 
(f) s
2779  293 mt 
(Butterworth filters N=3, 5, 7, 9) s
SO

end %%Color Dict

eplot
%%EndObject

epage
end

showpage

%%Trailer
%%EOF
