%!PS-Adobe-2.0 EPSF-1.2
%%Creator: MATLAB, The Mathworks, Inc. Version 7.5.0.338 (R2007b). Operating System: Linux 2.6.35-32-generic #67-Ubuntu SMP Mon Mar 5 19:39:49 UTC 2012 x86_64.
%%Title: ./filtri_omega_costante.eps
%%CreationDate: 04/23/2012  16:53:56
%%DocumentNeededFonts: Helvetica
%%DocumentProcessColors: Cyan Magenta Yellow Black
%%Extensions: CMYK
%%Pages: 1
%%BoundingBox:    53   196   550   608
%%EndComments

%%BeginProlog
% MathWorks dictionary
/MathWorks 160 dict begin
% definition operators
/bdef {bind def} bind def
/ldef {load def} bind def
/xdef {exch def} bdef
/xstore {exch store} bdef
% operator abbreviations
/c  /clip ldef
/cc /concat ldef
/cp /closepath ldef
/gr /grestore ldef
/gs /gsave ldef
/mt /moveto ldef
/np /newpath ldef
/cm /currentmatrix ldef
/sm /setmatrix ldef
/rm /rmoveto ldef
/rl /rlineto ldef
/s {show newpath} bdef
/sc {setcmykcolor} bdef
/sr /setrgbcolor ldef
/sg /setgray ldef
/w /setlinewidth ldef
/j /setlinejoin ldef
/cap /setlinecap ldef
/rc {rectclip} bdef
/rf {rectfill} bdef
% page state control
/pgsv () def
/bpage {/pgsv save def} bdef
/epage {pgsv restore} bdef
/bplot /gsave ldef
/eplot {stroke grestore} bdef
% orientation switch
/portraitMode 0 def /landscapeMode 1 def /rotateMode 2 def
% coordinate system mappings
/dpi2point 0 def
% font control
/FontSize 0 def
/FMS {/FontSize xstore findfont [FontSize 0 0 FontSize neg 0 0]
  makefont setfont} bdef
/reencode {exch dup where {pop load} {pop StandardEncoding} ifelse
  exch dup 3 1 roll findfont dup length dict begin
  { 1 index /FID ne {def}{pop pop} ifelse } forall
  /Encoding exch def currentdict end definefont pop} bdef
/isroman {findfont /CharStrings get /Agrave known} bdef
/FMSR {3 1 roll 1 index dup isroman {reencode} {pop pop} ifelse
  exch FMS} bdef
/csm {1 dpi2point div -1 dpi2point div scale neg translate
 dup landscapeMode eq {pop -90 rotate}
  {rotateMode eq {90 rotate} if} ifelse} bdef
% line types: solid, dotted, dashed, dotdash
/SO { [] 0 setdash } bdef
/DO { [.5 dpi2point mul 4 dpi2point mul] 0 setdash } bdef
/DA { [6 dpi2point mul] 0 setdash } bdef
/DD { [.5 dpi2point mul 4 dpi2point mul 6 dpi2point mul 4
  dpi2point mul] 0 setdash } bdef
% macros for lines and objects
/L {lineto stroke} bdef
/MP {3 1 roll moveto 1 sub {rlineto} repeat} bdef
/AP {{rlineto} repeat} bdef
/PDlw -1 def
/W {/PDlw currentlinewidth def setlinewidth} def
/PP {closepath eofill} bdef
/DP {closepath stroke} bdef
/MR {4 -2 roll moveto dup  0 exch rlineto exch 0 rlineto
  neg 0 exch rlineto closepath} bdef
/FR {MR stroke} bdef
/PR {MR fill} bdef
/L1i {{currentfile picstr readhexstring pop} image} bdef
/tMatrix matrix def
/MakeOval {newpath tMatrix currentmatrix pop translate scale
0 0 1 0 360 arc tMatrix setmatrix} bdef
/FO {MakeOval stroke} bdef
/PO {MakeOval fill} bdef
/PD {currentlinewidth 2 div 0 360 arc fill
   PDlw -1 eq not {PDlw w /PDlw -1 def} if} def
/FA {newpath tMatrix currentmatrix pop translate scale
  0 0 1 5 -2 roll arc tMatrix setmatrix stroke} bdef
/PA {newpath tMatrix currentmatrix pop	translate 0 0 moveto scale
  0 0 1 5 -2 roll arc closepath tMatrix setmatrix fill} bdef
/FAn {newpath tMatrix currentmatrix pop translate scale
  0 0 1 5 -2 roll arcn tMatrix setmatrix stroke} bdef
/PAn {newpath tMatrix currentmatrix pop translate 0 0 moveto scale
  0 0 1 5 -2 roll arcn closepath tMatrix setmatrix fill} bdef
/vradius 0 def /hradius 0 def /lry 0 def
/lrx 0 def /uly 0 def /ulx 0 def /rad 0 def
/MRR {/vradius xdef /hradius xdef /lry xdef /lrx xdef /uly xdef
  /ulx xdef newpath tMatrix currentmatrix pop ulx hradius add uly
  vradius add translate hradius vradius scale 0 0 1 180 270 arc 
  tMatrix setmatrix lrx hradius sub uly vradius add translate
  hradius vradius scale 0 0 1 270 360 arc tMatrix setmatrix
  lrx hradius sub lry vradius sub translate hradius vradius scale
  0 0 1 0 90 arc tMatrix setmatrix ulx hradius add lry vradius sub
  translate hradius vradius scale 0 0 1 90 180 arc tMatrix setmatrix
  closepath} bdef
/FRR {MRR stroke } bdef
/PRR {MRR fill } bdef
/MlrRR {/lry xdef /lrx xdef /uly xdef /ulx xdef /rad lry uly sub 2 div def
  newpath tMatrix currentmatrix pop ulx rad add uly rad add translate
  rad rad scale 0 0 1 90 270 arc tMatrix setmatrix lrx rad sub lry rad
  sub translate rad rad scale 0 0 1 270 90 arc tMatrix setmatrix
  closepath} bdef
/FlrRR {MlrRR stroke } bdef
/PlrRR {MlrRR fill } bdef
/MtbRR {/lry xdef /lrx xdef /uly xdef /ulx xdef /rad lrx ulx sub 2 div def
  newpath tMatrix currentmatrix pop ulx rad add uly rad add translate
  rad rad scale 0 0 1 180 360 arc tMatrix setmatrix lrx rad sub lry rad
  sub translate rad rad scale 0 0 1 0 180 arc tMatrix setmatrix
  closepath} bdef
/FtbRR {MtbRR stroke } bdef
/PtbRR {MtbRR fill } bdef
/stri 6 array def /dtri 6 array def
/smat 6 array def /dmat 6 array def
/tmat1 6 array def /tmat2 6 array def /dif 3 array def
/asub {/ind2 exch def /ind1 exch def dup dup
  ind1 get exch ind2 get sub exch } bdef
/tri_to_matrix {
  2 0 asub 3 1 asub 4 0 asub 5 1 asub
  dup 0 get exch 1 get 7 -1 roll astore } bdef
/compute_transform {
  dmat dtri tri_to_matrix tmat1 invertmatrix 
  smat stri tri_to_matrix tmat2 concatmatrix } bdef
/ds {stri astore pop} bdef
/dt {dtri astore pop} bdef
/db {2 copy /cols xdef /rows xdef mul dup 3 mul string
  currentfile exch readhexstring pop
  dup 0 3 index getinterval /rbmap xdef
  dup 2 index dup getinterval /gbmap xdef
  1 index dup 2 mul exch getinterval /bbmap xdef pop pop}bdef
/it {gs np dtri aload pop moveto lineto lineto cp c
  cols rows 8 compute_transform 
  rbmap gbmap bbmap true 3 colorimage gr}bdef
/il {newpath moveto lineto stroke}bdef
currentdict end def
%%EndProlog

%%BeginSetup
MathWorks begin

0 cap

end
%%EndSetup

%%Page: 1 1
%%BeginPageSetup
%%PageBoundingBox:    53   196   550   608
MathWorks begin
bpage
%%EndPageSetup

%%BeginObject: obj1
bplot

/dpi2point 12 def
portraitMode 0216 7344 csm

  422    46  5971  4946 MR c np
86 dict begin %Colortable dictionary
/c0 { 0.000000 0.000000 0.000000 sr} bdef
/c1 { 1.000000 1.000000 1.000000 sr} bdef
/c2 { 0.900000 0.000000 0.000000 sr} bdef
/c3 { 0.000000 0.820000 0.000000 sr} bdef
/c4 { 0.000000 0.000000 0.800000 sr} bdef
/c5 { 0.910000 0.820000 0.320000 sr} bdef
/c6 { 1.000000 0.260000 0.820000 sr} bdef
/c7 { 0.000000 0.820000 0.820000 sr} bdef
c0
1 j
1 sg
   0    0 6913 5186 PR
6 w
0 4226 5356 0 0 -4226 899 4615 4 MP
PP
-5356 0 0 4226 5356 0 0 -4226 899 4615 5 MP stroke
4 w
DO
0 sg
 899 4615 mt  899  389 L
 899  389 mt  899  389 L
2684 4615 mt 2684  389 L
2684  389 mt 2684  389 L
4469 4615 mt 4469  389 L
4469  389 mt 4469  389 L
6255 4615 mt 6255  389 L
6255  389 mt 6255  389 L
 899 4615 mt 6255 4615 L
6255 4615 mt 6255 4615 L
 899 3910 mt 6255 3910 L
6255 3910 mt 6255 3910 L
 899 3206 mt 6255 3206 L
6255 3206 mt 6255 3206 L
 899 2502 mt 6255 2502 L
6255 2502 mt 6255 2502 L
 899 1797 mt 6255 1797 L
6255 1797 mt 6255 1797 L
 899 1093 mt 6255 1093 L
6255 1093 mt 6255 1093 L
 899  389 mt 6255  389 L
6255  389 mt 6255  389 L
SO
6 w
 899 4615 mt 6255 4615 L
 899  389 mt 6255  389 L
 899 4615 mt  899  389 L
6255 4615 mt 6255  389 L
 899 4615 mt 6255 4615 L
 899 4615 mt  899  389 L
 899 4615 mt  899 4588 L
 899  389 mt  899  415 L
DO
 899 4615 mt  899  389 L
 899  389 mt  899  389 L
SO
 899 4615 mt  899 4561 L
 899  389 mt  899  442 L
%%IncludeResource: font Helvetica
/Helvetica /ISOLatin1Encoding 120 FMSR

 787 4797 mt 
(10) s
%%IncludeResource: font Helvetica
/Helvetica /ISOLatin1Encoding 80 FMSR

 920 4723 mt 
(-1) s
1436 4615 mt 1436 4588 L
1436  389 mt 1436  415 L
DO
1436 4615 mt 1436  389 L
1436  389 mt 1436  389 L
SO
1750 4615 mt 1750 4588 L
1750  389 mt 1750  415 L
DO
1750 4615 mt 1750  389 L
1750  389 mt 1750  389 L
SO
1973 4615 mt 1973 4588 L
1973  389 mt 1973  415 L
DO
1973 4615 mt 1973  389 L
1973  389 mt 1973  389 L
SO
2146 4615 mt 2146 4588 L
2146  389 mt 2146  415 L
DO
2146 4615 mt 2146  389 L
2146  389 mt 2146  389 L
SO
2288 4615 mt 2288 4588 L
2288  389 mt 2288  415 L
DO
2288 4615 mt 2288  389 L
2288  389 mt 2288  389 L
SO
2407 4615 mt 2407 4588 L
2407  389 mt 2407  415 L
DO
2407 4615 mt 2407  389 L
2407  389 mt 2407  389 L
SO
2511 4615 mt 2511 4588 L
2511  389 mt 2511  415 L
DO
2511 4615 mt 2511  389 L
2511  389 mt 2511  389 L
SO
2602 4615 mt 2602 4588 L
2602  389 mt 2602  415 L
DO
2602 4615 mt 2602  389 L
2602  389 mt 2602  389 L
SO
2684 4615 mt 2684 4588 L
2684  389 mt 2684  415 L
DO
2684 4615 mt 2684  389 L
2684  389 mt 2684  389 L
SO
2684 4615 mt 2684 4561 L
2684  389 mt 2684  442 L
%%IncludeResource: font Helvetica
/Helvetica /ISOLatin1Encoding 120 FMSR

2596 4797 mt 
(10) s
%%IncludeResource: font Helvetica
/Helvetica /ISOLatin1Encoding 80 FMSR

2729 4723 mt 
(0) s
3221 4615 mt 3221 4588 L
3221  389 mt 3221  415 L
DO
3221 4615 mt 3221  389 L
3221  389 mt 3221  389 L
SO
3536 4615 mt 3536 4588 L
3536  389 mt 3536  415 L
DO
3536 4615 mt 3536  389 L
3536  389 mt 3536  389 L
SO
3759 4615 mt 3759 4588 L
3759  389 mt 3759  415 L
DO
3759 4615 mt 3759  389 L
3759  389 mt 3759  389 L
SO
3932 4615 mt 3932 4588 L
3932  389 mt 3932  415 L
DO
3932 4615 mt 3932  389 L
3932  389 mt 3932  389 L
SO
4073 4615 mt 4073 4588 L
4073  389 mt 4073  415 L
DO
4073 4615 mt 4073  389 L
4073  389 mt 4073  389 L
SO
4193 4615 mt 4193 4588 L
4193  389 mt 4193  415 L
DO
4193 4615 mt 4193  389 L
4193  389 mt 4193  389 L
SO
4296 4615 mt 4296 4588 L
4296  389 mt 4296  415 L
DO
4296 4615 mt 4296  389 L
4296  389 mt 4296  389 L
SO
4387 4615 mt 4387 4588 L
4387  389 mt 4387  415 L
DO
4387 4615 mt 4387  389 L
4387  389 mt 4387  389 L
SO
4469 4615 mt 4469 4588 L
4469  389 mt 4469  415 L
DO
4469 4615 mt 4469  389 L
4469  389 mt 4469  389 L
SO
4469 4615 mt 4469 4561 L
4469  389 mt 4469  442 L
%%IncludeResource: font Helvetica
/Helvetica /ISOLatin1Encoding 120 FMSR

4381 4797 mt 
(10) s
%%IncludeResource: font Helvetica
/Helvetica /ISOLatin1Encoding 80 FMSR

4514 4723 mt 
(1) s
5007 4615 mt 5007 4588 L
5007  389 mt 5007  415 L
DO
5007 4615 mt 5007  389 L
5007  389 mt 5007  389 L
SO
5321 4615 mt 5321 4588 L
5321  389 mt 5321  415 L
DO
5321 4615 mt 5321  389 L
5321  389 mt 5321  389 L
SO
5544 4615 mt 5544 4588 L
5544  389 mt 5544  415 L
DO
5544 4615 mt 5544  389 L
5544  389 mt 5544  389 L
SO
5717 4615 mt 5717 4588 L
5717  389 mt 5717  415 L
DO
5717 4615 mt 5717  389 L
5717  389 mt 5717  389 L
SO
5858 4615 mt 5858 4588 L
5858  389 mt 5858  415 L
DO
5858 4615 mt 5858  389 L
5858  389 mt 5858  389 L
SO
5978 4615 mt 5978 4588 L
5978  389 mt 5978  415 L
DO
5978 4615 mt 5978  389 L
5978  389 mt 5978  389 L
SO
6081 4615 mt 6081 4588 L
6081  389 mt 6081  415 L
DO
6081 4615 mt 6081  389 L
6081  389 mt 6081  389 L
SO
6173 4615 mt 6173 4588 L
6173  389 mt 6173  415 L
DO
6173 4615 mt 6173  389 L
6173  389 mt 6173  389 L
SO
6255 4615 mt 6255 4588 L
6255  389 mt 6255  415 L
DO
6255 4615 mt 6255  389 L
6255  389 mt 6255  389 L
SO
6255 4615 mt 6255 4561 L
6255  389 mt 6255  442 L
%%IncludeResource: font Helvetica
/Helvetica /ISOLatin1Encoding 120 FMSR

6167 4797 mt 
(10) s
%%IncludeResource: font Helvetica
/Helvetica /ISOLatin1Encoding 80 FMSR

6300 4723 mt 
(2) s
 899 4615 mt  925 4615 L
6255 4615 mt 6228 4615 L
DO
 899 4615 mt 6255 4615 L
6255 4615 mt 6255 4615 L
SO
 899 4615 mt  952 4615 L
6255 4615 mt 6201 4615 L
%%IncludeResource: font Helvetica
/Helvetica /ISOLatin1Encoding 120 FMSR

 640 4659 mt 
(10) s
%%IncludeResource: font Helvetica
/Helvetica /ISOLatin1Encoding 80 FMSR

 773 4585 mt 
(-3) s
 899 4402 mt  925 4402 L
6255 4402 mt 6228 4402 L
DO
 899 4402 mt 6255 4402 L
6255 4402 mt 6255 4402 L
SO
 899 4278 mt  925 4278 L
6255 4278 mt 6228 4278 L
DO
 899 4278 mt 6255 4278 L
6255 4278 mt 6255 4278 L
SO
 899 4190 mt  925 4190 L
6255 4190 mt 6228 4190 L
DO
 899 4190 mt 6255 4190 L
6255 4190 mt 6255 4190 L
SO
 899 4122 mt  925 4122 L
6255 4122 mt 6228 4122 L
DO
 899 4122 mt 6255 4122 L
6255 4122 mt 6255 4122 L
SO
 899 4066 mt  925 4066 L
6255 4066 mt 6228 4066 L
DO
 899 4066 mt 6255 4066 L
6255 4066 mt 6255 4066 L
SO
 899 4019 mt  925 4019 L
6255 4019 mt 6228 4019 L
DO
 899 4019 mt 6255 4019 L
6255 4019 mt 6255 4019 L
SO
 899 3978 mt  925 3978 L
6255 3978 mt 6228 3978 L
DO
 899 3978 mt 6255 3978 L
6255 3978 mt 6255 3978 L
SO
 899 3942 mt  925 3942 L
6255 3942 mt 6228 3942 L
DO
 899 3942 mt 6255 3942 L
6255 3942 mt 6255 3942 L
SO
 899 3910 mt  925 3910 L
6255 3910 mt 6228 3910 L
DO
 899 3910 mt 6255 3910 L
6255 3910 mt 6255 3910 L
SO
 899 3910 mt  952 3910 L
6255 3910 mt 6201 3910 L
%%IncludeResource: font Helvetica
/Helvetica /ISOLatin1Encoding 120 FMSR

 640 3954 mt 
(10) s
%%IncludeResource: font Helvetica
/Helvetica /ISOLatin1Encoding 80 FMSR

 773 3880 mt 
(-2) s
 899 3698 mt  925 3698 L
6255 3698 mt 6228 3698 L
DO
 899 3698 mt 6255 3698 L
6255 3698 mt 6255 3698 L
SO
 899 3574 mt  925 3574 L
6255 3574 mt 6228 3574 L
DO
 899 3574 mt 6255 3574 L
6255 3574 mt 6255 3574 L
SO
 899 3486 mt  925 3486 L
6255 3486 mt 6228 3486 L
DO
 899 3486 mt 6255 3486 L
6255 3486 mt 6255 3486 L
SO
 899 3418 mt  925 3418 L
6255 3418 mt 6228 3418 L
DO
 899 3418 mt 6255 3418 L
6255 3418 mt 6255 3418 L
SO
 899 3362 mt  925 3362 L
6255 3362 mt 6228 3362 L
DO
 899 3362 mt 6255 3362 L
6255 3362 mt 6255 3362 L
SO
 899 3315 mt  925 3315 L
6255 3315 mt 6228 3315 L
DO
 899 3315 mt 6255 3315 L
6255 3315 mt 6255 3315 L
SO
 899 3274 mt  925 3274 L
6255 3274 mt 6228 3274 L
DO
 899 3274 mt 6255 3274 L
6255 3274 mt 6255 3274 L
SO
 899 3238 mt  925 3238 L
6255 3238 mt 6228 3238 L
DO
 899 3238 mt 6255 3238 L
6255 3238 mt 6255 3238 L
SO
 899 3206 mt  925 3206 L
6255 3206 mt 6228 3206 L
DO
 899 3206 mt 6255 3206 L
6255 3206 mt 6255 3206 L
SO
 899 3206 mt  952 3206 L
6255 3206 mt 6201 3206 L
%%IncludeResource: font Helvetica
/Helvetica /ISOLatin1Encoding 120 FMSR

 640 3250 mt 
(10) s
%%IncludeResource: font Helvetica
/Helvetica /ISOLatin1Encoding 80 FMSR

 773 3176 mt 
(-1) s
 899 2994 mt  925 2994 L
6255 2994 mt 6228 2994 L
DO
 899 2994 mt 6255 2994 L
6255 2994 mt 6255 2994 L
SO
 899 2870 mt  925 2870 L
6255 2870 mt 6228 2870 L
DO
 899 2870 mt 6255 2870 L
6255 2870 mt 6255 2870 L
SO
 899 2782 mt  925 2782 L
6255 2782 mt 6228 2782 L
DO
 899 2782 mt 6255 2782 L
6255 2782 mt 6255 2782 L
SO
 899 2714 mt  925 2714 L
6255 2714 mt 6228 2714 L
DO
 899 2714 mt 6255 2714 L
6255 2714 mt 6255 2714 L
SO
 899 2658 mt  925 2658 L
6255 2658 mt 6228 2658 L
DO
 899 2658 mt 6255 2658 L
6255 2658 mt 6255 2658 L
SO
 899 2611 mt  925 2611 L
6255 2611 mt 6228 2611 L
DO
 899 2611 mt 6255 2611 L
6255 2611 mt 6255 2611 L
SO
 899 2570 mt  925 2570 L
6255 2570 mt 6228 2570 L
DO
 899 2570 mt 6255 2570 L
6255 2570 mt 6255 2570 L
SO
 899 2534 mt  925 2534 L
6255 2534 mt 6228 2534 L
DO
 899 2534 mt 6255 2534 L
6255 2534 mt 6255 2534 L
SO
 899 2502 mt  925 2502 L
6255 2502 mt 6228 2502 L
DO
 899 2502 mt 6255 2502 L
6255 2502 mt 6255 2502 L
SO
 899 2502 mt  952 2502 L
6255 2502 mt 6201 2502 L
%%IncludeResource: font Helvetica
/Helvetica /ISOLatin1Encoding 120 FMSR

 640 2546 mt 
(10) s
%%IncludeResource: font Helvetica
/Helvetica /ISOLatin1Encoding 80 FMSR

 773 2472 mt 
(0) s
 899 2289 mt  925 2289 L
6255 2289 mt 6228 2289 L
DO
 899 2289 mt 6255 2289 L
6255 2289 mt 6255 2289 L
SO
 899 2165 mt  925 2165 L
6255 2165 mt 6228 2165 L
DO
 899 2165 mt 6255 2165 L
6255 2165 mt 6255 2165 L
SO
 899 2077 mt  925 2077 L
6255 2077 mt 6228 2077 L
DO
 899 2077 mt 6255 2077 L
6255 2077 mt 6255 2077 L
SO
 899 2009 mt  925 2009 L
6255 2009 mt 6228 2009 L
DO
 899 2009 mt 6255 2009 L
6255 2009 mt 6255 2009 L
SO
 899 1953 mt  925 1953 L
6255 1953 mt 6228 1953 L
DO
 899 1953 mt 6255 1953 L
6255 1953 mt 6255 1953 L
SO
 899 1906 mt  925 1906 L
6255 1906 mt 6228 1906 L
DO
 899 1906 mt 6255 1906 L
6255 1906 mt 6255 1906 L
SO
 899 1865 mt  925 1865 L
6255 1865 mt 6228 1865 L
DO
 899 1865 mt 6255 1865 L
6255 1865 mt 6255 1865 L
SO
 899 1829 mt  925 1829 L
6255 1829 mt 6228 1829 L
DO
 899 1829 mt 6255 1829 L
6255 1829 mt 6255 1829 L
SO
 899 1797 mt  925 1797 L
6255 1797 mt 6228 1797 L
DO
 899 1797 mt 6255 1797 L
6255 1797 mt 6255 1797 L
SO
 899 1797 mt  952 1797 L
6255 1797 mt 6201 1797 L
%%IncludeResource: font Helvetica
/Helvetica /ISOLatin1Encoding 120 FMSR

 640 1841 mt 
(10) s
%%IncludeResource: font Helvetica
/Helvetica /ISOLatin1Encoding 80 FMSR

 773 1767 mt 
(1) s
 899 1585 mt  925 1585 L
6255 1585 mt 6228 1585 L
DO
 899 1585 mt 6255 1585 L
6255 1585 mt 6255 1585 L
SO
 899 1461 mt  925 1461 L
6255 1461 mt 6228 1461 L
DO
 899 1461 mt 6255 1461 L
6255 1461 mt 6255 1461 L
SO
 899 1373 mt  925 1373 L
6255 1373 mt 6228 1373 L
DO
 899 1373 mt 6255 1373 L
6255 1373 mt 6255 1373 L
SO
 899 1305 mt  925 1305 L
6255 1305 mt 6228 1305 L
DO
 899 1305 mt 6255 1305 L
6255 1305 mt 6255 1305 L
SO
 899 1249 mt  925 1249 L
6255 1249 mt 6228 1249 L
DO
 899 1249 mt 6255 1249 L
6255 1249 mt 6255 1249 L
SO
 899 1202 mt  925 1202 L
6255 1202 mt 6228 1202 L
DO
 899 1202 mt 6255 1202 L
6255 1202 mt 6255 1202 L
SO
 899 1161 mt  925 1161 L
6255 1161 mt 6228 1161 L
DO
 899 1161 mt 6255 1161 L
6255 1161 mt 6255 1161 L
SO
 899 1125 mt  925 1125 L
6255 1125 mt 6228 1125 L
DO
 899 1125 mt 6255 1125 L
6255 1125 mt 6255 1125 L
SO
 899 1093 mt  925 1093 L
6255 1093 mt 6228 1093 L
DO
 899 1093 mt 6255 1093 L
6255 1093 mt 6255 1093 L
SO
 899 1093 mt  952 1093 L
6255 1093 mt 6201 1093 L
%%IncludeResource: font Helvetica
/Helvetica /ISOLatin1Encoding 120 FMSR

 640 1137 mt 
(10) s
%%IncludeResource: font Helvetica
/Helvetica /ISOLatin1Encoding 80 FMSR

 773 1063 mt 
(2) s
 899  881 mt  925  881 L
6255  881 mt 6228  881 L
DO
 899  881 mt 6255  881 L
6255  881 mt 6255  881 L
SO
 899  757 mt  925  757 L
6255  757 mt 6228  757 L
DO
 899  757 mt 6255  757 L
6255  757 mt 6255  757 L
SO
 899  669 mt  925  669 L
6255  669 mt 6228  669 L
DO
 899  669 mt 6255  669 L
6255  669 mt 6255  669 L
SO
 899  601 mt  925  601 L
6255  601 mt 6228  601 L
DO
 899  601 mt 6255  601 L
6255  601 mt 6255  601 L
SO
 899  545 mt  925  545 L
6255  545 mt 6228  545 L
DO
 899  545 mt 6255  545 L
6255  545 mt 6255  545 L
SO
 899  498 mt  925  498 L
6255  498 mt 6228  498 L
DO
 899  498 mt 6255  498 L
6255  498 mt 6255  498 L
SO
 899  457 mt  925  457 L
6255  457 mt 6228  457 L
DO
 899  457 mt 6255  457 L
6255  457 mt 6255  457 L
SO
 899  421 mt  925  421 L
6255  421 mt 6228  421 L
DO
 899  421 mt 6255  421 L
6255  421 mt 6255  421 L
SO
 899  389 mt  925  389 L
6255  389 mt 6228  389 L
DO
 899  389 mt 6255  389 L
6255  389 mt 6255  389 L
SO
 899  389 mt  952  389 L
6255  389 mt 6201  389 L
%%IncludeResource: font Helvetica
/Helvetica /ISOLatin1Encoding 120 FMSR

 640  433 mt 
(10) s
%%IncludeResource: font Helvetica
/Helvetica /ISOLatin1Encoding 80 FMSR

 773  359 mt 
(3) s
 899 4615 mt 6255 4615 L
 899  389 mt 6255  389 L
 899 4615 mt  899  389 L
6255 4615 mt 6255  389 L
gs 899 389 5357 4227 MR c np
/c8 { 0.000000 0.000000 1.000000 sr} bdef
c8
6 4 5 4 6 4 5 5 5 4 6 4 5 4 5 5 
6 4 5 4 5 4 6 4 5 5 6 4 5 4 5 4 
6 5 5 4 5 4 6 4 5 5 5 4 6 4 5 4 
6 4 5 5 5 4 6 4 5 4 5 5 6 4 5 4 
5 4 6 5 5 4 6 4 5 4 5 5 6 4 5 4 
5 4 6 4 5 5 5 4 6 4 5 4 5 5 6 4 
5 4 6 4 5 5 5 4 6 4 5 4 5 4 6 5 
5 4 5 4 6 4 5 5 6 4 5 4 5 4 6 5 
5 4 5 4 6 4 5 5 5 4 6 4 5 4 6 4 
5 5 5 4 6 4 5 4 5 5 6 4 5 4 5 4 
6 5 5 4 5 4 6 4 5 5 6 4 5 4 5 4 
6 4 5 5 5 4 6 4 5 4 5 5 6 4 5 4 
6 4 5 5 5 4 5724 3775 100 MP stroke
6 4 5 4 5 5 6 4 5 4 5 4 6 4 5 5 
6 4 5 4 5 4 6 5 5 4 5 4 6 4 5 5 
5 4 6 4 5 4 6 5 5 4 5 4 6 4 5 5 
5 4 6 4 5 4 5 4 6 5 5 4 5 4 6 4 
5 5 6 4 5 4 5 4 6 5 5 4 5 4 6 4 
5 5 5 4 6 4 5 4 6 5 5 4 5 4 6 4 
5 5 5 4 6 4 5 4 5 4 6 5 5 4 6 4 
5 4 5 5 6 4 5 4 5 4 6 5 5 4 5 4 
6 4 5 5 5 4 6 4 5 4 6 5 5 4 5 4 
6 4 5 5 5 4 6 4 5 4 5 5 6 4 5 4 
6 4 5 4 5 5 6 4 5 4 5 4 6 5 5 4 
5 4 6 4 5 5 6 4 5 4 5 4 6 5 5 4 
5 4 6 4 5 5 5193 3355 100 MP stroke
5 4 6 4 5 4 5 5 6 4 5 4 6 4 5 5 
5 4 6 4 5 4 5 5 6 4 5 4 5 4 6 5 
5 4 6 4 5 4 5 4 6 5 5 4 5 4 6 4 
5 5 5 4 6 4 5 4 6 5 5 4 5 4 6 4 
5 5 5 4 6 4 5 4 5 5 6 4 5 4 6 4 
5 4 5 5 6 4 5 4 5 4 6 5 5 4 5 4 
6 4 5 5 5 4 6 4 5 4 6 4 5 5 5 4 
6 4 5 4 5 4 6 5 5 4 5 4 6 4 5 5 
6 4 5 4 5 4 6 4 5 5 5 4 6 4 5 4 
5 4 6 5 5 4 6 4 5 4 5 4 6 4 5 5 
5 4 6 4 5 4 5 4 6 4 5 5 5 4 6 4 
5 4 6 4 5 4 5 4 6 5 5 4 5 4 6 4 
5 4 5 4 6 4 4662 2939 100 MP stroke
5 4 6 4 5 5 5 4 6 4 5 4 5 4 6 4 
5 4 5 4 6 4 5 4 6 4 5 4 5 4 6 4 
5 4 5 4 6 4 5 4 5 4 6 4 5 4 5 4 
6 4 5 4 6 4 5 3 5 4 6 4 5 4 5 4 
6 4 5 4 5 3 6 4 5 4 6 4 5 3 5 4 
6 4 5 4 5 3 6 4 5 4 5 3 6 4 5 4 
6 3 5 4 5 3 6 4 5 3 5 4 6 3 5 4 
5 3 6 4 5 3 6 3 5 4 5 3 6 3 5 4 
5 3 6 3 5 3 5 4 6 3 5 3 5 3 6 3 
5 3 6 3 5 3 5 3 6 3 5 3 5 3 6 3 
5 3 5 2 6 3 5 3 6 3 5 2 5 3 6 3 
5 2 5 3 6 2 5 3 5 2 6 3 5 2 6 2 
5 3 5 2 6 2 4131 2599 100 MP stroke
5 3 5 2 6 2 5 2 5 2 6 2 5 2 5 2 
6 2 5 2 6 2 5 2 5 2 6 2 5 1 5 2 
6 2 5 2 5 1 6 2 5 1 6 2 5 2 5 1 
6 1 5 2 5 1 6 2 5 1 5 1 6 2 5 1 
6 1 5 1 5 2 6 1 5 1 5 1 6 1 5 1 
5 1 6 1 5 1 5 1 6 1 5 1 6 1 5 1 
5 0 6 1 5 1 5 1 6 1 5 0 5 1 6 1 
5 0 6 1 5 1 5 0 6 1 5 1 5 0 6 1 
5 0 5 1 6 0 5 1 6 0 5 1 5 0 6 1 
5 0 5 1 6 0 5 0 5 1 6 0 5 0 6 1 
5 0 5 0 6 1 5 0 5 0 6 1 5 0 5 0 
6 0 5 1 5 0 6 0 5 0 6 1 5 0 5 0 
6 0 5 0 5 1 3601 2503 100 MP stroke
6 0 5 0 5 0 6 0 5 0 6 1 5 0 5 0 
6 0 5 0 5 0 6 0 5 0 5 1 6 0 5 0 
6 0 5 0 5 0 6 0 5 0 5 0 6 0 5 0 
5 0 6 0 5 1 5 0 6 0 5 0 6 0 5 0 
5 0 6 0 5 0 5 0 6 0 5 0 5 0 6 0 
5 0 6 0 5 0 5 0 6 0 5 0 5 0 6 0 
5 0 5 0 6 0 5 0 6 0 5 0 5 0 6 0 
5 0 5 0 6 0 5 0 5 0 6 0 5 0 6 0 
5 0 5 0 6 0 5 0 5 0 6 0 5 0 5 0 
6 0 5 0 5 0 6 0 5 0 6 0 5 0 5 0 
6 0 5 0 5 0 6 0 5 0 5 0 6 0 5 0 
6 0 5 0 5 0 6 0 5 0 5 0 6 0 5 0 
5 0 6 0 5 0 3070 2500 100 MP stroke
6 0 5 0 5 0 6 0 5 0 5 0 6 0 5 0 
5 0 6 0 5 0 5 0 6 0 5 0 6 0 5 0 
5 0 6 0 5 0 5 0 6 0 5 0 5 0 6 0 
5 0 6 0 5 0 5 0 6 0 5 0 5 0 6 0 
5 0 5 0 6 0 5 0 6 0 5 0 5 0 6 0 
5 0 5 0 6 0 5 0 5 0 6 0 5 0 5 0 
6 0 5 -1 6 0 5 0 5 0 6 0 5 0 5 0 
6 0 5 0 5 0 6 0 5 0 6 0 5 0 5 0 
6 0 5 0 5 0 6 0 5 0 5 0 6 0 5 0 
6 0 5 0 5 0 6 0 5 0 5 0 6 0 5 0 
5 0 6 0 5 0 6 0 5 0 5 0 6 0 5 0 
5 0 6 0 5 0 5 0 6 0 5 0 5 0 6 0 
5 0 6 0 5 0 2539 2501 100 MP stroke
5 0 6 0 5 0 5 0 6 0 5 0 5 0 6 0 
5 0 6 0 5 0 5 0 6 0 5 0 5 0 6 0 
5 0 5 0 6 0 5 0 6 0 5 0 5 0 6 0 
5 0 5 0 6 0 5 0 5 0 6 0 5 0 5 0 
6 0 5 0 6 0 5 0 5 0 6 0 5 0 5 0 
6 0 5 0 5 0 6 0 5 0 6 0 5 0 5 0 
6 0 5 0 5 0 6 0 5 0 5 0 6 0 5 0 
6 0 5 0 5 0 6 0 5 0 5 0 6 0 5 0 
5 0 6 0 5 0 5 0 6 0 5 0 6 0 5 0 
5 0 6 0 5 0 5 0 6 0 5 0 5 0 6 0 
5 0 6 0 5 0 5 0 6 0 5 0 5 0 6 0 
5 0 5 0 6 0 5 0 6 0 5 0 5 0 6 0 
5 0 5 0 6 0 2008 2501 100 MP stroke
5 0 5 0 6 0 5 0 6 0 5 0 5 0 6 0 
5 0 5 0 6 0 5 0 5 0 6 0 5 0 5 0 
6 0 5 0 6 0 5 0 5 0 6 0 5 0 5 0 
6 0 5 0 5 0 6 0 5 0 6 0 5 0 5 0 
6 0 5 0 5 0 6 0 5 0 5 0 6 0 5 0 
6 0 5 0 5 0 6 0 5 0 5 0 6 0 5 0 
5 0 6 0 5 0 5 0 6 0 5 0 6 0 5 0 
5 0 6 0 5 0 5 0 6 0 5 0 5 0 6 0 
5 0 6 0 5 0 5 0 6 0 5 0 5 0 6 0 
5 0 5 0 6 0 5 0 6 0 5 0 5 0 6 0 
5 0 5 0 6 0 5 0 5 0 6 0 5 0 5 0 
6 0 5 0 6 0 5 0 5 0 6 0 5 0 5 0 
6 0 5 0 5 0 1478 2501 100 MP stroke
6 0 5 0 6 0 5 0 5 0 6 0 5 0 5 0 
6 0 5 0 5 0 6 0 5 0 6 0 5 0 5 0 
6 0 5 0 5 0 6 0 5 0 5 0 6 0 5 0 
6 0 5 0 5 0 6 0 5 0 5 0 6 0 5 0 
5 0 6 0 5 0 5 0 6 0 5 0 6 0 5 0 
5 0 6 0 5 0 5 0 6 0 5 0 5 0 6 0 
5 0 6 0 5 0 5 0 6 0 5 0 5 0 6 0 
5 0 5 0 6 0 5 0 6 0 5 0 5 0 6 0 
5 0 5 0 6 0 5 0 5 0 6 0 5 0 5 0 
6 0 5 0 6 0 5 0 5 0 6 0 5 0 5 0 
6 0 5 0 5 0 6 0 5 0 6 0 5 0 5 0 
6 0 5 0 5 0 6 0 5 0 5 0 6 0 5 0 
6 0 5 0 5 0 947 2501 100 MP stroke
6 0 5 0 5 0 6 0 5 0 5 0 6 0 5 0 
5 0 899 2501 10 MP stroke
DA
/c9 { 1.000000 0.000000 0.000000 sr} bdef
c9
6 4 5 4 6 4 5 5 5 4 6 4 5 4 5 5 
6 4 5 4 5 4 6 5 5 4 6 4 5 4 5 5 
6 4 5 4 5 4 6 5 5 4 5 4 6 4 5 5 
6 4 5 4 5 4 6 5 5 4 5 4 6 4 5 5 
5 4 6 4 5 5 6 4 5 4 5 4 6 5 5 4 
5 4 6 4 5 5 5 4 6 4 5 4 5 5 6 4 
5 4 6 4 5 5 5 4 6 4 5 4 5 5 6 4 
5 4 5 5 6 4 5 4 6 4 5 5 5 4 6 4 
5 4 5 5 6 4 5 4 5 5 6 4 5 4 6 4 
5 5 5 4 6 4 5 4 5 5 6 4 5 4 5 5 
6 4 5 4 5 4 6 5 5 4 6 4 5 5 5 4 
6 4 5 4 5 5 6 4 5 4 5 5 6 4 5 4 
6 4 5 5 5 4 5724 3771 100 MP stroke
6 4 5 5 5 4 6 4 5 5 5 4 6 4 5 4 
6 5 5 4 5 4 6 5 5 4 5 4 6 5 5 4 
5 4 6 4 5 5 6 4 5 4 5 5 6 4 5 4 
5 5 6 4 5 4 5 5 6 4 5 4 5 5 6 4 
5 4 6 5 5 4 5 4 6 5 5 4 5 4 6 5 
5 4 5 4 6 5 5 4 6 4 5 5 5 4 6 5 
5 4 5 4 6 5 5 4 5 4 6 5 5 4 6 4 
5 5 5 4 6 5 5 4 5 4 6 5 5 4 5 5 
6 4 5 4 5 5 6 4 5 5 6 4 5 4 5 5 
6 4 5 5 5 4 6 4 5 5 5 4 6 5 5 4 
6 5 5 4 5 4 6 5 5 4 5 5 6 4 5 5 
5 4 6 5 5 4 6 5 5 4 5 5 6 4 5 4 
5 5 6 4 5 5 5193 3338 100 MP stroke
5 4 6 5 5 4 5 5 6 5 5 4 6 5 5 4 
5 5 6 4 5 5 5 4 6 5 5 4 5 5 6 4 
5 5 6 5 5 4 5 5 6 4 5 5 5 5 6 4 
5 5 5 4 6 5 5 5 6 4 5 5 5 5 6 4 
5 5 5 5 6 4 5 5 5 5 6 4 5 5 6 5 
5 5 5 4 6 5 5 5 5 5 6 4 5 5 5 5 
6 5 5 4 5 5 6 5 5 5 6 5 5 5 5 4 
6 5 5 5 5 5 6 5 5 5 5 5 6 5 5 5 
6 5 5 4 5 5 6 5 5 5 5 5 6 5 5 5 
5 6 6 5 5 5 6 5 5 5 5 5 6 5 5 5 
5 5 6 6 5 5 5 5 6 5 5 5 5 6 6 5 
5 5 6 6 5 5 5 5 6 6 5 5 5 5 6 6 
5 5 5 6 6 5 4662 2857 100 MP stroke
5 6 6 5 5 6 5 6 6 5 5 6 5 5 6 6 
5 6 5 6 6 5 5 6 6 6 5 6 5 6 6 6 
5 6 5 6 6 6 5 6 5 6 6 6 5 6 5 6 
6 7 5 6 6 6 5 7 5 6 6 7 5 6 5 7 
6 6 5 7 5 7 6 6 5 7 6 7 5 7 5 7 
6 7 5 7 5 7 6 8 5 7 5 7 6 8 5 7 
6 8 5 7 5 8 6 8 5 8 5 8 6 8 5 8 
5 9 6 8 5 9 6 8 5 9 5 9 6 9 5 9 
5 9 6 10 5 9 5 10 6 10 5 9 5 11 6 10 
5 10 6 11 5 11 5 10 6 12 5 11 5 11 6 12 
5 12 5 12 6 12 5 12 6 13 5 12 5 13 6 12 
5 13 5 13 6 13 5 12 5 12 6 12 5 12 6 11 
5 10 5 9 6 8 4131 2031 100 MP stroke
5 8 5 6 6 4 5 3 5 2 6 0 5 -1 5 -2 
6 -4 5 -5 6 -5 5 -7 5 -7 6 -7 5 -8 5 -8 
6 -9 5 -8 5 -9 6 -8 5 -9 6 -8 5 -8 5 -8 
6 -8 5 -8 5 -8 6 -7 5 -8 5 -7 6 -7 5 -6 
6 -7 5 -6 5 -7 6 -6 5 -6 5 -5 6 -6 5 -6 
5 -5 6 -5 5 -5 5 -5 6 -5 5 -5 6 -4 5 -5 
5 -4 6 -4 5 -4 5 -4 6 -4 5 -4 5 -4 6 -3 
5 -4 6 -3 5 -4 5 -3 6 -3 5 -4 5 -3 6 -3 
5 -3 5 -3 6 -3 5 -2 6 -3 5 -3 5 -2 6 -3 
5 -2 5 -3 6 -2 5 -3 5 -2 6 -2 5 -2 6 -2 
5 -3 5 -2 6 -2 5 -2 5 -2 6 -2 5 -1 5 -2 
6 -2 5 -2 5 -2 6 -1 5 -2 6 -2 5 -1 5 -2 
6 -1 5 -2 5 -1 3601 2408 100 MP stroke
6 -2 5 -1 5 -2 6 -1 5 -2 6 -1 5 -1 5 -2 
6 -1 5 -1 5 -1 6 -2 5 -1 5 -1 6 -1 5 -1 
6 -1 5 -1 5 -1 6 -2 5 -1 5 -1 6 -1 5 -1 
5 -1 6 0 5 -1 5 -1 6 -1 5 -1 6 -1 5 -1 
5 -1 6 -1 5 0 5 -1 6 -1 5 -1 5 -1 6 0 
5 -1 6 -1 5 0 5 -1 6 -1 5 -1 5 0 6 -1 
5 -1 5 0 6 -1 5 0 6 -1 5 -1 5 0 6 -1 
5 0 5 -1 6 -1 5 0 5 -1 6 0 5 -1 6 0 
5 -1 5 0 6 -1 5 0 5 -1 6 0 5 -1 5 0 
6 -1 5 0 5 0 6 -1 5 0 6 -1 5 0 5 -1 
6 0 5 0 5 -1 6 0 5 -1 5 0 6 0 5 -1 
6 0 5 0 5 -1 6 0 5 0 5 -1 6 0 5 0 
5 -1 6 0 5 0 3070 2480 100 MP stroke
6 -1 5 0 5 0 6 0 5 -1 5 0 6 0 5 -1 
5 0 6 0 5 0 5 -1 6 0 5 0 6 0 5 -1 
5 0 6 0 5 0 5 -1 6 0 5 0 5 0 6 0 
5 -1 6 0 5 0 5 0 6 0 5 -1 5 0 6 0 
5 0 5 0 6 -1 5 0 6 0 5 0 5 0 6 0 
5 -1 5 0 6 0 5 0 5 0 6 0 5 -1 5 0 
6 0 5 0 6 0 5 0 5 0 6 -1 5 0 5 0 
6 0 5 0 5 0 6 0 5 -1 6 0 5 0 5 0 
6 0 5 0 5 0 6 0 5 0 5 -1 6 0 5 0 
6 0 5 0 5 0 6 0 5 0 5 0 6 -1 5 0 
5 0 6 0 5 0 6 0 5 0 5 0 6 0 5 0 
5 0 6 -1 5 0 5 0 6 0 5 0 5 0 6 0 
5 0 6 0 5 0 2539 2496 100 MP stroke
5 0 6 0 5 0 5 -1 6 0 5 0 5 0 6 0 
5 0 6 0 5 0 5 0 6 0 5 0 5 0 6 0 
5 0 5 0 6 0 5 -1 6 0 5 0 5 0 6 0 
5 0 5 0 6 0 5 0 5 0 6 0 5 0 5 0 
6 0 5 0 6 0 5 0 5 0 6 0 5 0 5 0 
6 -1 5 0 5 0 6 0 5 0 6 0 5 0 5 0 
6 0 5 0 5 0 6 0 5 0 5 0 6 0 5 0 
6 0 5 0 5 0 6 0 5 0 5 0 6 0 5 0 
5 0 6 0 5 0 5 0 6 0 5 -1 6 0 5 0 
5 0 6 0 5 0 5 0 6 0 5 0 5 0 6 0 
5 0 6 0 5 0 5 0 6 0 5 0 5 0 6 0 
5 0 5 0 6 0 5 0 6 0 5 0 5 0 6 0 
5 0 5 0 6 0 2008 2500 100 MP stroke
5 0 5 0 6 0 5 0 6 0 5 0 5 0 6 0 
5 0 5 0 6 0 5 0 5 0 6 0 5 0 5 0 
6 0 5 0 6 0 5 0 5 -1 6 0 5 0 5 0 
6 0 5 0 5 0 6 0 5 0 6 0 5 0 5 0 
6 0 5 0 5 0 6 0 5 0 5 0 6 0 5 0 
6 0 5 0 5 0 6 0 5 0 5 0 6 0 5 0 
5 0 6 0 5 0 5 0 6 0 5 0 6 0 5 0 
5 0 6 0 5 0 5 0 6 0 5 0 5 0 6 0 
5 0 6 0 5 0 5 0 6 0 5 0 5 0 6 0 
5 0 5 0 6 0 5 0 6 0 5 0 5 0 6 0 
5 0 5 0 6 0 5 0 5 0 6 0 5 0 5 0 
6 0 5 0 6 0 5 0 5 0 6 0 5 0 5 0 
6 0 5 0 5 0 1478 2501 100 MP stroke
6 0 5 0 6 0 5 0 5 0 6 0 5 0 5 0 
6 0 5 0 5 0 6 0 5 0 6 0 5 0 5 0 
6 0 5 0 5 0 6 0 5 0 5 0 6 0 5 0 
6 0 5 0 5 0 6 0 5 0 5 0 6 0 5 0 
5 0 6 0 5 0 5 0 6 0 5 0 6 0 5 0 
5 0 6 0 5 0 5 0 6 0 5 0 5 0 6 0 
5 0 6 0 5 0 5 0 6 0 5 0 5 0 6 0 
5 0 5 0 6 0 5 0 6 0 5 0 5 0 6 0 
5 0 5 0 6 0 5 0 5 0 6 0 5 0 5 0 
6 0 5 0 6 0 5 0 5 0 6 0 5 0 5 0 
6 0 5 0 5 0 6 0 5 0 6 0 5 0 5 0 
6 0 5 0 5 0 6 0 5 0 5 0 6 0 5 0 
6 0 5 0 5 0 947 2501 100 MP stroke
6 0 5 0 5 0 6 0 5 0 5 0 6 0 5 0 
5 0 899 2501 10 MP stroke
DD
/c10 { 0.000000 1.000000 0.000000 sr} bdef
c10
6 4 5 4 6 4 5 5 5 4 6 4 5 4 5 5 
6 4 5 4 5 4 6 5 5 4 6 4 5 4 5 5 
6 4 5 4 5 4 6 5 5 4 5 4 6 4 5 5 
6 4 5 4 5 5 6 4 5 4 5 4 6 5 5 4 
5 4 6 4 5 5 6 4 5 4 5 4 6 5 5 4 
5 4 6 4 5 5 5 4 6 4 5 4 5 5 6 4 
5 4 6 4 5 5 5 4 6 4 5 5 5 4 6 4 
5 4 5 5 6 4 5 4 6 4 5 5 5 4 6 4 
5 4 5 5 6 4 5 4 5 5 6 4 5 4 6 4 
5 5 5 4 6 4 5 5 5 4 6 4 5 4 5 5 
6 4 5 4 5 4 6 5 5 4 6 4 5 5 5 4 
6 4 5 4 5 5 6 4 5 4 5 5 6 4 5 4 
6 5 5 4 5 4 5724 3771 100 MP stroke
6 4 5 5 5 4 6 4 5 5 5 4 6 4 5 5 
6 4 5 4 5 4 6 5 5 4 5 4 6 5 5 4 
5 4 6 5 5 4 6 4 5 5 5 4 6 4 5 5 
5 4 6 4 5 5 5 4 6 4 5 5 5 4 6 4 
5 5 6 4 5 4 5 5 6 4 5 4 5 5 6 4 
5 4 5 5 6 4 5 4 6 5 5 4 5 4 6 5 
5 4 5 4 6 5 5 4 5 5 6 4 5 4 6 5 
5 4 5 4 6 5 5 4 5 5 6 4 5 4 5 5 
6 4 5 5 5 4 6 4 5 5 6 4 5 5 5 4 
6 4 5 5 5 4 6 5 5 4 5 5 6 4 5 4 
6 5 5 4 5 5 6 4 5 5 5 4 6 5 5 4 
5 5 6 4 5 4 6 5 5 4 5 5 6 4 5 5 
5 4 6 5 5 4 5193 3338 100 MP stroke
5 5 6 4 5 5 5 4 6 5 5 4 6 5 5 5 
5 4 6 5 5 4 5 5 6 4 5 5 5 4 6 5 
5 5 6 4 5 5 5 4 6 5 5 5 5 4 6 5 
5 4 5 5 6 5 5 4 6 5 5 5 5 4 6 5 
5 5 5 4 6 5 5 5 5 4 6 5 5 5 6 5 
5 4 5 5 6 5 5 5 5 4 6 5 5 5 5 5 
6 5 5 4 5 5 6 5 5 5 6 5 5 5 5 4 
6 5 5 5 5 5 6 5 5 5 5 5 6 5 5 5 
6 5 5 5 5 5 6 5 5 5 5 5 6 5 5 5 
5 5 6 5 5 5 6 5 5 5 5 6 6 5 5 5 
5 5 6 5 5 6 5 5 6 5 5 5 5 6 6 5 
5 5 6 6 5 5 5 5 6 6 5 5 5 6 6 5 
5 6 5 5 6 6 4662 2854 100 MP stroke
5 5 6 6 5 6 5 5 6 6 5 6 5 5 6 6 
5 6 5 6 6 6 5 6 6 5 5 6 5 6 6 6 
5 6 5 7 6 6 5 6 5 6 6 6 5 7 5 6 
6 6 5 7 6 6 5 7 5 6 6 7 5 7 5 6 
6 7 5 7 5 7 6 7 5 7 6 7 5 7 5 7 
6 8 5 7 5 7 6 8 5 7 5 8 6 8 5 8 
6 8 5 8 5 8 6 8 5 9 5 8 6 9 5 9 
5 8 6 9 5 10 6 9 5 9 5 10 6 10 5 10 
5 10 6 10 5 11 5 11 6 11 5 11 5 12 6 12 
5 12 6 13 5 12 5 14 6 13 5 15 5 14 6 15 
5 16 5 16 6 17 5 18 6 18 5 19 5 21 6 21 
5 23 5 24 6 26 5 28 5 31 6 33 5 36 6 40 
5 46 5 53 6 62 4131 1657 100 MP stroke
5 73 5 91 6 105 5 80 5 -35 6 -101 5 -93 5 -76 
6 -62 5 -51 6 -45 5 -38 5 -34 6 -30 5 -27 5 -24 
6 -23 5 -21 5 -19 6 -18 5 -16 6 -16 5 -14 5 -14 
6 -13 5 -12 5 -12 6 -11 5 -11 5 -10 6 -9 5 -10 
6 -8 5 -9 5 -8 6 -8 5 -7 5 -7 6 -7 5 -7 
5 -7 6 -6 5 -6 5 -6 6 -5 5 -6 6 -5 5 -5 
5 -5 6 -5 5 -5 5 -4 6 -5 5 -4 5 -4 6 -5 
5 -3 6 -4 5 -4 5 -4 6 -3 5 -4 5 -3 6 -4 
5 -3 5 -3 6 -3 5 -3 6 -3 5 -3 5 -3 6 -3 
5 -2 5 -3 6 -2 5 -3 5 -2 6 -3 5 -2 6 -3 
5 -2 5 -2 6 -2 5 -2 5 -2 6 -2 5 -2 5 -2 
6 -2 5 -2 5 -2 6 -2 5 -2 6 -1 5 -2 5 -2 
6 -1 5 -2 5 -1 3601 2405 100 MP stroke
6 -2 5 -2 5 -1 6 -1 5 -2 6 -1 5 -2 5 -1 
6 -1 5 -2 5 -1 6 -1 5 -1 5 -2 6 -1 5 -1 
6 -1 5 -1 5 -1 6 -2 5 -1 5 -1 6 -1 5 -1 
5 -1 6 -1 5 -1 5 -1 6 -1 5 -1 6 0 5 -1 
5 -1 6 -1 5 -1 5 -1 6 -1 5 0 5 -1 6 -1 
5 -1 6 -1 5 0 5 -1 6 -1 5 0 5 -1 6 -1 
5 0 5 -1 6 -1 5 0 6 -1 5 -1 5 0 6 -1 
5 -1 5 0 6 -1 5 0 5 -1 6 0 5 -1 6 0 
5 -1 5 0 6 -1 5 0 5 -1 6 0 5 -1 5 0 
6 -1 5 0 5 -1 6 0 5 -1 6 0 5 -1 5 0 
6 0 5 -1 5 0 6 -1 5 0 5 0 6 -1 5 0 
6 0 5 -1 5 0 6 0 5 -1 5 0 6 0 5 -1 
5 0 6 0 5 -1 3070 2480 100 MP stroke
6 0 5 0 5 -1 6 0 5 0 5 -1 6 0 5 0 
5 0 6 -1 5 0 5 0 6 0 5 -1 6 0 5 0 
5 0 6 -1 5 0 5 0 6 0 5 -1 5 0 6 0 
5 0 6 -1 5 0 5 0 6 0 5 0 5 -1 6 0 
5 0 5 0 6 0 5 0 6 -1 5 0 5 0 6 0 
5 0 5 -1 6 0 5 0 5 0 6 0 5 0 5 -1 
6 0 5 0 6 0 5 0 5 0 6 0 5 -1 5 0 
6 0 5 0 5 0 6 0 5 0 6 0 5 -1 5 0 
6 0 5 0 5 0 6 0 5 0 5 0 6 -1 5 0 
6 0 5 0 5 0 6 0 5 0 5 0 6 0 5 0 
5 -1 6 0 5 0 6 0 5 0 5 0 6 0 5 0 
5 0 6 0 5 0 5 -1 6 0 5 0 5 0 6 0 
5 0 6 0 5 0 2539 2496 100 MP stroke
5 0 6 0 5 0 5 0 6 0 5 -1 5 0 6 0 
5 0 6 0 5 0 5 0 6 0 5 0 5 0 6 0 
5 0 5 0 6 0 5 0 6 0 5 -1 5 0 6 0 
5 0 5 0 6 0 5 0 5 0 6 0 5 0 5 0 
6 0 5 0 6 0 5 0 5 0 6 0 5 0 5 0 
6 0 5 -1 5 0 6 0 5 0 6 0 5 0 5 0 
6 0 5 0 5 0 6 0 5 0 5 0 6 0 5 0 
6 0 5 0 5 0 6 0 5 0 5 0 6 0 5 0 
5 0 6 0 5 0 5 0 6 0 5 0 6 0 5 -1 
5 0 6 0 5 0 5 0 6 0 5 0 5 0 6 0 
5 0 6 0 5 0 5 0 6 0 5 0 5 0 6 0 
5 0 5 0 6 0 5 0 6 0 5 0 5 0 6 0 
5 0 5 0 6 0 2008 2500 100 MP stroke
5 0 5 0 6 0 5 0 6 0 5 0 5 0 6 0 
5 0 5 0 6 0 5 0 5 0 6 0 5 0 5 0 
6 0 5 0 6 0 5 0 5 0 6 0 5 -1 5 0 
6 0 5 0 5 0 6 0 5 0 6 0 5 0 5 0 
6 0 5 0 5 0 6 0 5 0 5 0 6 0 5 0 
6 0 5 0 5 0 6 0 5 0 5 0 6 0 5 0 
5 0 6 0 5 0 5 0 6 0 5 0 6 0 5 0 
5 0 6 0 5 0 5 0 6 0 5 0 5 0 6 0 
5 0 6 0 5 0 5 0 6 0 5 0 5 0 6 0 
5 0 5 0 6 0 5 0 6 0 5 0 5 0 6 0 
5 0 5 0 6 0 5 0 5 0 6 0 5 0 5 0 
6 0 5 0 6 0 5 0 5 0 6 0 5 0 5 0 
6 0 5 0 5 0 1478 2501 100 MP stroke
6 0 5 0 6 0 5 0 5 0 6 0 5 0 5 0 
6 0 5 0 5 0 6 0 5 0 6 0 5 0 5 0 
6 0 5 0 5 0 6 0 5 0 5 0 6 0 5 0 
6 0 5 0 5 0 6 0 5 0 5 0 6 0 5 0 
5 0 6 0 5 0 5 0 6 0 5 0 6 0 5 0 
5 0 6 0 5 0 5 0 6 0 5 0 5 0 6 0 
5 0 6 0 5 0 5 0 6 0 5 0 5 0 6 0 
5 0 5 0 6 0 5 0 6 0 5 0 5 0 6 0 
5 0 5 0 6 0 5 0 5 0 6 0 5 0 5 0 
6 0 5 0 6 0 5 0 5 0 6 0 5 0 5 0 
6 0 5 0 5 0 6 0 5 0 6 0 5 0 5 0 
6 0 5 0 5 0 6 0 5 0 5 0 6 0 5 0 
6 0 5 0 5 0 947 2501 100 MP stroke
6 0 5 0 5 0 6 0 5 0 5 0 6 0 5 0 
5 0 899 2501 10 MP stroke
DO
0 sg
6 4 5 4 6 4 5 5 5 4 6 4 5 4 5 5 
6 4 5 4 5 4 6 5 5 4 6 4 5 4 5 5 
6 4 5 4 5 4 6 5 5 4 5 4 6 4 5 5 
6 4 5 4 5 5 6 4 5 4 5 4 6 5 5 4 
5 4 6 4 5 5 6 4 5 4 5 4 6 5 5 4 
5 4 6 4 5 5 5 4 6 4 5 4 5 5 6 4 
5 4 6 4 5 5 5 4 6 4 5 5 5 4 6 4 
5 4 5 5 6 4 5 4 6 4 5 5 5 4 6 4 
5 4 5 5 6 4 5 4 5 5 6 4 5 4 6 4 
5 5 5 4 6 4 5 5 5 4 6 4 5 4 5 5 
6 4 5 4 5 4 6 5 5 4 6 4 5 5 5 4 
6 4 5 4 5 5 6 4 5 4 5 5 6 4 5 4 
6 5 5 4 5 4 5724 3771 100 MP stroke
6 4 5 5 5 4 6 4 5 5 5 4 6 4 5 5 
6 4 5 4 5 4 6 5 5 4 5 4 6 5 5 4 
5 4 6 5 5 4 6 4 5 5 5 4 6 4 5 5 
5 4 6 4 5 5 5 4 6 4 5 5 5 4 6 4 
5 5 6 4 5 4 5 5 6 4 5 4 5 5 6 4 
5 4 5 5 6 4 5 4 6 5 5 4 5 4 6 5 
5 4 5 4 6 5 5 4 5 5 6 4 5 4 6 5 
5 4 5 4 6 5 5 4 5 5 6 4 5 4 5 5 
6 4 5 5 5 4 6 4 5 5 6 4 5 5 5 4 
6 4 5 5 5 4 6 5 5 4 5 5 6 4 5 4 
6 5 5 4 5 5 6 4 5 5 5 4 6 5 5 4 
5 5 6 4 5 4 6 5 5 4 5 5 6 4 5 5 
5 4 6 5 5 4 5193 3338 100 MP stroke
5 5 6 4 5 5 5 4 6 5 5 4 6 5 5 5 
5 4 6 5 5 4 5 5 6 4 5 5 5 4 6 5 
5 5 6 4 5 5 5 4 6 5 5 5 5 4 6 5 
5 4 5 5 6 5 5 4 6 5 5 5 5 4 6 5 
5 5 5 4 6 5 5 5 5 4 6 5 5 5 6 5 
5 4 5 5 6 5 5 5 5 4 6 5 5 5 5 5 
6 5 5 4 5 5 6 5 5 5 6 5 5 5 5 4 
6 5 5 5 5 5 6 5 5 5 5 5 6 5 5 5 
6 5 5 5 5 5 6 5 5 5 5 5 6 5 5 5 
5 5 6 5 5 5 6 5 5 5 5 6 6 5 5 5 
5 5 6 5 5 6 5 5 6 5 5 5 5 6 6 5 
5 5 6 6 5 5 5 5 6 6 5 5 5 6 6 5 
5 6 5 5 6 6 4662 2854 100 MP stroke
5 5 6 6 5 6 5 5 6 6 5 6 5 5 6 6 
5 6 5 6 6 6 5 6 6 5 5 6 5 6 6 6 
5 6 5 7 6 6 5 6 5 6 6 6 5 7 5 6 
6 6 5 7 6 6 5 7 5 6 6 7 5 7 5 6 
6 7 5 7 5 7 6 7 5 7 6 7 5 7 5 7 
6 8 5 7 5 7 6 8 5 8 5 7 6 8 5 8 
6 8 5 8 5 8 6 8 5 9 5 8 6 9 5 9 
5 9 6 9 5 9 6 9 5 10 5 9 6 10 5 10 
5 10 6 11 5 10 5 11 6 11 5 12 5 11 6 12 
5 12 6 13 5 13 5 13 6 14 5 14 5 15 6 15 
5 15 5 17 6 17 5 17 6 19 5 20 5 20 6 22 
5 23 5 24 6 26 5 29 5 30 6 34 5 37 6 42 
5 48 5 56 6 67 4131 1641 100 MP stroke
5 85 5 115 6 183 5 417 5 -292 6 -237 5 -132 5 -91 
6 -69 5 -55 6 -47 5 -40 5 -35 6 -31 5 -27 5 -25 
6 -23 5 -21 5 -19 6 -18 5 -17 6 -16 5 -14 5 -14 
6 -13 5 -13 5 -11 6 -12 5 -10 5 -10 6 -10 5 -9 
6 -9 5 -8 5 -9 6 -7 5 -8 5 -7 6 -7 5 -7 
5 -6 6 -7 5 -6 5 -5 6 -6 5 -6 6 -5 5 -5 
5 -5 6 -5 5 -5 5 -4 6 -5 5 -4 5 -4 6 -4 
5 -4 6 -4 5 -4 5 -4 6 -3 5 -4 5 -3 6 -4 
5 -3 5 -3 6 -3 5 -3 6 -3 5 -3 5 -3 6 -3 
5 -2 5 -3 6 -2 5 -3 5 -2 6 -3 5 -2 6 -2 
5 -3 5 -2 6 -2 5 -2 5 -2 6 -2 5 -2 5 -2 
6 -2 5 -2 5 -2 6 -2 5 -1 6 -2 5 -2 5 -2 
6 -1 5 -2 5 -1 3601 2405 100 MP stroke
6 -2 5 -1 5 -2 6 -1 5 -2 6 -1 5 -2 5 -1 
6 -1 5 -2 5 -1 6 -1 5 -1 5 -2 6 -1 5 -1 
6 -1 5 -1 5 -1 6 -2 5 -1 5 -1 6 -1 5 -1 
5 -1 6 -1 5 -1 5 -1 6 -1 5 -1 6 0 5 -1 
5 -1 6 -1 5 -1 5 -1 6 -1 5 0 5 -1 6 -1 
5 -1 6 0 5 -1 5 -1 6 -1 5 0 5 -1 6 -1 
5 0 5 -1 6 -1 5 0 6 -1 5 -1 5 0 6 -1 
5 -1 5 0 6 -1 5 0 5 -1 6 0 5 -1 6 0 
5 -1 5 0 6 -1 5 0 5 -1 6 0 5 -1 5 0 
6 -1 5 0 5 -1 6 0 5 -1 6 0 5 -1 5 0 
6 0 5 -1 5 0 6 -1 5 0 5 0 6 -1 5 0 
6 0 5 -1 5 0 6 0 5 -1 5 0 6 0 5 -1 
5 0 6 0 5 -1 3070 2480 100 MP stroke
6 0 5 0 5 -1 6 0 5 0 5 -1 6 0 5 0 
5 0 6 -1 5 0 5 0 6 0 5 -1 6 0 5 0 
5 0 6 -1 5 0 5 0 6 0 5 -1 5 0 6 0 
5 0 6 -1 5 0 5 0 6 0 5 0 5 -1 6 0 
5 0 5 0 6 0 5 0 6 -1 5 0 5 0 6 0 
5 0 5 -1 6 0 5 0 5 0 6 0 5 0 5 -1 
6 0 5 0 6 0 5 0 5 0 6 0 5 -1 5 0 
6 0 5 0 5 0 6 0 5 0 6 0 5 -1 5 0 
6 0 5 0 5 0 6 0 5 0 5 0 6 -1 5 0 
6 0 5 0 5 0 6 0 5 0 5 0 6 0 5 0 
5 -1 6 0 5 0 6 0 5 0 5 0 6 0 5 0 
5 0 6 0 5 0 5 -1 6 0 5 0 5 0 6 0 
5 0 6 0 5 0 2539 2496 100 MP stroke
5 0 6 0 5 0 5 0 6 0 5 -1 5 0 6 0 
5 0 6 0 5 0 5 0 6 0 5 0 5 0 6 0 
5 0 5 0 6 0 5 0 6 0 5 -1 5 0 6 0 
5 0 5 0 6 0 5 0 5 0 6 0 5 0 5 0 
6 0 5 0 6 0 5 0 5 0 6 0 5 0 5 0 
6 0 5 -1 5 0 6 0 5 0 6 0 5 0 5 0 
6 0 5 0 5 0 6 0 5 0 5 0 6 0 5 0 
6 0 5 0 5 0 6 0 5 0 5 0 6 0 5 0 
5 0 6 0 5 0 5 0 6 0 5 0 6 0 5 -1 
5 0 6 0 5 0 5 0 6 0 5 0 5 0 6 0 
5 0 6 0 5 0 5 0 6 0 5 0 5 0 6 0 
5 0 5 0 6 0 5 0 6 0 5 0 5 0 6 0 
5 0 5 0 6 0 2008 2500 100 MP stroke
5 0 5 0 6 0 5 0 6 0 5 0 5 0 6 0 
5 0 5 0 6 0 5 0 5 0 6 0 5 0 5 0 
6 0 5 0 6 0 5 0 5 0 6 0 5 -1 5 0 
6 0 5 0 5 0 6 0 5 0 6 0 5 0 5 0 
6 0 5 0 5 0 6 0 5 0 5 0 6 0 5 0 
6 0 5 0 5 0 6 0 5 0 5 0 6 0 5 0 
5 0 6 0 5 0 5 0 6 0 5 0 6 0 5 0 
5 0 6 0 5 0 5 0 6 0 5 0 5 0 6 0 
5 0 6 0 5 0 5 0 6 0 5 0 5 0 6 0 
5 0 5 0 6 0 5 0 6 0 5 0 5 0 6 0 
5 0 5 0 6 0 5 0 5 0 6 0 5 0 5 0 
6 0 5 0 6 0 5 0 5 0 6 0 5 0 5 0 
6 0 5 0 5 0 1478 2501 100 MP stroke
6 0 5 0 6 0 5 0 5 0 6 0 5 0 5 0 
6 0 5 0 5 0 6 0 5 0 6 0 5 0 5 0 
6 0 5 0 5 0 6 0 5 0 5 0 6 0 5 0 
6 0 5 0 5 0 6 0 5 0 5 0 6 0 5 0 
5 0 6 0 5 0 5 0 6 0 5 0 6 0 5 0 
5 0 6 0 5 0 5 0 6 0 5 0 5 0 6 0 
5 0 6 0 5 0 5 0 6 0 5 0 5 0 6 0 
5 0 5 0 6 0 5 0 6 0 5 0 5 0 6 0 
5 0 5 0 6 0 5 0 5 0 6 0 5 0 5 0 
6 0 5 0 6 0 5 0 5 0 6 0 5 0 5 0 
6 0 5 0 5 0 6 0 5 0 6 0 5 0 5 0 
6 0 5 0 5 0 6 0 5 0 5 0 6 0 5 0 
6 0 5 0 5 0 947 2501 100 MP stroke
6 0 5 0 5 0 6 0 5 0 5 0 6 0 5 0 
5 0 899 2501 10 MP stroke
gr

DO
%%IncludeResource: font Helvetica
/Helvetica /ISOLatin1Encoding 120 FMSR

3559 4940 mt 
(f) s
 558 2634 mt  -90 rotate
(|H\(f\)|) s
90 rotate
2456  240 mt 
(Risposta in frequenza di filtri a ) s
%%IncludeResource: font Symbol
/Symbol /ISOLatin1Encoding 120 FMSR

4098  240 mt 
(w) s
%%IncludeResource: font Helvetica
/Helvetica /ISOLatin1Encoding 96 FMSR

4180  300 mt 
(0) s
%%IncludeResource: font Helvetica
/Helvetica /ISOLatin1Encoding 120 FMSR

4233  240 mt 
( costante) s
SO

end %%Color Dict

eplot
%%EndObject

epage
end

showpage

%%Trailer
%%EOF
