<?xml version="1.0" encoding="UTF-8" standalone="no"?>
<!-- Creator: fig2dev Version 3.2.6a -->

<!-- CreationDate: 2022-05-30 14:14:31 -->

<!-- Magnification: 1 -->

<svg
   xmlns:dc="http://purl.org/dc/elements/1.1/"
   xmlns:cc="http://creativecommons.org/ns#"
   xmlns:rdf="http://www.w3.org/1999/02/22-rdf-syntax-ns#"
   xmlns:svg="http://www.w3.org/2000/svg"
   xmlns="http://www.w3.org/2000/svg"
   xmlns:xlink="http://www.w3.org/1999/xlink"
   xmlns:sodipodi="http://sodipodi.sourceforge.net/DTD/sodipodi-0.dtd"
   xmlns:inkscape="http://www.inkscape.org/namespaces/inkscape"
   width="15cm"
   height="15cm"
   viewBox="1172 513 7078.5149 7084.6652"
   version="1.1"
   id="svg102"
   sodipodi:docname="fin_lunga.svg"
   inkscape:version="0.92.3 (2405546, 2018-03-11)"
   inkscape:export-filename="/home/rpr/tex/Didattica/dsp-lecture-notes/fin_lunga.png"
   inkscape:export-xdpi="102"
   inkscape:export-ydpi="102">
  <sodipodi:namedview
     pagecolor="#ffffff"
     bordercolor="#666666"
     borderopacity="1"
     objecttolerance="10"
     gridtolerance="10"
     guidetolerance="10"
     inkscape:pageopacity="0"
     inkscape:pageshadow="2"
     inkscape:window-width="1299"
     inkscape:window-height="713"
     id="namedview104"
     showgrid="false"
     inkscape:zoom="0.96661111"
     inkscape:cx="433.99046"
     inkscape:cy="283.46457"
     inkscape:window-x="67"
     inkscape:window-y="27"
     inkscape:window-maximized="1"
     inkscape:current-layer="svg102"
     units="cm" />
  <metadata
     id="metadata108">
    <rdf:RDF>
      <cc:Work
         rdf:about="">
        <dc:format>image/svg+xml</dc:format>
        <dc:type
           rdf:resource="http://purl.org/dc/dcmitype/StillImage" />
        <dc:title></dc:title>
      </cc:Work>
    </rdf:RDF>
  </metadata>
  <defs
     id="defs106" />
  <g
     transform="matrix(0.81772971,0,0,0.81772971,183.23142,165.54473)"
     style="fill:none;stroke:#ff001e;stroke-width:18.74484253;stroke-miterlimit:4;stroke-dasharray:none;stroke-opacity:1"
     id="g100">
    <!-- Line -->
    <defs
       id="defs8">
      <rect
         id="p0"
         height="600"
         width="3000"
         y="3000"
         x="5700" />
    </defs>
    <use
       height="100%"
       width="100%"
       y="0"
       x="0"
       style="fill:#ffffff;stroke:#ff001e;stroke-width:18.74484253;stroke-miterlimit:4;stroke-dasharray:none;stroke-opacity:1"
       id="use10"
       xlink:href="#p0" />
    <use
       height="100%"
       width="100%"
       y="0"
       x="0"
       style="fill:#e9beba;fill-opacity:1;stroke:#ff001e;stroke-width:18.74484253;stroke-miterlimit:4;stroke-dasharray:none;stroke-opacity:1"
       id="use12"
       xlink:href="#p0" />
    <!-- Line -->
    <defs
       id="defs17">
      <clipPath
         id="cp0">
        <path
           style="clip-rule:evenodd"
           inkscape:connector-curvature="0"
           id="path14"
           d="M 1172,513 H 9912 V 8994 H 1172 Z m 8292,6957 v 60 l 143,-23 v -14 z" />
      </clipPath>
    </defs>
    <polyline
       style="stroke:#ff001e;stroke-width:18.74484253;stroke-miterlimit:4;stroke-dasharray:none;stroke-opacity:1"
       id="polyline19"
       clip-path="url(#cp0)"
       points=" 5100,7500 9600,7500" />
    <!-- Forward arrow to point 9600,7500 -->
    <polygon
       style="fill:#ff001e;stroke:#ff001e;stroke-width:18.74484253;stroke-miterlimit:4;stroke-dasharray:none;stroke-opacity:1;fill-opacity:1"
       id="polygon21"
       stroke-miterlimit="8"
       points="9464,7530 9584,7500 9464,7470 " />
    <!-- Line -->
    <polyline
       style="stroke:#ff001e;stroke-width:18.74484253;stroke-miterlimit:4;stroke-dasharray:none;stroke-opacity:1"
       id="polyline23"
       points=" 5700,3600 5700,7500" />
    <!-- Line -->
    <polyline
       style="stroke:#ff001e;stroke-width:18.74484253;stroke-miterlimit:4;stroke-dasharray:none;stroke-opacity:1"
       id="polyline25"
       points=" 8700,3600 8700,7500" />
    <!-- Line -->
    <defs
       id="defs30">
      <clipPath
         id="cp1">
        <path
           style="clip-rule:evenodd"
           inkscape:connector-curvature="0"
           id="path27"
           d="M 1172,513 H 9912 V 8994 H 1172 Z m 1498,1123 h 60 l -23,-143 h -14 z" />
      </clipPath>
    </defs>
    <polyline
       style="stroke:#ff001e;stroke-width:18.74484253;stroke-miterlimit:4;stroke-dasharray:none;stroke-opacity:1"
       id="polyline32"
       clip-path="url(#cp1)"
       points=" 2700,4200 2700,1500" />
    <!-- Forward arrow to point 2700,1500 -->
    <polygon
       style="fill:#ff001e;fill-opacity:1;stroke:#ff001e;stroke-width:18.74484253;stroke-miterlimit:4;stroke-dasharray:none;stroke-opacity:1"
       id="polygon34"
       stroke-miterlimit="8"
       points="2730,1636 2700,1516 2670,1636 " />
    <!-- Line -->
    <polyline
       style="stroke:#ff001e;stroke-width:18.74484253;stroke-miterlimit:4;stroke-dasharray:none;stroke-opacity:1"
       id="polyline36"
       points=" 1500,3600 5700,3600" />
    <!-- Line -->
    <polyline
       style="stroke:#ff001e;stroke-width:18.74484253;stroke-miterlimit:4;stroke-dasharray:none;stroke-opacity:1"
       id="polyline38"
       points=" 1500,3000 5700,3000" />
    <!-- Line -->
    <polyline
       style="stroke:#ff001e;stroke-width:18.74484253;stroke-linejoin:bevel;stroke-miterlimit:4;stroke-dasharray:none;stroke-opacity:1"
       id="polyline40"
       points=" 5700,7500 5700,7499 5701,7495 5702,7483 5705,7465 5709,7440 5713,7411 5719,7380  5725,7350 5731,7322 5738,7298 5746,7279 5755,7268 5764,7266 5775,7275 5782,7289  5789,7308 5795,7330 5800,7354 5804,7379 5807,7404 5809,7428 5811,7452 5812,7476  5813,7500 5813,7524 5814,7548 5816,7572 5818,7596 5821,7621 5825,7646 5830,7670  5836,7692 5843,7711 5850,7725 5861,7734 5870,7732 5879,7721 5887,7702 5894,7678  5900,7650 5906,7620 5912,7589 5916,7560 5920,7535 5923,7517 5924,7505 5925,7501  5925,7500" />
    <!-- Line -->
    <polyline
       style="stroke:#ff001e;stroke-width:18.74484253;stroke-linejoin:bevel;stroke-miterlimit:4;stroke-dasharray:none;stroke-opacity:1"
       id="polyline42"
       points=" 1184,3300 1184,3301 1184,3306 1184,3316 1185,3331 1186,3347 1189,3363 1192,3378  1197,3392 1204,3405 1212,3418 1218,3427 1225,3436 1233,3446 1243,3456 1253,3467  1265,3478 1277,3489 1291,3500 1305,3512 1321,3523 1337,3533 1353,3543 1370,3553  1387,3561 1404,3569 1422,3577 1436,3583 1452,3588 1468,3593 1485,3598 1503,3604  1522,3608 1542,3613 1562,3618 1584,3623 1606,3628 1628,3633 1651,3637 1674,3642  1698,3647 1721,3651 1744,3656 1767,3660 1790,3665 1813,3670 1836,3675 1857,3680  1879,3685 1901,3690 1924,3696 1948,3701 1972,3708 1997,3714 2023,3720 2049,3727  2075,3734 2101,3741 2127,3748 2152,3755 2178,3762 2202,3768 2226,3775 2249,3781  2271,3787 2292,3793 2313,3799 2332,3804 2351,3809 2371,3815 2391,3820 2410,3826  2429,3831 2448,3837 2466,3843 2484,3850 2502,3857 2519,3864 2535,3872 2550,3881  2564,3890 2577,3900 2589,3910 2600,3921 2609,3933 2618,3946 2625,3959 2632,3973  2638,3988 2642,4004 2646,4021 2650,4040 2652,4060 2654,4081 2656,4103 2657,4127  2657,4151 2658,4176 2657,4202 2657,4227 2656,4253 2655,4278 2654,4302 2653,4325  2652,4347 2651,4368 2651,4388 2650,4407 2650,4425 2650,4449 2652,4470 2654,4491  2657,4511 2661,4531 2666,4551 2672,4572 2678,4592 2685,4611 2691,4627 2696,4639  2699,4647 2700,4650" />
    <!-- Line -->
    <polyline
       style="stroke:#ff001e;stroke-width:18.74484253;stroke-linejoin:bevel;stroke-miterlimit:4;stroke-dasharray:none;stroke-opacity:1"
       id="polyline44"
       points=" 1184,3300 1184,3299 1184,3294 1184,3284 1185,3269 1186,3253 1189,3237 1192,3222  1197,3208 1204,3195 1212,3182 1218,3173 1225,3164 1233,3154 1243,3144 1253,3133  1265,3122 1277,3111 1291,3100 1305,3088 1321,3077 1337,3067 1353,3057 1370,3047  1387,3039 1404,3031 1422,3023 1436,3017 1452,3012 1468,3007 1485,3002 1503,2996  1522,2992 1542,2987 1562,2982 1584,2977 1606,2972 1628,2967 1651,2963 1674,2958  1698,2953 1721,2949 1744,2944 1767,2940 1790,2935 1813,2930 1836,2925 1857,2920  1879,2915 1901,2910 1924,2904 1948,2899 1973,2892 1998,2886 2023,2880 2050,2873  2076,2866 2102,2859 2129,2852 2155,2845 2181,2838 2206,2832 2231,2825 2255,2819  2278,2813 2301,2807 2322,2801 2343,2796 2364,2791 2386,2785 2407,2780 2429,2774  2450,2769 2471,2763 2492,2757 2513,2750 2532,2743 2552,2736 2570,2728 2588,2719  2604,2710 2619,2700 2633,2690 2646,2679 2657,2667 2666,2654 2675,2641 2682,2627  2688,2613 2692,2596 2696,2579 2698,2560 2700,2540 2700,2519 2700,2497 2699,2473  2698,2449 2696,2424 2693,2398 2690,2373 2687,2347 2683,2322 2680,2298 2676,2275  2673,2253 2670,2232 2667,2212 2664,2193 2663,2175 2661,2151 2660,2130 2660,2109  2662,2089 2665,2069 2669,2049 2674,2028 2680,2008 2686,1989 2691,1973 2696,1961  2699,1953 2700,1950" />
    <!-- Line -->
    <polyline
       style="stroke:#ff001e;stroke-width:18.74484253;stroke-linejoin:bevel;stroke-miterlimit:4;stroke-dasharray:none;stroke-opacity:1"
       id="polyline46"
       points=" 5925,7500 5925,7499 5925,7496 5926,7486 5928,7470 5930,7446 5932,7415 5936,7380  5940,7341 5944,7301 5948,7261 5953,7224 5958,7189 5964,7159 5970,7135 5977,7118  5984,7109 5992,7111 6000,7125 6006,7142 6011,7165 6016,7192 6021,7220 6024,7251  6028,7282 6030,7314 6032,7346 6034,7377 6035,7408 6036,7439 6037,7470 6038,7500  6038,7530 6039,7561 6040,7592 6041,7623 6043,7654 6045,7686 6047,7718 6051,7749  6054,7780 6059,7808 6064,7835 6069,7858 6075,7875 6083,7889 6091,7891 6098,7882  6105,7865 6111,7841 6117,7811 6122,7776 6127,7739 6131,7699 6135,7659 6139,7620  6143,7585 6145,7554 6147,7530 6149,7514 6150,7504 6150,7501 6150,7500" />
    <!-- Line -->
    <polyline
       style="stroke:#ff001e;stroke-width:18.74484253;stroke-linejoin:bevel;stroke-miterlimit:4;stroke-dasharray:none;stroke-opacity:1"
       id="polyline48"
       points=" 6150,7500 6150,7497 6151,7489 6151,7475 6153,7455 6154,7428 6157,7394 6159,7355  6162,7312 6165,7267 6169,7221 6172,7176 6176,7132 6181,7090 6185,7053 6190,7020  6195,6992 6200,6971 6206,6957 6212,6952 6218,6958 6225,6975 6230,6994 6234,7019  6238,7047 6242,7078 6246,7111 6249,7146 6252,7181 6254,7217 6256,7253 6258,7289  6259,7325 6260,7361 6261,7396 6261,7431 6262,7465 6263,7500 6263,7535 6264,7569  6264,7604 6265,7639 6266,7675 6267,7711 6269,7747 6271,7783 6273,7819 6276,7854  6279,7889 6283,7922 6287,7953 6291,7981 6295,8006 6300,8025 6307,8042 6313,8048  6319,8043 6325,8029 6330,8008 6335,7980 6340,7947 6344,7910 6349,7868 6353,7824  6356,7779 6360,7733 6363,7688 6366,7645 6368,7606 6371,7572 6372,7545 6374,7525  6374,7511 6375,7503 6375,7500" />
    <!-- Line -->
    <polyline
       style="stroke:#ff001e;stroke-width:18.74484253;stroke-linejoin:bevel;stroke-miterlimit:4;stroke-dasharray:none;stroke-opacity:1"
       id="polyline50"
       points=" 6375,7500 6375,7497 6375,7491 6376,7480 6377,7462 6378,7438 6379,7408 6381,7372  6383,7330 6385,7285 6388,7236 6391,7185 6394,7134 6397,7084 6400,7035 6404,6988  6407,6945 6411,6905 6415,6870 6419,6840 6424,6816 6428,6799 6433,6791 6439,6791  6444,6802 6450,6825 6454,6849 6458,6878 6462,6912 6466,6949 6469,6988 6472,7030  6475,7072 6477,7116 6479,7159 6481,7203 6482,7247 6483,7290 6484,7333 6485,7376  6486,7418 6487,7460 6487,7502 6488,7544 6488,7586 6488,7627 6489,7669 6490,7712  6491,7754 6492,7797 6493,7840 6494,7883 6496,7926 6498,7969 6500,8012 6503,8054  6506,8094 6509,8133 6513,8168 6517,8201 6521,8228 6525,8250 6531,8270 6536,8277  6542,8274 6547,8262 6551,8241 6556,8213 6560,8180 6564,8141 6568,8097 6571,8049  6575,7999 6578,7946 6581,7891 6584,7837 6587,7782 6590,7730 6592,7681 6594,7637  6596,7598 6597,7566 6598,7540 6599,7522 6600,7510 6600,7503 6600,7500" />
    <!-- Line -->
    <polyline
       style="stroke:#ff001e;stroke-width:18.74484253;stroke-linejoin:bevel;stroke-miterlimit:4;stroke-dasharray:none;stroke-opacity:1"
       id="polyline52"
       points=" 6600,7500 6600,7497 6600,7491 6601,7479 6601,7462 6602,7437 6603,7406 6605,7368  6607,7323 6609,7274 6611,7221 6613,7164 6616,7106 6619,7048 6622,6990 6625,6933  6628,6879 6631,6829 6635,6782 6638,6740 6642,6703 6646,6673 6650,6649 6655,6634  6659,6627 6664,6631 6670,6647 6675,6675 6679,6701 6682,6732 6685,6768 6689,6806  6692,6848 6694,6892 6697,6937 6699,6983 6701,7030 6703,7077 6705,7125 6706,7172  6707,7220 6708,7267 6709,7313 6710,7360 6711,7406 6711,7451 6712,7497 6712,7542  6713,7588 6713,7633 6713,7678 6714,7723 6714,7769 6715,7815 6716,7861 6717,7907  6718,7953 6719,8000 6720,8047 6722,8093 6724,8140 6726,8186 6728,8230 6731,8274  6733,8316 6736,8355 6740,8392 6743,8424 6746,8452 6750,8475 6755,8496 6760,8506  6765,8506 6769,8495 6773,8477 6777,8451 6781,8418 6785,8380 6788,8337 6792,8289  6795,8237 6798,8182 6801,8125 6804,8065 6806,8004 6809,7943 6811,7882 6814,7823  6816,7766 6818,7714 6819,7666 6821,7623 6822,7587 6823,7558 6824,7535 6824,7519  6825,7508 6825,7503 6825,7500" />
    <!-- Line -->
    <polyline
       style="stroke:#ff001e;stroke-width:18.74484253;stroke-linejoin:bevel;stroke-miterlimit:4;stroke-dasharray:none;stroke-opacity:1"
       id="polyline54"
       points=" 6825,7500 6825,7498 6825,7492 6826,7482 6826,7467 6827,7445 6827,7416 6828,7381  6830,7339 6831,7292 6833,7239 6835,7181 6837,7121 6839,7057 6841,6993 6844,6928  6846,6864 6849,6801 6852,6740 6855,6682 6857,6628 6861,6578 6864,6532 6867,6491  6871,6457 6874,6429 6878,6408 6882,6396 6886,6393 6891,6400 6895,6419 6900,6450  6903,6479 6906,6514 6910,6553 6913,6596 6915,6642 6918,6690 6920,6741 6923,6793  6925,6845 6927,6899 6928,6953 6930,7007 6931,7061 6932,7115 6933,7169 6934,7222  6935,7275 6935,7328 6936,7380 6936,7432 6937,7484 6937,7536 6938,7588 6938,7639  6938,7691 6939,7743 6939,7795 6940,7847 6940,7899 6941,7952 6942,8005 6943,8058  6944,8111 6945,8165 6947,8218 6948,8271 6950,8323 6952,8375 6955,8426 6957,8475  6960,8521 6962,8565 6965,8606 6969,8642 6972,8674 6975,8700 6979,8725 6984,8739  6988,8742 6992,8735 6996,8720 6999,8698 7003,8668 7006,8632 7010,8590 7013,8544  7016,8493 7018,8438 7021,8380 7024,8319 7026,8255 7029,8190 7031,8123 7034,8057  7036,7990 7038,7925 7040,7862 7042,7802 7043,7746 7045,7695 7046,7650 7047,7610  7048,7577 7049,7551 7049,7531 7050,7516 7050,7507 7050,7502 7050,7500" />
    <!-- Line -->
    <polyline
       style="stroke:#ff001e;stroke-width:18.74484253;stroke-linejoin:bevel;stroke-miterlimit:4;stroke-dasharray:none;stroke-opacity:1"
       id="polyline56"
       points=" 8475,7500 8475,7499 8476,7495 8477,7483 8480,7465 8484,7440 8488,7411 8494,7380  8500,7350 8506,7322 8513,7298 8521,7279 8530,7268 8539,7266 8550,7275 8557,7289  8564,7308 8570,7330 8575,7354 8579,7379 8582,7404 8584,7428 8586,7452 8587,7476  8588,7500 8588,7524 8589,7548 8591,7572 8593,7596 8596,7621 8600,7646 8605,7670  8611,7692 8618,7711 8625,7725 8636,7734 8645,7732 8654,7721 8662,7702 8669,7678  8675,7650 8681,7620 8687,7589 8691,7560 8695,7535 8698,7517 8699,7505 8700,7501  8700,7500" />
    <!-- Line -->
    <polyline
       style="stroke:#ff001e;stroke-width:18.74484253;stroke-linejoin:bevel;stroke-miterlimit:4;stroke-dasharray:none;stroke-opacity:1"
       id="polyline58"
       points=" 8250,7500 8250,7499 8250,7496 8251,7486 8253,7470 8255,7446 8257,7415 8261,7380  8265,7341 8269,7301 8273,7261 8278,7224 8283,7189 8289,7159 8295,7135 8302,7118  8309,7109 8317,7111 8325,7125 8331,7142 8336,7165 8341,7192 8346,7220 8349,7251  8353,7282 8355,7314 8357,7346 8359,7377 8360,7408 8361,7439 8362,7470 8363,7500  8363,7530 8364,7561 8365,7592 8366,7623 8368,7654 8370,7686 8372,7718 8376,7749  8379,7780 8384,7808 8389,7835 8394,7858 8400,7875 8408,7889 8416,7891 8423,7882  8430,7865 8436,7841 8442,7811 8447,7776 8452,7739 8456,7699 8460,7659 8464,7620  8468,7585 8470,7554 8472,7530 8474,7514 8475,7504 8475,7501 8475,7500" />
    <!-- Line -->
    <polyline
       style="stroke:#ff001e;stroke-width:18.74484253;stroke-linejoin:bevel;stroke-miterlimit:4;stroke-dasharray:none;stroke-opacity:1"
       id="polyline60"
       points=" 8025,7500 8025,7497 8026,7489 8026,7475 8028,7455 8029,7428 8032,7394 8034,7355  8037,7312 8040,7267 8044,7221 8047,7176 8051,7132 8056,7090 8060,7053 8065,7020  8070,6992 8075,6971 8081,6957 8087,6952 8093,6958 8100,6975 8105,6994 8109,7019  8113,7047 8117,7078 8121,7111 8124,7146 8127,7181 8129,7217 8131,7253 8133,7289  8134,7325 8135,7361 8136,7396 8136,7431 8137,7465 8138,7500 8138,7535 8139,7569  8139,7604 8140,7639 8141,7675 8142,7711 8144,7747 8146,7783 8148,7819 8151,7854  8154,7889 8158,7922 8162,7953 8166,7981 8170,8006 8175,8025 8182,8042 8188,8048  8194,8043 8200,8029 8205,8008 8210,7980 8215,7947 8219,7910 8224,7868 8228,7824  8231,7779 8235,7733 8238,7688 8241,7645 8243,7606 8246,7572 8247,7545 8249,7525  8249,7511 8250,7503 8250,7500" />
    <!-- Line -->
    <polyline
       style="stroke:#ff001e;stroke-width:18.74484253;stroke-linejoin:bevel;stroke-miterlimit:4;stroke-dasharray:none;stroke-opacity:1"
       id="polyline62"
       points=" 7800,7500 7800,7497 7800,7491 7801,7480 7802,7462 7803,7438 7804,7408 7806,7372  7808,7330 7810,7285 7813,7236 7816,7185 7819,7134 7822,7084 7825,7035 7829,6988  7832,6945 7836,6905 7840,6870 7844,6840 7849,6816 7853,6799 7858,6791 7864,6791  7869,6802 7875,6825 7879,6849 7883,6878 7887,6912 7891,6949 7894,6988 7897,7030  7900,7072 7902,7116 7904,7159 7906,7203 7907,7247 7908,7290 7909,7333 7910,7376  7911,7418 7912,7460 7912,7502 7913,7544 7913,7586 7913,7627 7914,7669 7915,7712  7916,7754 7917,7797 7918,7840 7919,7883 7921,7926 7923,7969 7925,8012 7928,8054  7931,8094 7934,8133 7938,8168 7942,8201 7946,8228 7950,8250 7956,8270 7961,8277  7967,8274 7972,8262 7976,8241 7981,8213 7985,8180 7989,8141 7993,8097 7996,8049  8000,7999 8003,7946 8006,7891 8009,7837 8012,7782 8015,7730 8017,7681 8019,7637  8021,7598 8022,7566 8023,7540 8024,7522 8025,7510 8025,7503 8025,7500" />
    <!-- Line -->
    <polyline
       style="stroke:#ff001e;stroke-width:18.74484253;stroke-linejoin:bevel;stroke-miterlimit:4;stroke-dasharray:none;stroke-opacity:1"
       id="polyline64"
       points=" 7582,7500 7582,7497 7582,7491 7583,7479 7583,7462 7584,7437 7585,7406 7587,7368  7589,7323 7591,7274 7593,7221 7595,7164 7598,7106 7601,7048 7604,6990 7607,6933  7610,6879 7613,6829 7617,6782 7620,6740 7624,6703 7628,6673 7632,6649 7637,6634  7641,6627 7646,6631 7652,6647 7657,6675 7661,6701 7664,6732 7667,6768 7671,6806  7674,6848 7676,6892 7679,6937 7681,6983 7683,7030 7685,7077 7687,7125 7688,7172  7689,7220 7690,7267 7691,7313 7692,7360 7693,7406 7693,7451 7694,7497 7694,7542  7695,7588 7695,7633 7695,7678 7696,7723 7696,7769 7697,7815 7698,7861 7699,7907  7700,7953 7701,8000 7702,8047 7704,8093 7706,8140 7708,8186 7710,8230 7713,8274  7715,8316 7718,8355 7722,8392 7725,8424 7728,8452 7732,8475 7737,8496 7742,8506  7747,8506 7751,8495 7755,8477 7759,8451 7763,8418 7767,8380 7770,8337 7774,8289  7777,8237 7780,8182 7783,8125 7786,8065 7788,8004 7791,7943 7793,7882 7796,7823  7798,7766 7800,7714 7801,7666 7803,7623 7804,7587 7805,7558 7806,7535 7806,7519  7807,7508 7807,7503 7807,7500" />
    <!-- Line -->
    <polyline
       style="stroke:#ff001e;stroke-width:18.74484253;stroke-linejoin:bevel;stroke-miterlimit:4;stroke-dasharray:none;stroke-opacity:1"
       id="polyline66"
       points=" 7350,7500 7350,7498 7350,7492 7351,7482 7351,7467 7352,7445 7352,7416 7353,7381  7355,7339 7356,7292 7358,7239 7360,7181 7362,7121 7364,7057 7366,6993 7369,6928  7371,6864 7374,6801 7377,6740 7380,6682 7382,6628 7386,6578 7389,6532 7392,6491  7396,6457 7399,6429 7403,6408 7407,6396 7411,6393 7416,6400 7420,6419 7425,6450  7428,6479 7431,6514 7435,6553 7438,6596 7440,6642 7443,6690 7445,6741 7448,6793  7450,6845 7452,6899 7453,6953 7455,7007 7456,7061 7457,7115 7458,7169 7459,7222  7460,7275 7460,7328 7461,7380 7461,7432 7462,7484 7462,7536 7463,7588 7463,7639  7463,7691 7464,7743 7464,7795 7465,7847 7465,7899 7466,7952 7467,8005 7468,8058  7469,8111 7470,8165 7472,8218 7473,8271 7475,8323 7477,8375 7480,8426 7482,8475  7485,8521 7487,8565 7490,8606 7494,8642 7497,8674 7500,8700 7504,8725 7509,8739  7513,8742 7517,8735 7521,8720 7524,8698 7528,8668 7531,8632 7535,8590 7538,8544  7541,8493 7543,8438 7546,8380 7549,8319 7551,8255 7554,8190 7556,8123 7559,8057  7561,7990 7563,7925 7565,7862 7567,7802 7568,7746 7570,7695 7571,7650 7572,7610  7573,7577 7574,7551 7574,7531 7575,7516 7575,7507 7575,7502 7575,7500" />
    <!-- Line -->
    <polyline
       style="stroke:#ff001e;stroke-width:18.74484253;stroke-linejoin:bevel;stroke-miterlimit:4;stroke-dasharray:none;stroke-opacity:1"
       id="polyline68"
       points=" 7050,7500 7050,7498 7050,7493 7051,7484 7052,7470 7053,7449 7054,7423 7056,7389  7059,7349 7061,7303 7064,7250 7068,7192 7072,7130 7076,7063 7080,6993 7085,6922  7090,6849 7095,6776 7100,6703 7105,6632 7110,6562 7116,6496 7121,6432 7126,6372  7132,6316 7138,6264 7144,6218 7150,6178 7156,6144 7162,6117 7168,6097 7174,6087  7181,6086 7187,6096 7194,6117 7200,6150 7204,6180 7208,6216 7212,6256 7216,6301  7220,6349 7223,6400 7226,6453 7228,6507 7231,6564 7233,6621 7235,6679 7237,6737  7238,6796 7240,6855 7241,6913 7241,6972 7242,7030 7243,7088 7243,7146 7244,7204  7244,7261 7244,7318 7244,7374 7244,7431 7244,7487 7244,7544 7244,7600 7244,7656  7244,7713 7244,7770 7244,7826 7244,7884 7244,7941 7244,7999 7245,8056 7245,8115  7246,8173 7246,8231 7247,8290 7249,8348 7250,8406 7251,8464 7253,8520 7255,8576  7257,8630 7259,8682 7261,8732 7264,8779 7267,8822 7269,8862 7272,8896 7275,8925  7279,8956 7283,8975 7287,8982 7291,8978 7295,8965 7298,8943 7302,8914 7305,8877  7308,8833 7311,8784 7314,8730 7317,8671 7319,8608 7322,8542 7324,8472 7327,8400  7329,8325 7331,8250 7333,8174 7335,8099 7337,8024 7339,7952 7341,7883 7343,7818  7344,7758 7345,7704 7347,7656 7347,7614 7348,7580 7349,7552 7349,7531 7350,7517  7350,7507 7350,7502 7350,7500" />
    <!-- Line -->
    <polyline
       style="stroke:#ff001e;stroke-width:18.74484253;stroke-linejoin:bevel;stroke-miterlimit:4;stroke-dasharray:none;stroke-opacity:1"
       id="polyline70"
       points=" 8925,7500 8925,7501 8924,7506 8922,7517 8918,7534 8912,7556 8906,7580 8899,7603  8892,7624 8883,7641 8873,7653 8862,7657 8850,7650 8841,7638 8833,7621 8826,7601  8821,7581 8817,7560 8815,7540 8814,7520 8813,7500 8811,7480 8810,7460 8808,7440  8804,7419 8799,7399 8792,7379 8784,7362 8775,7350 8763,7343 8752,7347 8742,7359  8733,7376 8726,7397 8719,7420 8713,7444 8707,7466 8703,7483 8701,7494 8700,7499  8700,7500" />
    <!-- Line -->
    <polyline
       style="stroke:#ff001e;stroke-width:18.74484253;stroke-linejoin:bevel;stroke-miterlimit:4;stroke-dasharray:none;stroke-opacity:1"
       id="polyline72"
       points=" 9150,7500 9149,7503 9147,7508 9143,7517 9137,7528 9131,7540 9124,7552 9117,7562  9108,7571 9098,7576 9087,7578 9075,7575 9063,7566 9053,7554 9046,7540 9042,7527  9039,7513 9037,7500 9036,7487 9033,7473 9029,7460 9022,7446 9012,7434 9000,7425  8988,7422 8977,7424 8967,7429 8958,7438 8951,7448 8944,7460 8938,7472 8932,7483  8928,7492 8926,7497 8925,7500" />
    <!-- Line -->
    <polyline
       style="stroke:#ff001e;stroke-width:18.74484253;stroke-linejoin:bevel;stroke-miterlimit:4;stroke-dasharray:none;stroke-opacity:1"
       id="polyline74"
       points=" 5475,7500 5475,7499 5476,7494 5478,7483 5482,7466 5488,7444 5494,7420 5501,7397  5508,7376 5517,7359 5527,7347 5538,7343 5550,7350 5559,7362 5567,7379 5574,7399  5579,7419 5583,7440 5585,7460 5586,7480 5588,7500 5589,7520 5590,7540 5592,7560  5596,7581 5601,7601 5608,7621 5616,7638 5625,7650 5637,7657 5648,7653 5658,7641  5667,7624 5674,7603 5681,7580 5687,7556 5693,7534 5697,7517 5699,7506 5700,7501  5700,7500" />
    <!-- Line -->
    <polyline
       style="stroke:#ff001e;stroke-width:18.74484253;stroke-linejoin:bevel;stroke-miterlimit:4;stroke-dasharray:none;stroke-opacity:1"
       id="polyline76"
       points=" 5250,7500 5251,7497 5253,7492 5257,7483 5263,7472 5269,7460 5276,7448 5283,7438  5292,7429 5302,7424 5313,7422 5325,7425 5337,7434 5347,7446 5354,7460 5358,7473  5361,7487 5363,7500 5364,7513 5367,7527 5371,7540 5378,7554 5388,7566 5400,7575  5412,7578 5423,7576 5433,7571 5442,7562 5449,7552 5456,7540 5462,7528 5468,7517  5472,7508 5474,7503 5475,7500" />
    <!-- Text -->
    <text
       style="font-style:normal;font-weight:normal;font-size:336px;font-family:Times, Symbol;text-anchor:start;fill:#ff001e;fill-opacity:1;stroke:#ff001e;stroke-width:18.74484253;stroke-miterlimit:4;stroke-dasharray:none;stroke-opacity:1"
       id="text78"
       font-size="336"
       font-weight="normal"
       font-style="normal"
       y="1125"
       x="2925"
       xml:space="preserve">ω</text>
    <!-- Text -->
    <text
       style="font-style:normal;font-weight:normal;font-size:288px;font-family:Helvetica;text-anchor:start;fill:#ff001e;fill-opacity:1;stroke:#ff001e;stroke-width:18.74484253;stroke-miterlimit:4;stroke-dasharray:none;stroke-opacity:1"
       id="text80"
       font-size="288"
       font-weight="normal"
       font-style="normal"
       y="5925"
       x="9600"
       xml:space="preserve">t</text>
    <!-- Line -->
    <defs
       id="defs85">
      <clipPath
         id="cp2">
        <path
           style="clip-rule:evenodd"
           inkscape:connector-curvature="0"
           id="path82"
           d="M 1172,513 H 9912 V 8994 H 1172 Z m 2098,148 h 60 l -23,-143 h -14 z" />
      </clipPath>
    </defs>
    <polyline
       style="stroke:#ff001e;stroke-width:18.74484253;stroke-miterlimit:4;stroke-dasharray:none;stroke-opacity:1"
       id="polyline87"
       clip-path="url(#cp2)"
       points=" 3300,6000 3300,525" />
    <!-- Forward arrow to point 3300,525 -->
    <polygon
       style="fill:#ff001e;fill-opacity:1;stroke:#ff001e;stroke-width:18.74484253;stroke-miterlimit:4;stroke-dasharray:none;stroke-opacity:1"
       id="polygon89"
       stroke-miterlimit="8"
       points="3330,661 3300,541 3270,661 " />
    <!-- Line -->
    <defs
       id="defs94">
      <clipPath
         id="cp3">
        <path
           style="clip-rule:evenodd"
           inkscape:connector-curvature="0"
           id="path91"
           d="M 1172,513 H 9912 V 8994 H 1172 Z m 8592,4857 v 60 l 143,-23 v -14 z" />
      </clipPath>
    </defs>
    <polyline
       style="stroke:#ff001e;stroke-width:18.74484253;stroke-miterlimit:4;stroke-dasharray:none;stroke-opacity:1"
       id="polyline96"
       clip-path="url(#cp3)"
       points=" 2700,5400 9900,5400" />
    <!-- Forward arrow to point 9900,5400 -->
    <polygon
       style="fill:#ff001e;fill-opacity:1;stroke:#ff001e;stroke-width:18.74484253;stroke-miterlimit:4;stroke-dasharray:none;stroke-opacity:1"
       id="polygon98"
       stroke-miterlimit="8"
       points="9764,5430 9884,5400 9764,5370 " />
  </g>
</svg>
