%!PS-Adobe-2.0 EPSF-1.2
%%Creator: MATLAB, The Mathworks, Inc. Version 7.5.0.338 (R2007b). Operating System: Linux 2.6.35-32-generic #67-Ubuntu SMP Mon Mar 5 19:39:49 UTC 2012 x86_64.
%%Title: ./filtri_chebyshev.eps
%%CreationDate: 04/20/2012  14:27:55
%%DocumentNeededFonts: Helvetica
%%DocumentProcessColors: Cyan Magenta Yellow Black
%%Extensions: CMYK
%%Pages: 1
%%BoundingBox:    48   196   543   608
%%EndComments

%%BeginProlog
% MathWorks dictionary
/MathWorks 160 dict begin
% definition operators
/bdef {bind def} bind def
/ldef {load def} bind def
/xdef {exch def} bdef
/xstore {exch store} bdef
% operator abbreviations
/c  /clip ldef
/cc /concat ldef
/cp /closepath ldef
/gr /grestore ldef
/gs /gsave ldef
/mt /moveto ldef
/np /newpath ldef
/cm /currentmatrix ldef
/sm /setmatrix ldef
/rm /rmoveto ldef
/rl /rlineto ldef
/s {show newpath} bdef
/sc {setcmykcolor} bdef
/sr /setrgbcolor ldef
/sg /setgray ldef
/w /setlinewidth ldef
/j /setlinejoin ldef
/cap /setlinecap ldef
/rc {rectclip} bdef
/rf {rectfill} bdef
% page state control
/pgsv () def
/bpage {/pgsv save def} bdef
/epage {pgsv restore} bdef
/bplot /gsave ldef
/eplot {stroke grestore} bdef
% orientation switch
/portraitMode 0 def /landscapeMode 1 def /rotateMode 2 def
% coordinate system mappings
/dpi2point 0 def
% font control
/FontSize 0 def
/FMS {/FontSize xstore findfont [FontSize 0 0 FontSize neg 0 0]
  makefont setfont} bdef
/reencode {exch dup where {pop load} {pop StandardEncoding} ifelse
  exch dup 3 1 roll findfont dup length dict begin
  { 1 index /FID ne {def}{pop pop} ifelse } forall
  /Encoding exch def currentdict end definefont pop} bdef
/isroman {findfont /CharStrings get /Agrave known} bdef
/FMSR {3 1 roll 1 index dup isroman {reencode} {pop pop} ifelse
  exch FMS} bdef
/csm {1 dpi2point div -1 dpi2point div scale neg translate
 dup landscapeMode eq {pop -90 rotate}
  {rotateMode eq {90 rotate} if} ifelse} bdef
% line types: solid, dotted, dashed, dotdash
/SO { [] 0 setdash } bdef
/DO { [.5 dpi2point mul 4 dpi2point mul] 0 setdash } bdef
/DA { [6 dpi2point mul] 0 setdash } bdef
/DD { [.5 dpi2point mul 4 dpi2point mul 6 dpi2point mul 4
  dpi2point mul] 0 setdash } bdef
% macros for lines and objects
/L {lineto stroke} bdef
/MP {3 1 roll moveto 1 sub {rlineto} repeat} bdef
/AP {{rlineto} repeat} bdef
/PDlw -1 def
/W {/PDlw currentlinewidth def setlinewidth} def
/PP {closepath eofill} bdef
/DP {closepath stroke} bdef
/MR {4 -2 roll moveto dup  0 exch rlineto exch 0 rlineto
  neg 0 exch rlineto closepath} bdef
/FR {MR stroke} bdef
/PR {MR fill} bdef
/L1i {{currentfile picstr readhexstring pop} image} bdef
/tMatrix matrix def
/MakeOval {newpath tMatrix currentmatrix pop translate scale
0 0 1 0 360 arc tMatrix setmatrix} bdef
/FO {MakeOval stroke} bdef
/PO {MakeOval fill} bdef
/PD {currentlinewidth 2 div 0 360 arc fill
   PDlw -1 eq not {PDlw w /PDlw -1 def} if} def
/FA {newpath tMatrix currentmatrix pop translate scale
  0 0 1 5 -2 roll arc tMatrix setmatrix stroke} bdef
/PA {newpath tMatrix currentmatrix pop	translate 0 0 moveto scale
  0 0 1 5 -2 roll arc closepath tMatrix setmatrix fill} bdef
/FAn {newpath tMatrix currentmatrix pop translate scale
  0 0 1 5 -2 roll arcn tMatrix setmatrix stroke} bdef
/PAn {newpath tMatrix currentmatrix pop translate 0 0 moveto scale
  0 0 1 5 -2 roll arcn closepath tMatrix setmatrix fill} bdef
/vradius 0 def /hradius 0 def /lry 0 def
/lrx 0 def /uly 0 def /ulx 0 def /rad 0 def
/MRR {/vradius xdef /hradius xdef /lry xdef /lrx xdef /uly xdef
  /ulx xdef newpath tMatrix currentmatrix pop ulx hradius add uly
  vradius add translate hradius vradius scale 0 0 1 180 270 arc 
  tMatrix setmatrix lrx hradius sub uly vradius add translate
  hradius vradius scale 0 0 1 270 360 arc tMatrix setmatrix
  lrx hradius sub lry vradius sub translate hradius vradius scale
  0 0 1 0 90 arc tMatrix setmatrix ulx hradius add lry vradius sub
  translate hradius vradius scale 0 0 1 90 180 arc tMatrix setmatrix
  closepath} bdef
/FRR {MRR stroke } bdef
/PRR {MRR fill } bdef
/MlrRR {/lry xdef /lrx xdef /uly xdef /ulx xdef /rad lry uly sub 2 div def
  newpath tMatrix currentmatrix pop ulx rad add uly rad add translate
  rad rad scale 0 0 1 90 270 arc tMatrix setmatrix lrx rad sub lry rad
  sub translate rad rad scale 0 0 1 270 90 arc tMatrix setmatrix
  closepath} bdef
/FlrRR {MlrRR stroke } bdef
/PlrRR {MlrRR fill } bdef
/MtbRR {/lry xdef /lrx xdef /uly xdef /ulx xdef /rad lrx ulx sub 2 div def
  newpath tMatrix currentmatrix pop ulx rad add uly rad add translate
  rad rad scale 0 0 1 180 360 arc tMatrix setmatrix lrx rad sub lry rad
  sub translate rad rad scale 0 0 1 0 180 arc tMatrix setmatrix
  closepath} bdef
/FtbRR {MtbRR stroke } bdef
/PtbRR {MtbRR fill } bdef
/stri 6 array def /dtri 6 array def
/smat 6 array def /dmat 6 array def
/tmat1 6 array def /tmat2 6 array def /dif 3 array def
/asub {/ind2 exch def /ind1 exch def dup dup
  ind1 get exch ind2 get sub exch } bdef
/tri_to_matrix {
  2 0 asub 3 1 asub 4 0 asub 5 1 asub
  dup 0 get exch 1 get 7 -1 roll astore } bdef
/compute_transform {
  dmat dtri tri_to_matrix tmat1 invertmatrix 
  smat stri tri_to_matrix tmat2 concatmatrix } bdef
/ds {stri astore pop} bdef
/dt {dtri astore pop} bdef
/db {2 copy /cols xdef /rows xdef mul dup 3 mul string
  currentfile exch readhexstring pop
  dup 0 3 index getinterval /rbmap xdef
  dup 2 index dup getinterval /gbmap xdef
  1 index dup 2 mul exch getinterval /bbmap xdef pop pop}bdef
/it {gs np dtri aload pop moveto lineto lineto cp c
  cols rows 8 compute_transform 
  rbmap gbmap bbmap true 3 colorimage gr}bdef
/il {newpath moveto lineto stroke}bdef
currentdict end def
%%EndProlog

%%BeginSetup
MathWorks begin

0 cap

end
%%EndSetup

%%Page: 1 1
%%BeginPageSetup
%%PageBoundingBox:    48   196   543   608
MathWorks begin
bpage
%%EndPageSetup

%%BeginObject: obj1
bplot

/dpi2point 12 def
portraitMode 0216 7344 csm

  368    45  5937  4947 MR c np
86 dict begin %Colortable dictionary
/c0 { 0.000000 0.000000 0.000000 sr} bdef
/c1 { 1.000000 1.000000 1.000000 sr} bdef
/c2 { 0.900000 0.000000 0.000000 sr} bdef
/c3 { 0.000000 0.820000 0.000000 sr} bdef
/c4 { 0.000000 0.000000 0.800000 sr} bdef
/c5 { 0.910000 0.820000 0.320000 sr} bdef
/c6 { 1.000000 0.260000 0.820000 sr} bdef
/c7 { 0.000000 0.820000 0.820000 sr} bdef
c0
1 j
1 sg
   0    0 6913 5186 PR
6 w
0 4226 5356 0 0 -4226 899 4615 4 MP
PP
-5356 0 0 4226 5356 0 0 -4226 899 4615 5 MP stroke
4 w
DO
0 sg
 899 4615 mt  899  389 L
 899  389 mt  899  389 L
4524 4615 mt 4524  389 L
4524  389 mt 4524  389 L
 899 4615 mt 6255 4615 L
6255 4615 mt 6255 4615 L
 899 3334 mt 6255 3334 L
6255 3334 mt 6255 3334 L
 899 2054 mt 6255 2054 L
6255 2054 mt 6255 2054 L
 899  774 mt 6255  774 L
6255  774 mt 6255  774 L
SO
6 w
 899 4615 mt 6255 4615 L
 899  389 mt 6255  389 L
 899 4615 mt  899  389 L
6255 4615 mt 6255  389 L
 899 4615 mt 6255 4615 L
 899 4615 mt  899  389 L
 899 4615 mt  899 4588 L
 899  389 mt  899  415 L
DO
 899 4615 mt  899  389 L
 899  389 mt  899  389 L
SO
 899 4615 mt  899 4561 L
 899  389 mt  899  442 L
%%IncludeResource: font Helvetica
/Helvetica /ISOLatin1Encoding 120 FMSR

 787 4797 mt 
(10) s
%%IncludeResource: font Helvetica
/Helvetica /ISOLatin1Encoding 80 FMSR

 920 4723 mt 
(-1) s
1990 4615 mt 1990 4588 L
1990  389 mt 1990  415 L
DO
1990 4615 mt 1990  389 L
1990  389 mt 1990  389 L
SO
2629 4615 mt 2629 4588 L
2629  389 mt 2629  415 L
DO
2629 4615 mt 2629  389 L
2629  389 mt 2629  389 L
SO
3082 4615 mt 3082 4588 L
3082  389 mt 3082  415 L
DO
3082 4615 mt 3082  389 L
3082  389 mt 3082  389 L
SO
3433 4615 mt 3433 4588 L
3433  389 mt 3433  415 L
DO
3433 4615 mt 3433  389 L
3433  389 mt 3433  389 L
SO
3720 4615 mt 3720 4588 L
3720  389 mt 3720  415 L
DO
3720 4615 mt 3720  389 L
3720  389 mt 3720  389 L
SO
3963 4615 mt 3963 4588 L
3963  389 mt 3963  415 L
DO
3963 4615 mt 3963  389 L
3963  389 mt 3963  389 L
SO
4173 4615 mt 4173 4588 L
4173  389 mt 4173  415 L
DO
4173 4615 mt 4173  389 L
4173  389 mt 4173  389 L
SO
4359 4615 mt 4359 4588 L
4359  389 mt 4359  415 L
DO
4359 4615 mt 4359  389 L
4359  389 mt 4359  389 L
SO
4524 4615 mt 4524 4588 L
4524  389 mt 4524  415 L
DO
4524 4615 mt 4524  389 L
4524  389 mt 4524  389 L
SO
4524 4615 mt 4524 4561 L
4524  389 mt 4524  442 L
%%IncludeResource: font Helvetica
/Helvetica /ISOLatin1Encoding 120 FMSR

4436 4797 mt 
(10) s
%%IncludeResource: font Helvetica
/Helvetica /ISOLatin1Encoding 80 FMSR

4569 4723 mt 
(0) s
5616 4615 mt 5616 4588 L
5616  389 mt 5616  415 L
DO
5616 4615 mt 5616  389 L
5616  389 mt 5616  389 L
SO
6255 4615 mt 6255 4588 L
6255  389 mt 6255  415 L
DO
6255 4615 mt 6255  389 L
6255  389 mt 6255  389 L
SO
 899 4615 mt  925 4615 L
6255 4615 mt 6228 4615 L
DO
 899 4615 mt 6255 4615 L
6255 4615 mt 6255 4615 L
SO
 899 4615 mt  952 4615 L
6255 4615 mt 6201 4615 L
%%IncludeResource: font Helvetica
/Helvetica /ISOLatin1Encoding 120 FMSR

 640 4659 mt 
(10) s
%%IncludeResource: font Helvetica
/Helvetica /ISOLatin1Encoding 80 FMSR

 773 4585 mt 
(-3) s
 899 4229 mt  925 4229 L
6255 4229 mt 6228 4229 L
DO
 899 4229 mt 6255 4229 L
6255 4229 mt 6255 4229 L
SO
 899 4004 mt  925 4004 L
6255 4004 mt 6228 4004 L
DO
 899 4004 mt 6255 4004 L
6255 4004 mt 6255 4004 L
SO
 899 3844 mt  925 3844 L
6255 3844 mt 6228 3844 L
DO
 899 3844 mt 6255 3844 L
6255 3844 mt 6255 3844 L
SO
 899 3720 mt  925 3720 L
6255 3720 mt 6228 3720 L
DO
 899 3720 mt 6255 3720 L
6255 3720 mt 6255 3720 L
SO
 899 3618 mt  925 3618 L
6255 3618 mt 6228 3618 L
DO
 899 3618 mt 6255 3618 L
6255 3618 mt 6255 3618 L
SO
 899 3533 mt  925 3533 L
6255 3533 mt 6228 3533 L
DO
 899 3533 mt 6255 3533 L
6255 3533 mt 6255 3533 L
SO
 899 3458 mt  925 3458 L
6255 3458 mt 6228 3458 L
DO
 899 3458 mt 6255 3458 L
6255 3458 mt 6255 3458 L
SO
 899 3393 mt  925 3393 L
6255 3393 mt 6228 3393 L
DO
 899 3393 mt 6255 3393 L
6255 3393 mt 6255 3393 L
SO
 899 3334 mt  925 3334 L
6255 3334 mt 6228 3334 L
DO
 899 3334 mt 6255 3334 L
6255 3334 mt 6255 3334 L
SO
 899 3334 mt  952 3334 L
6255 3334 mt 6201 3334 L
%%IncludeResource: font Helvetica
/Helvetica /ISOLatin1Encoding 120 FMSR

 640 3378 mt 
(10) s
%%IncludeResource: font Helvetica
/Helvetica /ISOLatin1Encoding 80 FMSR

 773 3304 mt 
(-2) s
 899 2949 mt  925 2949 L
6255 2949 mt 6228 2949 L
DO
 899 2949 mt 6255 2949 L
6255 2949 mt 6255 2949 L
SO
 899 2723 mt  925 2723 L
6255 2723 mt 6228 2723 L
DO
 899 2723 mt 6255 2723 L
6255 2723 mt 6255 2723 L
SO
 899 2564 mt  925 2564 L
6255 2564 mt 6228 2564 L
DO
 899 2564 mt 6255 2564 L
6255 2564 mt 6255 2564 L
SO
 899 2439 mt  925 2439 L
6255 2439 mt 6228 2439 L
DO
 899 2439 mt 6255 2439 L
6255 2439 mt 6255 2439 L
SO
 899 2338 mt  925 2338 L
6255 2338 mt 6228 2338 L
DO
 899 2338 mt 6255 2338 L
6255 2338 mt 6255 2338 L
SO
 899 2252 mt  925 2252 L
6255 2252 mt 6228 2252 L
DO
 899 2252 mt 6255 2252 L
6255 2252 mt 6255 2252 L
SO
 899 2178 mt  925 2178 L
6255 2178 mt 6228 2178 L
DO
 899 2178 mt 6255 2178 L
6255 2178 mt 6255 2178 L
SO
 899 2113 mt  925 2113 L
6255 2113 mt 6228 2113 L
DO
 899 2113 mt 6255 2113 L
6255 2113 mt 6255 2113 L
SO
 899 2054 mt  925 2054 L
6255 2054 mt 6228 2054 L
DO
 899 2054 mt 6255 2054 L
6255 2054 mt 6255 2054 L
SO
 899 2054 mt  952 2054 L
6255 2054 mt 6201 2054 L
%%IncludeResource: font Helvetica
/Helvetica /ISOLatin1Encoding 120 FMSR

 640 2098 mt 
(10) s
%%IncludeResource: font Helvetica
/Helvetica /ISOLatin1Encoding 80 FMSR

 773 2024 mt 
(-1) s
 899 1669 mt  925 1669 L
6255 1669 mt 6228 1669 L
DO
 899 1669 mt 6255 1669 L
6255 1669 mt 6255 1669 L
SO
 899 1443 mt  925 1443 L
6255 1443 mt 6228 1443 L
DO
 899 1443 mt 6255 1443 L
6255 1443 mt 6255 1443 L
SO
 899 1283 mt  925 1283 L
6255 1283 mt 6228 1283 L
DO
 899 1283 mt 6255 1283 L
6255 1283 mt 6255 1283 L
SO
 899 1159 mt  925 1159 L
6255 1159 mt 6228 1159 L
DO
 899 1159 mt 6255 1159 L
6255 1159 mt 6255 1159 L
SO
 899 1058 mt  925 1058 L
6255 1058 mt 6228 1058 L
DO
 899 1058 mt 6255 1058 L
6255 1058 mt 6255 1058 L
SO
 899  972 mt  925  972 L
6255  972 mt 6228  972 L
DO
 899  972 mt 6255  972 L
6255  972 mt 6255  972 L
SO
 899  898 mt  925  898 L
6255  898 mt 6228  898 L
DO
 899  898 mt 6255  898 L
6255  898 mt 6255  898 L
SO
 899  832 mt  925  832 L
6255  832 mt 6228  832 L
DO
 899  832 mt 6255  832 L
6255  832 mt 6255  832 L
SO
 899  774 mt  925  774 L
6255  774 mt 6228  774 L
DO
 899  774 mt 6255  774 L
6255  774 mt 6255  774 L
SO
 899  774 mt  952  774 L
6255  774 mt 6201  774 L
%%IncludeResource: font Helvetica
/Helvetica /ISOLatin1Encoding 120 FMSR

 640  818 mt 
(10) s
%%IncludeResource: font Helvetica
/Helvetica /ISOLatin1Encoding 80 FMSR

 773  744 mt 
(0) s
 899  389 mt  925  389 L
6255  389 mt 6228  389 L
DO
 899  389 mt 6255  389 L
6255  389 mt 6255  389 L
SO
 899 4615 mt 6255 4615 L
 899  389 mt 6255  389 L
 899 4615 mt  899  389 L
6255 4615 mt 6255  389 L
gs 899 388 5357 4228 MR c np
/c8 { 1.000000 0.000000 0.000000 sr} bdef
c8
10 11 73 83 74 83 73 83 73 85 73 85 74 86 73 87 
73 88 73 89 74 91 73 92 73 94 73 96 74 99 73 101 
73 105 73 108 74 113 73 117 73 122 73 127 74 130 73 128 
73 116 73 87 74 44 73 4 73 -22 73 -31 74 -31 73 -28 
73 -23 73 -18 74 -14 73 -11 73 -7 73 -4 74 -1 73 0 
73 2 73 3 74 4 73 5 73 6 73 6 74 7 73 7 
73 7 73 7 74 7 73 7 73 8 73 6 74 7 73 7 
73 6 73 6 74 6 73 5 73 6 73 4 74 5 73 4 
73 5 73 3 74 4 73 3 73 3 73 3 74 3 73 2 
73 3 73 2 899 797 75 MP stroke
/c9 { 0.000000 1.000000 0.000000 sr} bdef
c9
10 14 73 110 74 111 73 112 73 112 73 114 74 115 73 116 
73 117 73 120 74 121 73 123 73 126 73 130 74 132 73 137 
73 143 73 148 74 157 73 166 73 179 73 194 74 212 73 226 
73 202 73 97 74 -24 73 -61 73 -51 73 -33 74 -17 73 -5 
73 5 73 12 74 17 73 21 73 22 73 23 74 23 73 20 
73 18 73 14 74 10 73 6 73 2 73 -1 74 -4 73 -6 
73 -8 73 -9 74 -9 73 -10 73 -10 73 -9 74 -9 73 -9 
73 -9 73 -8 74 -7 73 -7 73 -7 73 -5 74 -6 73 -5 
73 -5 73 -4 74 -4 73 -4 73 -3 73 -3 74 -3 73 -2 
73 -2 73 -3 899 945 75 MP stroke
0 sg
21 42 74 143 73 145 73 147 73 150 74 151 73 154 73 158 
73 162 74 166 73 172 73 178 73 187 74 197 73 211 73 230 
73 256 74 292 73 337 73 307 73 37 74 -94 73 -60 73 -19 
73 12 74 30 73 41 73 42 73 37 74 24 73 7 73 -8 
73 -19 74 -25 73 -25 73 -25 73 -22 74 -18 73 -16 73 -12 
73 -9 74 -7 73 -4 73 -2 73 -1 74 2 73 2 73 4 
73 4 74 5 73 6 73 6 73 7 74 7 73 7 73 7 
73 7 74 7 73 7 73 7 73 6 74 7 73 6 73 6 
73 5 74 6 73 5 73 5 73 4 899 832 70 MP stroke
gr

%%IncludeResource: font Helvetica
/Helvetica /ISOLatin1Encoding 120 FMSR

 504 2667 mt  -90 rotate
(|H) s
90 rotate
%%IncludeResource: font Helvetica
/Helvetica /ISOLatin1Encoding 96 FMSR

 564 2550 mt  -90 rotate
(N) s
90 rotate
%%IncludeResource: font Helvetica
/Helvetica /ISOLatin1Encoding 120 FMSR

 504 2481 mt  -90 rotate
(\(f\)|) s
90 rotate
3559 4940 mt 
(f) s
2395  239 mt 
(Modulo dei filtri di Chebyshev-I per f) s
%%IncludeResource: font Helvetica
/Helvetica /ISOLatin1Encoding 96 FMSR

4334  299 mt 
(c) s
%%IncludeResource: font Helvetica
/Helvetica /ISOLatin1Encoding 120 FMSR

4382  239 mt 
(=1, ) s
%%IncludeResource: font Symbol
/Symbol /ISOLatin1Encoding 120 FMSR

4585  239 mt 
(e) s
%%IncludeResource: font Helvetica
/Helvetica /ISOLatin1Encoding 120 FMSR

4637  239 mt 
(=1) s
gs 899 388 5357 4228 MR c np
DA
/c10 { 0.000000 0.000000 1.000000 sr} bdef
c10
5356 0 899 967 2 MP stroke
SO
gr

c10

end %%Color Dict

eplot
%%EndObject

epage
end

showpage

%%Trailer
%%EOF
