%!PS-Adobe-2.0 EPSF-1.2
%%Creator: MATLAB, The Mathworks, Inc. Version 7.5.0.338 (R2007b). Operating System: Linux 2.6.35-32-generic #67-Ubuntu SMP Mon Mar 5 19:39:49 UTC 2012 x86_64.
%%Title: ./polinomi_cheby.eps
%%CreationDate: 04/20/2012  14:08:59
%%DocumentNeededFonts: Helvetica
%%DocumentProcessColors: Cyan Magenta Yellow Black
%%Extensions: CMYK
%%Pages: 1
%%BoundingBox:    56   199   550   602
%%EndComments

%%BeginProlog
% MathWorks dictionary
/MathWorks 160 dict begin
% definition operators
/bdef {bind def} bind def
/ldef {load def} bind def
/xdef {exch def} bdef
/xstore {exch store} bdef
% operator abbreviations
/c  /clip ldef
/cc /concat ldef
/cp /closepath ldef
/gr /grestore ldef
/gs /gsave ldef
/mt /moveto ldef
/np /newpath ldef
/cm /currentmatrix ldef
/sm /setmatrix ldef
/rm /rmoveto ldef
/rl /rlineto ldef
/s {show newpath} bdef
/sc {setcmykcolor} bdef
/sr /setrgbcolor ldef
/sg /setgray ldef
/w /setlinewidth ldef
/j /setlinejoin ldef
/cap /setlinecap ldef
/rc {rectclip} bdef
/rf {rectfill} bdef
% page state control
/pgsv () def
/bpage {/pgsv save def} bdef
/epage {pgsv restore} bdef
/bplot /gsave ldef
/eplot {stroke grestore} bdef
% orientation switch
/portraitMode 0 def /landscapeMode 1 def /rotateMode 2 def
% coordinate system mappings
/dpi2point 0 def
% font control
/FontSize 0 def
/FMS {/FontSize xstore findfont [FontSize 0 0 FontSize neg 0 0]
  makefont setfont} bdef
/reencode {exch dup where {pop load} {pop StandardEncoding} ifelse
  exch dup 3 1 roll findfont dup length dict begin
  { 1 index /FID ne {def}{pop pop} ifelse } forall
  /Encoding exch def currentdict end definefont pop} bdef
/isroman {findfont /CharStrings get /Agrave known} bdef
/FMSR {3 1 roll 1 index dup isroman {reencode} {pop pop} ifelse
  exch FMS} bdef
/csm {1 dpi2point div -1 dpi2point div scale neg translate
 dup landscapeMode eq {pop -90 rotate}
  {rotateMode eq {90 rotate} if} ifelse} bdef
% line types: solid, dotted, dashed, dotdash
/SO { [] 0 setdash } bdef
/DO { [.5 dpi2point mul 4 dpi2point mul] 0 setdash } bdef
/DA { [6 dpi2point mul] 0 setdash } bdef
/DD { [.5 dpi2point mul 4 dpi2point mul 6 dpi2point mul 4
  dpi2point mul] 0 setdash } bdef
% macros for lines and objects
/L {lineto stroke} bdef
/MP {3 1 roll moveto 1 sub {rlineto} repeat} bdef
/AP {{rlineto} repeat} bdef
/PDlw -1 def
/W {/PDlw currentlinewidth def setlinewidth} def
/PP {closepath eofill} bdef
/DP {closepath stroke} bdef
/MR {4 -2 roll moveto dup  0 exch rlineto exch 0 rlineto
  neg 0 exch rlineto closepath} bdef
/FR {MR stroke} bdef
/PR {MR fill} bdef
/L1i {{currentfile picstr readhexstring pop} image} bdef
/tMatrix matrix def
/MakeOval {newpath tMatrix currentmatrix pop translate scale
0 0 1 0 360 arc tMatrix setmatrix} bdef
/FO {MakeOval stroke} bdef
/PO {MakeOval fill} bdef
/PD {currentlinewidth 2 div 0 360 arc fill
   PDlw -1 eq not {PDlw w /PDlw -1 def} if} def
/FA {newpath tMatrix currentmatrix pop translate scale
  0 0 1 5 -2 roll arc tMatrix setmatrix stroke} bdef
/PA {newpath tMatrix currentmatrix pop	translate 0 0 moveto scale
  0 0 1 5 -2 roll arc closepath tMatrix setmatrix fill} bdef
/FAn {newpath tMatrix currentmatrix pop translate scale
  0 0 1 5 -2 roll arcn tMatrix setmatrix stroke} bdef
/PAn {newpath tMatrix currentmatrix pop translate 0 0 moveto scale
  0 0 1 5 -2 roll arcn closepath tMatrix setmatrix fill} bdef
/vradius 0 def /hradius 0 def /lry 0 def
/lrx 0 def /uly 0 def /ulx 0 def /rad 0 def
/MRR {/vradius xdef /hradius xdef /lry xdef /lrx xdef /uly xdef
  /ulx xdef newpath tMatrix currentmatrix pop ulx hradius add uly
  vradius add translate hradius vradius scale 0 0 1 180 270 arc 
  tMatrix setmatrix lrx hradius sub uly vradius add translate
  hradius vradius scale 0 0 1 270 360 arc tMatrix setmatrix
  lrx hradius sub lry vradius sub translate hradius vradius scale
  0 0 1 0 90 arc tMatrix setmatrix ulx hradius add lry vradius sub
  translate hradius vradius scale 0 0 1 90 180 arc tMatrix setmatrix
  closepath} bdef
/FRR {MRR stroke } bdef
/PRR {MRR fill } bdef
/MlrRR {/lry xdef /lrx xdef /uly xdef /ulx xdef /rad lry uly sub 2 div def
  newpath tMatrix currentmatrix pop ulx rad add uly rad add translate
  rad rad scale 0 0 1 90 270 arc tMatrix setmatrix lrx rad sub lry rad
  sub translate rad rad scale 0 0 1 270 90 arc tMatrix setmatrix
  closepath} bdef
/FlrRR {MlrRR stroke } bdef
/PlrRR {MlrRR fill } bdef
/MtbRR {/lry xdef /lrx xdef /uly xdef /ulx xdef /rad lrx ulx sub 2 div def
  newpath tMatrix currentmatrix pop ulx rad add uly rad add translate
  rad rad scale 0 0 1 180 360 arc tMatrix setmatrix lrx rad sub lry rad
  sub translate rad rad scale 0 0 1 0 180 arc tMatrix setmatrix
  closepath} bdef
/FtbRR {MtbRR stroke } bdef
/PtbRR {MtbRR fill } bdef
/stri 6 array def /dtri 6 array def
/smat 6 array def /dmat 6 array def
/tmat1 6 array def /tmat2 6 array def /dif 3 array def
/asub {/ind2 exch def /ind1 exch def dup dup
  ind1 get exch ind2 get sub exch } bdef
/tri_to_matrix {
  2 0 asub 3 1 asub 4 0 asub 5 1 asub
  dup 0 get exch 1 get 7 -1 roll astore } bdef
/compute_transform {
  dmat dtri tri_to_matrix tmat1 invertmatrix 
  smat stri tri_to_matrix tmat2 concatmatrix } bdef
/ds {stri astore pop} bdef
/dt {dtri astore pop} bdef
/db {2 copy /cols xdef /rows xdef mul dup 3 mul string
  currentfile exch readhexstring pop
  dup 0 3 index getinterval /rbmap xdef
  dup 2 index dup getinterval /gbmap xdef
  1 index dup 2 mul exch getinterval /bbmap xdef pop pop}bdef
/it {gs np dtri aload pop moveto lineto lineto cp c
  cols rows 8 compute_transform 
  rbmap gbmap bbmap true 3 colorimage gr}bdef
/il {newpath moveto lineto stroke}bdef
currentdict end def
%%EndProlog

%%BeginSetup
MathWorks begin

0 cap

end
%%EndSetup

%%Page: 1 1
%%BeginPageSetup
%%PageBoundingBox:    56   199   550   602
MathWorks begin
bpage
%%EndPageSetup

%%BeginObject: obj1
bplot

/dpi2point 12 def
portraitMode 0216 7344 csm

  456   110  5931  4845 MR c np
86 dict begin %Colortable dictionary
/c0 { 0.000000 0.000000 0.000000 sr} bdef
/c1 { 1.000000 1.000000 1.000000 sr} bdef
/c2 { 0.900000 0.000000 0.000000 sr} bdef
/c3 { 0.000000 0.820000 0.000000 sr} bdef
/c4 { 0.000000 0.000000 0.800000 sr} bdef
/c5 { 0.910000 0.820000 0.320000 sr} bdef
/c6 { 1.000000 0.260000 0.820000 sr} bdef
/c7 { 0.000000 0.820000 0.820000 sr} bdef
c0
1 j
1 sg
   0    0 6913 5186 PR
6 w
0 4226 5356 0 0 -4226 899 4615 4 MP
PP
-5356 0 0 4226 5356 0 0 -4226 899 4615 5 MP stroke
4 w
DO
0 sg
 899 4615 mt  899  389 L
 899  389 mt  899  389 L
1791 4615 mt 1791  389 L
1791  389 mt 1791  389 L
2684 4615 mt 2684  389 L
2684  389 mt 2684  389 L
3577 4615 mt 3577  389 L
3577  389 mt 3577  389 L
4469 4615 mt 4469  389 L
4469  389 mt 4469  389 L
5362 4615 mt 5362  389 L
5362  389 mt 5362  389 L
6255 4615 mt 6255  389 L
6255  389 mt 6255  389 L
 899 4615 mt 6255 4615 L
6255 4615 mt 6255 4615 L
 899 3910 mt 6255 3910 L
6255 3910 mt 6255 3910 L
 899 3206 mt 6255 3206 L
6255 3206 mt 6255 3206 L
 899 2502 mt 6255 2502 L
6255 2502 mt 6255 2502 L
 899 1797 mt 6255 1797 L
6255 1797 mt 6255 1797 L
 899 1093 mt 6255 1093 L
6255 1093 mt 6255 1093 L
 899  389 mt 6255  389 L
6255  389 mt 6255  389 L
SO
6 w
 899 4615 mt 6255 4615 L
 899  389 mt 6255  389 L
 899 4615 mt  899  389 L
6255 4615 mt 6255  389 L
 899 4615 mt 6255 4615 L
 899 4615 mt  899  389 L
 899 4615 mt  899 4561 L
 899  389 mt  899  442 L
%%IncludeResource: font Helvetica
/Helvetica /ISOLatin1Encoding 120 FMSR

 746 4760 mt 
(-1.5) s
1791 4615 mt 1791 4561 L
1791  389 mt 1791  442 L
1688 4760 mt 
(-1) s
2684 4615 mt 2684 4561 L
2684  389 mt 2684  442 L
2531 4760 mt 
(-0.5) s
3577 4615 mt 3577 4561 L
3577  389 mt 3577  442 L
3544 4760 mt 
(0) s
4469 4615 mt 4469 4561 L
4469  389 mt 4469  442 L
4386 4760 mt 
(0.5) s
5362 4615 mt 5362 4561 L
5362  389 mt 5362  442 L
5329 4760 mt 
(1) s
6255 4615 mt 6255 4561 L
6255  389 mt 6255  442 L
6172 4760 mt 
(1.5) s
 899 4615 mt  952 4615 L
6255 4615 mt 6201 4615 L
 728 4659 mt 
(-3) s
 899 3910 mt  952 3910 L
6255 3910 mt 6201 3910 L
 728 3954 mt 
(-2) s
 899 3206 mt  952 3206 L
6255 3206 mt 6201 3206 L
 728 3250 mt 
(-1) s
 899 2502 mt  952 2502 L
6255 2502 mt 6201 2502 L
 798 2546 mt 
(0) s
 899 1797 mt  952 1797 L
6255 1797 mt 6201 1797 L
 798 1841 mt 
(1) s
 899 1093 mt  952 1093 L
6255 1093 mt 6201 1093 L
 798 1137 mt 
(2) s
 899  389 mt  952  389 L
6255  389 mt 6201  389 L
 798  433 mt 
(3) s
 899 4615 mt 6255 4615 L
 899  389 mt 6255  389 L
 899 4615 mt  899  389 L
6255 4615 mt 6255  389 L
gs 899 389 5357 4227 MR c np
/c8 { 1.000000 0.000000 0.000000 sr} bdef
c8
14 -72 18 -94 17 -92 18 -89 18 -88 18 -86 18 -84 18 -82 
17 -80 18 -79 18 -76 18 -75 18 -73 18 -71 18 -69 17 -68 
18 -66 18 -64 18 -63 18 -61 18 -59 18 -57 17 -56 18 -55 
18 -52 18 -52 18 -49 18 -48 18 -47 17 -45 18 -44 18 -42 
18 -40 18 -40 18 -37 18 -37 17 -35 18 -33 18 -33 18 -31 
18 -29 18 -29 17 -27 18 -25 18 -25 18 -23 18 -22 18 -21 
18 -20 17 -18 18 -18 18 -16 18 -15 18 -14 18 -13 18 -12 
17 -11 18 -10 18 -9 18 -7 18 -7 18 -6 18 -5 17 -4 
18 -3 18 -2 18 -1 18 -1 18 1 18 1 17 2 18 3 
18 3 18 5 18 5 18 6 18 6 17 8 18 8 18 8 
18 9 18 10 18 11 17 11 18 11 18 13 18 12 18 14 
18 13 18 15 17 14 18 16 18 15 18 16 18 17 18 17 
18 17 17 17 18 18 3916 2884 100 MP stroke
18 19 18 18 18 19 18 19 18 19 17 20 18 20 18 20 
18 20 18 20 18 21 18 21 17 20 18 21 18 21 18 21 
18 21 18 21 17 21 18 22 18 21 18 21 18 21 18 21 
18 21 17 20 18 21 18 21 18 20 18 20 18 20 18 20 
17 20 18 19 18 19 18 19 18 18 18 19 18 18 17 17 
18 17 18 17 18 17 18 16 18 15 18 16 17 14 18 15 
18 13 18 14 18 12 18 13 18 11 17 11 18 11 18 10 
18 9 18 8 18 8 17 8 18 6 18 6 18 5 18 5 
18 3 18 3 17 2 18 1 18 1 18 -1 18 -1 18 -2 
18 -3 17 -4 18 -5 18 -6 18 -7 18 -7 18 -9 18 -10 
17 -11 18 -12 18 -13 18 -14 18 -15 18 -16 18 -18 17 -18 
18 -20 18 -21 18 -22 18 -23 18 -25 17 -25 18 -27 18 -29 
18 -29 18 -31 18 -33 2148 2254 100 MP stroke
18 -33 17 -35 18 -37 18 -37 18 -40 18 -40 18 -42 18 -44 
17 -45 18 -47 18 -48 18 -49 18 -52 18 -52 18 -55 17 -56 
18 -57 18 -59 18 -61 18 -63 18 -64 18 -66 17 -68 18 -69 
18 -71 18 -73 18 -75 18 -76 18 -79 17 -80 18 -82 18 -84 
18 -86 18 -88 18 -89 17 -92 18 -94 14 -74 1474 4616 39 MP stroke
/c9 { 0.000000 1.000000 0.000000 sr} bdef
c9
15 -149 18 -166 18 -158 18 -153 18 -145 18 -140 18 -133 17 -127 
18 -122 18 -115 18 -110 18 -104 18 -99 18 -94 17 -89 18 -84 
18 -79 18 -74 18 -69 18 -65 18 -61 17 -57 18 -52 18 -48 
18 -45 18 -41 18 -37 18 -33 17 -31 18 -26 18 -24 18 -21 
18 -17 18 -15 17 -12 18 -9 18 -7 18 -4 18 -2 18 1 
18 2 17 5 18 7 18 9 18 10 18 12 18 14 18 15 
17 17 18 19 18 19 18 21 18 22 18 23 18 24 17 25 
18 26 18 26 18 27 18 28 18 29 18 29 17 29 18 30 
18 30 18 30 18 31 18 30 18 31 17 31 18 30 18 31 
18 30 18 30 18 30 17 30 18 29 18 29 18 28 18 28 
18 28 18 27 17 26 18 26 18 25 18 24 18 24 18 22 
18 22 17 21 18 21 18 19 18 19 18 17 18 17 18 16 
17 14 18 14 18 12 3773 1865 100 MP stroke
18 12 18 11 18 9 18 8 17 8 18 6 18 5 18 4 
18 3 18 1 17 1 18 -1 18 -1 18 -3 18 -4 18 -5 
18 -6 17 -8 18 -8 18 -9 18 -11 18 -12 18 -12 18 -14 
17 -14 18 -16 18 -17 18 -17 18 -19 18 -19 18 -21 17 -21 
18 -22 18 -22 18 -24 18 -24 18 -25 18 -26 17 -26 18 -27 
18 -28 18 -28 18 -28 18 -29 18 -29 17 -30 18 -30 18 -30 
18 -30 18 -31 18 -30 17 -31 18 -31 18 -30 18 -31 18 -30 
18 -30 18 -30 17 -29 18 -29 18 -29 18 -28 18 -27 18 -26 
18 -26 17 -25 18 -24 18 -23 18 -22 18 -21 18 -19 18 -19 
17 -17 18 -15 18 -14 18 -12 18 -10 18 -9 18 -7 17 -5 
18 -2 18 -1 18 2 18 4 18 7 17 9 18 12 18 15 
18 17 18 21 18 24 18 26 17 31 18 33 18 37 18 41 
18 45 18 48 18 52 2005 2782 100 MP stroke
17 57 18 61 18 65 18 69 18 74 18 79 18 84 17 89 
18 94 18 99 18 104 18 110 18 115 18 122 17 127 18 133 
18 140 18 145 18 153 18 158 18 166 15 149 1615 389 23 MP stroke
0 sg
5 -76 18 -263 18 -246 18 -229 17 -213 18 -198 18 -183 18 -169 
18 -156 18 -143 18 -130 17 -118 18 -108 18 -96 18 -86 18 -77 
18 -67 18 -58 17 -50 18 -42 18 -34 18 -28 18 -21 18 -14 
18 -9 17 -3 18 2 18 7 18 11 18 16 18 19 17 22 
18 26 18 29 18 31 18 33 18 36 18 37 17 39 18 41 
18 41 18 43 18 43 18 43 18 44 17 44 18 44 18 44 
18 43 18 43 18 42 18 42 17 41 18 39 18 39 18 37 
18 36 18 34 18 33 17 32 18 29 18 29 18 26 18 24 
18 23 18 21 17 19 18 17 18 15 18 13 18 11 18 9 
17 7 18 6 18 3 18 1 18 -1 18 -3 18 -4 17 -7 
18 -8 18 -10 18 -12 18 -14 18 -15 18 -17 17 -18 18 -20 
18 -22 18 -22 18 -25 18 -25 18 -27 17 -27 18 -29 18 -30 
18 -30 18 -32 18 -32 3719 2227 100 MP stroke
18 -33 17 -33 18 -34 18 -35 18 -34 18 -35 18 -35 17 -36 
18 -35 18 -35 18 -35 18 -34 18 -35 18 -34 17 -33 18 -33 
18 -32 18 -32 18 -30 18 -30 18 -29 17 -27 18 -27 18 -25 
18 -25 18 -22 18 -22 18 -20 17 -18 18 -17 18 -15 18 -14 
18 -12 18 -10 18 -8 17 -7 18 -4 18 -3 18 -1 18 1 
18 3 18 6 17 7 18 9 18 11 18 13 18 15 18 17 
17 19 18 21 18 23 18 24 18 26 18 29 18 29 17 32 
18 33 18 34 18 36 18 37 18 39 18 39 17 41 18 42 
18 42 18 43 18 43 18 44 18 44 17 44 18 44 18 43 
18 43 18 43 18 41 18 41 17 39 18 37 18 36 18 33 
18 31 18 29 17 26 18 22 18 19 18 16 18 11 18 7 
18 2 17 -3 18 -9 18 -14 18 -21 18 -28 18 -34 18 -42 
17 -50 18 -58 18 -67 1952 2123 100 MP stroke
18 -77 18 -86 18 -96 18 -108 17 -118 18 -130 18 -143 18 -156 
18 -169 18 -183 18 -198 17 -213 18 -229 18 -246 18 -263 5 -78 
1679 4616 17 MP stroke
gr

3546 4903 mt 
(x) s
 592 2643 mt  -90 rotate
(T) s
90 rotate
%%IncludeResource: font Helvetica
/Helvetica /ISOLatin1Encoding 96 FMSR

 652 2570 mt  -90 rotate
(N) s
90 rotate
%%IncludeResource: font Helvetica
/Helvetica /ISOLatin1Encoding 120 FMSR

 592 2501 mt  -90 rotate
(\(x\)) s
90 rotate
2710  294 mt 
(Polinomi di Chebyshev N=4, 5, 6) s

end %%Color Dict

eplot
%%EndObject

epage
end

showpage

%%Trailer
%%EOF
