%!PS-Adobe-2.0 EPSF-1.2
%%Creator: MATLAB, The Mathworks, Inc. Version 7.5.0.338 (R2007b). Operating System: Linux 2.6.35-32-generic #67-Ubuntu SMP Mon Mar 5 19:39:49 UTC 2012 x86_64.
%%Title: ./confronto_g_log.eps
%%CreationDate: 04/23/2012  12:09:18
%%DocumentNeededFonts: Helvetica
%%DocumentProcessColors: Cyan Magenta Yellow Black
%%Extensions: CMYK
%%Pages: 1
%%BoundingBox:    84   215   551   591
%%EndComments

%%BeginProlog
% MathWorks dictionary
/MathWorks 160 dict begin
% definition operators
/bdef {bind def} bind def
/ldef {load def} bind def
/xdef {exch def} bdef
/xstore {exch store} bdef
% operator abbreviations
/c  /clip ldef
/cc /concat ldef
/cp /closepath ldef
/gr /grestore ldef
/gs /gsave ldef
/mt /moveto ldef
/np /newpath ldef
/cm /currentmatrix ldef
/sm /setmatrix ldef
/rm /rmoveto ldef
/rl /rlineto ldef
/s {show newpath} bdef
/sc {setcmykcolor} bdef
/sr /setrgbcolor ldef
/sg /setgray ldef
/w /setlinewidth ldef
/j /setlinejoin ldef
/cap /setlinecap ldef
/rc {rectclip} bdef
/rf {rectfill} bdef
% page state control
/pgsv () def
/bpage {/pgsv save def} bdef
/epage {pgsv restore} bdef
/bplot /gsave ldef
/eplot {stroke grestore} bdef
% orientation switch
/portraitMode 0 def /landscapeMode 1 def /rotateMode 2 def
% coordinate system mappings
/dpi2point 0 def
% font control
/FontSize 0 def
/FMS {/FontSize xstore findfont [FontSize 0 0 FontSize neg 0 0]
  makefont setfont} bdef
/reencode {exch dup where {pop load} {pop StandardEncoding} ifelse
  exch dup 3 1 roll findfont dup length dict begin
  { 1 index /FID ne {def}{pop pop} ifelse } forall
  /Encoding exch def currentdict end definefont pop} bdef
/isroman {findfont /CharStrings get /Agrave known} bdef
/FMSR {3 1 roll 1 index dup isroman {reencode} {pop pop} ifelse
  exch FMS} bdef
/csm {1 dpi2point div -1 dpi2point div scale neg translate
 dup landscapeMode eq {pop -90 rotate}
  {rotateMode eq {90 rotate} if} ifelse} bdef
% line types: solid, dotted, dashed, dotdash
/SO { [] 0 setdash } bdef
/DO { [.5 dpi2point mul 4 dpi2point mul] 0 setdash } bdef
/DA { [6 dpi2point mul] 0 setdash } bdef
/DD { [.5 dpi2point mul 4 dpi2point mul 6 dpi2point mul 4
  dpi2point mul] 0 setdash } bdef
% macros for lines and objects
/L {lineto stroke} bdef
/MP {3 1 roll moveto 1 sub {rlineto} repeat} bdef
/AP {{rlineto} repeat} bdef
/PDlw -1 def
/W {/PDlw currentlinewidth def setlinewidth} def
/PP {closepath eofill} bdef
/DP {closepath stroke} bdef
/MR {4 -2 roll moveto dup  0 exch rlineto exch 0 rlineto
  neg 0 exch rlineto closepath} bdef
/FR {MR stroke} bdef
/PR {MR fill} bdef
/L1i {{currentfile picstr readhexstring pop} image} bdef
/tMatrix matrix def
/MakeOval {newpath tMatrix currentmatrix pop translate scale
0 0 1 0 360 arc tMatrix setmatrix} bdef
/FO {MakeOval stroke} bdef
/PO {MakeOval fill} bdef
/PD {currentlinewidth 2 div 0 360 arc fill
   PDlw -1 eq not {PDlw w /PDlw -1 def} if} def
/FA {newpath tMatrix currentmatrix pop translate scale
  0 0 1 5 -2 roll arc tMatrix setmatrix stroke} bdef
/PA {newpath tMatrix currentmatrix pop	translate 0 0 moveto scale
  0 0 1 5 -2 roll arc closepath tMatrix setmatrix fill} bdef
/FAn {newpath tMatrix currentmatrix pop translate scale
  0 0 1 5 -2 roll arcn tMatrix setmatrix stroke} bdef
/PAn {newpath tMatrix currentmatrix pop translate 0 0 moveto scale
  0 0 1 5 -2 roll arcn closepath tMatrix setmatrix fill} bdef
/vradius 0 def /hradius 0 def /lry 0 def
/lrx 0 def /uly 0 def /ulx 0 def /rad 0 def
/MRR {/vradius xdef /hradius xdef /lry xdef /lrx xdef /uly xdef
  /ulx xdef newpath tMatrix currentmatrix pop ulx hradius add uly
  vradius add translate hradius vradius scale 0 0 1 180 270 arc 
  tMatrix setmatrix lrx hradius sub uly vradius add translate
  hradius vradius scale 0 0 1 270 360 arc tMatrix setmatrix
  lrx hradius sub lry vradius sub translate hradius vradius scale
  0 0 1 0 90 arc tMatrix setmatrix ulx hradius add lry vradius sub
  translate hradius vradius scale 0 0 1 90 180 arc tMatrix setmatrix
  closepath} bdef
/FRR {MRR stroke } bdef
/PRR {MRR fill } bdef
/MlrRR {/lry xdef /lrx xdef /uly xdef /ulx xdef /rad lry uly sub 2 div def
  newpath tMatrix currentmatrix pop ulx rad add uly rad add translate
  rad rad scale 0 0 1 90 270 arc tMatrix setmatrix lrx rad sub lry rad
  sub translate rad rad scale 0 0 1 270 90 arc tMatrix setmatrix
  closepath} bdef
/FlrRR {MlrRR stroke } bdef
/PlrRR {MlrRR fill } bdef
/MtbRR {/lry xdef /lrx xdef /uly xdef /ulx xdef /rad lrx ulx sub 2 div def
  newpath tMatrix currentmatrix pop ulx rad add uly rad add translate
  rad rad scale 0 0 1 180 360 arc tMatrix setmatrix lrx rad sub lry rad
  sub translate rad rad scale 0 0 1 0 180 arc tMatrix setmatrix
  closepath} bdef
/FtbRR {MtbRR stroke } bdef
/PtbRR {MtbRR fill } bdef
/stri 6 array def /dtri 6 array def
/smat 6 array def /dmat 6 array def
/tmat1 6 array def /tmat2 6 array def /dif 3 array def
/asub {/ind2 exch def /ind1 exch def dup dup
  ind1 get exch ind2 get sub exch } bdef
/tri_to_matrix {
  2 0 asub 3 1 asub 4 0 asub 5 1 asub
  dup 0 get exch 1 get 7 -1 roll astore } bdef
/compute_transform {
  dmat dtri tri_to_matrix tmat1 invertmatrix 
  smat stri tri_to_matrix tmat2 concatmatrix } bdef
/ds {stri astore pop} bdef
/dt {dtri astore pop} bdef
/db {2 copy /cols xdef /rows xdef mul dup 3 mul string
  currentfile exch readhexstring pop
  dup 0 3 index getinterval /rbmap xdef
  dup 2 index dup getinterval /gbmap xdef
  1 index dup 2 mul exch getinterval /bbmap xdef pop pop}bdef
/it {gs np dtri aload pop moveto lineto lineto cp c
  cols rows 8 compute_transform 
  rbmap gbmap bbmap true 3 colorimage gr}bdef
/il {newpath moveto lineto stroke}bdef
currentdict end def
%%EndProlog

%%BeginSetup
MathWorks begin

0 cap

end
%%EndSetup

%%Page: 1 1
%%BeginPageSetup
%%PageBoundingBox:    84   215   551   591
MathWorks begin
bpage
%%EndPageSetup

%%BeginObject: obj1
bplot

/dpi2point 12 def
portraitMode 0216 7344 csm

  798   247  5606  4514 MR c np
85 dict begin %Colortable dictionary
/c0 { 0.000000 0.000000 0.000000 sr} bdef
/c1 { 1.000000 1.000000 1.000000 sr} bdef
/c2 { 0.900000 0.000000 0.000000 sr} bdef
/c3 { 0.000000 0.820000 0.000000 sr} bdef
/c4 { 0.000000 0.000000 0.800000 sr} bdef
/c5 { 0.910000 0.820000 0.320000 sr} bdef
/c6 { 1.000000 0.260000 0.820000 sr} bdef
/c7 { 0.000000 0.820000 0.820000 sr} bdef
c0
1 j
1 sg
   0    0 6913 5186 PR
6 w
0 4226 5356 0 0 -4226 899 4615 4 MP
PP
-5356 0 0 4226 5356 0 0 -4226 899 4615 5 MP stroke
4 w
DO
SO
6 w
0 sg
 899 4615 mt 6255 4615 L
 899  389 mt 6255  389 L
 899 4615 mt  899  389 L
6255 4615 mt 6255  389 L
 899 4615 mt 6255 4615 L
 899 4615 mt  899  389 L
 899 4615 mt  899 4561 L
 899  389 mt  899  442 L
%%IncludeResource: font Helvetica
/Helvetica /ISOLatin1Encoding 120 FMSR

 866 4760 mt 
(0) s
1434 4615 mt 1434 4561 L
1434  389 mt 1434  442 L
1368 4760 mt 
(10) s
1970 4615 mt 1970 4561 L
1970  389 mt 1970  442 L
1904 4760 mt 
(20) s
2505 4615 mt 2505 4561 L
2505  389 mt 2505  442 L
2439 4760 mt 
(30) s
3041 4615 mt 3041 4561 L
3041  389 mt 3041  442 L
2975 4760 mt 
(40) s
3577 4615 mt 3577 4561 L
3577  389 mt 3577  442 L
3511 4760 mt 
(50) s
4112 4615 mt 4112 4561 L
4112  389 mt 4112  442 L
4046 4760 mt 
(60) s
4648 4615 mt 4648 4561 L
4648  389 mt 4648  442 L
4582 4760 mt 
(70) s
5183 4615 mt 5183 4561 L
5183  389 mt 5183  442 L
5117 4760 mt 
(80) s
5719 4615 mt 5719 4561 L
5719  389 mt 5719  442 L
5653 4760 mt 
(90) s
6255 4615 mt 6255 4561 L
6255  389 mt 6255  442 L
6155 4760 mt 
(100) s
 899 4615 mt  952 4615 L
6255 4615 mt 6201 4615 L
 798 4659 mt 
(0) s
 899 3910 mt  952 3910 L
6255 3910 mt 6201 3910 L
 798 3954 mt 
(1) s
 899 3206 mt  952 3206 L
6255 3206 mt 6201 3206 L
 798 3250 mt 
(2) s
 899 2502 mt  952 2502 L
6255 2502 mt 6201 2502 L
 798 2546 mt 
(3) s
 899 1797 mt  952 1797 L
6255 1797 mt 6201 1797 L
 798 1841 mt 
(4) s
 899 1093 mt  952 1093 L
6255 1093 mt 6201 1093 L
 798 1137 mt 
(5) s
 899  389 mt  952  389 L
6255  389 mt 6201  389 L
 798  433 mt 
(6) s
 899 4615 mt 6255 4615 L
 899  389 mt 6255  389 L
 899 4615 mt  899  389 L
6255 4615 mt 6255  389 L
gs 899 389 5357 4227 MR c np
/c8 { 0.000000 0.000000 1.000000 sr} bdef
c8
-1 311 0 38 -1 27 0 22 -1 19 0 18 -1 16 -1 15 
0 14 -1 13 -1 13 0 13 -1 12 -1 11 -1 12 0 11 
-1 11 -1 11 -1 11 0 11 -1 10 -1 11 -1 10 -1 11 
-1 10 -1 10 -1 10 -1 11 -1 10 -1 10 -1 10 -1 11 
-1 10 -2 10 -1 10 -1 11 -2 10 -1 11 -1 10 -2 11 
-1 11 -2 10 -1 11 -2 11 -2 12 -2 11 -2 11 -2 12 
-2 11 -2 12 -2 12 -2 12 -2 12 -3 13 -3 12 -2 13 
-3 13 -3 13 -3 14 -3 14 -4 14 -3 14 -4 15 -4 15 
-5 15 -4 16 -5 16 -5 17 -5 17 -6 17 -6 18 -7 18 
-7 19 -8 20 -8 21 -9 21 -9 22 -11 22 -12 24 -12 25 
-14 26 -16 27 -18 29 -19 30 -23 32 -25 34 -30 37 -34 39 
-40 42 -49 46 -60 51 -74 57 -96 63 -127 73 -179 86 -268 105 
-446 133 -893 187 -2678 316 6255 1780 100 MP stroke
DA
/c9 { 0.000000 0.500000 0.000000 sr} bdef
c9
-1 8 0 7 -1 7 0 7 -1 8 0 7 -1 8 -1 7 
0 8 -1 8 -1 8 0 8 -1 8 -1 8 -1 8 0 8 
-1 9 -1 8 -1 9 0 9 -1 9 -1 8 -1 10 -1 9 
-1 9 -1 10 -1 9 -1 10 -1 10 -1 10 -1 10 -1 10 
-1 11 -2 10 -1 11 -1 11 -2 11 -1 11 -1 12 -2 11 
-1 12 -2 12 -1 12 -2 13 -2 13 -2 13 -2 13 -2 13 
-2 14 -2 14 -2 14 -2 14 -2 15 -3 15 -3 16 -2 16 
-3 16 -3 17 -3 16 -3 18 -4 18 -3 18 -4 19 -4 19 
-5 20 -4 20 -5 21 -5 22 -5 22 -6 23 -6 24 -7 25 
-7 26 -8 26 -8 28 -9 29 -9 30 -11 31 -12 33 -12 34 
-14 36 -16 38 -18 41 -19 42 -23 46 -25 48 -30 52 -34 57 
-40 61 -49 67 -60 74 -74 83 -96 95 -127 108 -179 128 -268 158 
-446 202 -893 286 -2678 488 6255 1371 100 MP stroke
DD
/c10 { 1.000000 0.000000 0.000000 sr} bdef
c10
-1 101 0 42 -1 32 0 28 -1 25 0 23 -1 21 -1 20 
0 19 -1 19 -1 17 0 17 -1 17 -1 16 -1 16 0 16 
-1 15 -1 15 -1 15 0 15 -1 14 -1 15 -1 14 -1 14 
-1 15 -1 14 -1 14 -1 14 -1 14 -1 14 -1 14 -1 15 
-1 14 -2 14 -1 14 -1 14 -2 15 -1 14 -1 15 -2 14 
-1 15 -2 15 -1 15 -2 15 -2 15 -2 16 -2 15 -2 16 
-2 16 -2 16 -2 16 -2 17 -2 17 -3 17 -3 17 -2 18 
-3 18 -3 18 -3 19 -3 19 -4 19 -3 20 -4 21 -4 20 
-5 21 -4 22 -5 23 -5 22 -5 24 -6 24 -6 25 -7 26 
-7 27 -8 27 -8 29 -9 30 -9 30 -11 32 -12 34 -12 35 
-14 37 -16 39 -18 41 -19 43 -23 46 -25 49 -30 53 -34 57 
-40 61 -49 68 -60 74 -74 84 -96 94 -127 109 -179 128 -268 158 
-446 202 -893 286 -2678 488 6255 883 100 MP stroke
gr

c10
DD
0 sg
 882 4658 mt 
( ) s
6239  431 mt 
( ) s
SO
1 sg
0 480 966 0 0 -480 5229 4556 4 MP
PP
-966 0 0 480 966 0 0 -480 5229 4556 5 MP stroke
4 w
DO
SO
6 w
0 sg
5229 4556 mt 6195 4556 L
5229 4076 mt 6195 4076 L
5229 4556 mt 5229 4076 L
6195 4556 mt 6195 4076 L
5229 4556 mt 6195 4556 L
5229 4556 mt 5229 4076 L
5229 4556 mt 6195 4556 L
5229 4076 mt 6195 4076 L
5229 4556 mt 5229 4076 L
6195 4556 mt 6195 4076 L
5689 4209 mt 
(G\(x\)) s
gs 5229 4076 967 481 MR c np
c8
354 0 5299 4166 2 MP stroke
gr

c8
0 sg
5689 4359 mt 
(log\(x\)) s
gs 5229 4076 967 481 MR c np
DA
c9
354 0 5299 4316 2 MP stroke
SO
gr

c9
0 sg
5689 4508 mt 
(acosh\(x\)) s
gs 5229 4076 967 481 MR c np
DD
c10
354 0 5299 4465 2 MP stroke
SO
gr

c10

end %%Color Dict

eplot
%%EndObject

epage
end

showpage

%%Trailer
%%EOF
