%!PS-Adobe-2.0 EPSF-1.2
%%Creator: MATLAB, The Mathworks, Inc. Version 7.5.0.338 (R2007b). Operating System: Linux 2.6.35-32-generic #67-Ubuntu SMP Mon Mar 5 19:39:49 UTC 2012 x86_64.
%%Title: ./polinomi_cheby_quadro.eps
%%CreationDate: 04/20/2012  14:12:07
%%DocumentNeededFonts: Helvetica
%%DocumentProcessColors: Cyan Magenta Yellow Black
%%Extensions: CMYK
%%Pages: 1
%%BoundingBox:    52   199   550   602
%%EndComments

%%BeginProlog
% MathWorks dictionary
/MathWorks 160 dict begin
% definition operators
/bdef {bind def} bind def
/ldef {load def} bind def
/xdef {exch def} bdef
/xstore {exch store} bdef
% operator abbreviations
/c  /clip ldef
/cc /concat ldef
/cp /closepath ldef
/gr /grestore ldef
/gs /gsave ldef
/mt /moveto ldef
/np /newpath ldef
/cm /currentmatrix ldef
/sm /setmatrix ldef
/rm /rmoveto ldef
/rl /rlineto ldef
/s {show newpath} bdef
/sc {setcmykcolor} bdef
/sr /setrgbcolor ldef
/sg /setgray ldef
/w /setlinewidth ldef
/j /setlinejoin ldef
/cap /setlinecap ldef
/rc {rectclip} bdef
/rf {rectfill} bdef
% page state control
/pgsv () def
/bpage {/pgsv save def} bdef
/epage {pgsv restore} bdef
/bplot /gsave ldef
/eplot {stroke grestore} bdef
% orientation switch
/portraitMode 0 def /landscapeMode 1 def /rotateMode 2 def
% coordinate system mappings
/dpi2point 0 def
% font control
/FontSize 0 def
/FMS {/FontSize xstore findfont [FontSize 0 0 FontSize neg 0 0]
  makefont setfont} bdef
/reencode {exch dup where {pop load} {pop StandardEncoding} ifelse
  exch dup 3 1 roll findfont dup length dict begin
  { 1 index /FID ne {def}{pop pop} ifelse } forall
  /Encoding exch def currentdict end definefont pop} bdef
/isroman {findfont /CharStrings get /Agrave known} bdef
/FMSR {3 1 roll 1 index dup isroman {reencode} {pop pop} ifelse
  exch FMS} bdef
/csm {1 dpi2point div -1 dpi2point div scale neg translate
 dup landscapeMode eq {pop -90 rotate}
  {rotateMode eq {90 rotate} if} ifelse} bdef
% line types: solid, dotted, dashed, dotdash
/SO { [] 0 setdash } bdef
/DO { [.5 dpi2point mul 4 dpi2point mul] 0 setdash } bdef
/DA { [6 dpi2point mul] 0 setdash } bdef
/DD { [.5 dpi2point mul 4 dpi2point mul 6 dpi2point mul 4
  dpi2point mul] 0 setdash } bdef
% macros for lines and objects
/L {lineto stroke} bdef
/MP {3 1 roll moveto 1 sub {rlineto} repeat} bdef
/AP {{rlineto} repeat} bdef
/PDlw -1 def
/W {/PDlw currentlinewidth def setlinewidth} def
/PP {closepath eofill} bdef
/DP {closepath stroke} bdef
/MR {4 -2 roll moveto dup  0 exch rlineto exch 0 rlineto
  neg 0 exch rlineto closepath} bdef
/FR {MR stroke} bdef
/PR {MR fill} bdef
/L1i {{currentfile picstr readhexstring pop} image} bdef
/tMatrix matrix def
/MakeOval {newpath tMatrix currentmatrix pop translate scale
0 0 1 0 360 arc tMatrix setmatrix} bdef
/FO {MakeOval stroke} bdef
/PO {MakeOval fill} bdef
/PD {currentlinewidth 2 div 0 360 arc fill
   PDlw -1 eq not {PDlw w /PDlw -1 def} if} def
/FA {newpath tMatrix currentmatrix pop translate scale
  0 0 1 5 -2 roll arc tMatrix setmatrix stroke} bdef
/PA {newpath tMatrix currentmatrix pop	translate 0 0 moveto scale
  0 0 1 5 -2 roll arc closepath tMatrix setmatrix fill} bdef
/FAn {newpath tMatrix currentmatrix pop translate scale
  0 0 1 5 -2 roll arcn tMatrix setmatrix stroke} bdef
/PAn {newpath tMatrix currentmatrix pop translate 0 0 moveto scale
  0 0 1 5 -2 roll arcn closepath tMatrix setmatrix fill} bdef
/vradius 0 def /hradius 0 def /lry 0 def
/lrx 0 def /uly 0 def /ulx 0 def /rad 0 def
/MRR {/vradius xdef /hradius xdef /lry xdef /lrx xdef /uly xdef
  /ulx xdef newpath tMatrix currentmatrix pop ulx hradius add uly
  vradius add translate hradius vradius scale 0 0 1 180 270 arc 
  tMatrix setmatrix lrx hradius sub uly vradius add translate
  hradius vradius scale 0 0 1 270 360 arc tMatrix setmatrix
  lrx hradius sub lry vradius sub translate hradius vradius scale
  0 0 1 0 90 arc tMatrix setmatrix ulx hradius add lry vradius sub
  translate hradius vradius scale 0 0 1 90 180 arc tMatrix setmatrix
  closepath} bdef
/FRR {MRR stroke } bdef
/PRR {MRR fill } bdef
/MlrRR {/lry xdef /lrx xdef /uly xdef /ulx xdef /rad lry uly sub 2 div def
  newpath tMatrix currentmatrix pop ulx rad add uly rad add translate
  rad rad scale 0 0 1 90 270 arc tMatrix setmatrix lrx rad sub lry rad
  sub translate rad rad scale 0 0 1 270 90 arc tMatrix setmatrix
  closepath} bdef
/FlrRR {MlrRR stroke } bdef
/PlrRR {MlrRR fill } bdef
/MtbRR {/lry xdef /lrx xdef /uly xdef /ulx xdef /rad lrx ulx sub 2 div def
  newpath tMatrix currentmatrix pop ulx rad add uly rad add translate
  rad rad scale 0 0 1 180 360 arc tMatrix setmatrix lrx rad sub lry rad
  sub translate rad rad scale 0 0 1 0 180 arc tMatrix setmatrix
  closepath} bdef
/FtbRR {MtbRR stroke } bdef
/PtbRR {MtbRR fill } bdef
/stri 6 array def /dtri 6 array def
/smat 6 array def /dmat 6 array def
/tmat1 6 array def /tmat2 6 array def /dif 3 array def
/asub {/ind2 exch def /ind1 exch def dup dup
  ind1 get exch ind2 get sub exch } bdef
/tri_to_matrix {
  2 0 asub 3 1 asub 4 0 asub 5 1 asub
  dup 0 get exch 1 get 7 -1 roll astore } bdef
/compute_transform {
  dmat dtri tri_to_matrix tmat1 invertmatrix 
  smat stri tri_to_matrix tmat2 concatmatrix } bdef
/ds {stri astore pop} bdef
/dt {dtri astore pop} bdef
/db {2 copy /cols xdef /rows xdef mul dup 3 mul string
  currentfile exch readhexstring pop
  dup 0 3 index getinterval /rbmap xdef
  dup 2 index dup getinterval /gbmap xdef
  1 index dup 2 mul exch getinterval /bbmap xdef pop pop}bdef
/it {gs np dtri aload pop moveto lineto lineto cp c
  cols rows 8 compute_transform 
  rbmap gbmap bbmap true 3 colorimage gr}bdef
/il {newpath moveto lineto stroke}bdef
currentdict end def
%%EndProlog

%%BeginSetup
MathWorks begin

0 cap

end
%%EndSetup

%%Page: 1 1
%%BeginPageSetup
%%PageBoundingBox:    52   199   550   602
MathWorks begin
bpage
%%EndPageSetup

%%BeginObject: obj1
bplot

/dpi2point 12 def
portraitMode 0216 7344 csm

  418   110  5969  4845 MR c np
86 dict begin %Colortable dictionary
/c0 { 0.000000 0.000000 0.000000 sr} bdef
/c1 { 1.000000 1.000000 1.000000 sr} bdef
/c2 { 0.900000 0.000000 0.000000 sr} bdef
/c3 { 0.000000 0.820000 0.000000 sr} bdef
/c4 { 0.000000 0.000000 0.800000 sr} bdef
/c5 { 0.910000 0.820000 0.320000 sr} bdef
/c6 { 1.000000 0.260000 0.820000 sr} bdef
/c7 { 0.000000 0.820000 0.820000 sr} bdef
c0
1 j
1 sg
   0    0 6913 5186 PR
6 w
0 4226 5356 0 0 -4226 899 4615 4 MP
PP
-5356 0 0 4226 5356 0 0 -4226 899 4615 5 MP stroke
4 w
DO
0 sg
 899 4615 mt  899  389 L
 899  389 mt  899  389 L
1791 4615 mt 1791  389 L
1791  389 mt 1791  389 L
2684 4615 mt 2684  389 L
2684  389 mt 2684  389 L
3577 4615 mt 3577  389 L
3577  389 mt 3577  389 L
4469 4615 mt 4469  389 L
4469  389 mt 4469  389 L
5362 4615 mt 5362  389 L
5362  389 mt 5362  389 L
6255 4615 mt 6255  389 L
6255  389 mt 6255  389 L
 899 4615 mt 6255 4615 L
6255 4615 mt 6255 4615 L
 899 3910 mt 6255 3910 L
6255 3910 mt 6255 3910 L
 899 3206 mt 6255 3206 L
6255 3206 mt 6255 3206 L
 899 2502 mt 6255 2502 L
6255 2502 mt 6255 2502 L
 899 1797 mt 6255 1797 L
6255 1797 mt 6255 1797 L
 899 1093 mt 6255 1093 L
6255 1093 mt 6255 1093 L
 899  389 mt 6255  389 L
6255  389 mt 6255  389 L
SO
6 w
 899 4615 mt 6255 4615 L
 899  389 mt 6255  389 L
 899 4615 mt  899  389 L
6255 4615 mt 6255  389 L
 899 4615 mt 6255 4615 L
 899 4615 mt  899  389 L
 899 4615 mt  899 4561 L
 899  389 mt  899  442 L
%%IncludeResource: font Helvetica
/Helvetica /ISOLatin1Encoding 120 FMSR

 746 4760 mt 
(-1.5) s
1791 4615 mt 1791 4561 L
1791  389 mt 1791  442 L
1688 4760 mt 
(-1) s
2684 4615 mt 2684 4561 L
2684  389 mt 2684  442 L
2531 4760 mt 
(-0.5) s
3577 4615 mt 3577 4561 L
3577  389 mt 3577  442 L
3544 4760 mt 
(0) s
4469 4615 mt 4469 4561 L
4469  389 mt 4469  442 L
4386 4760 mt 
(0.5) s
5362 4615 mt 5362 4561 L
5362  389 mt 5362  442 L
5329 4760 mt 
(1) s
6255 4615 mt 6255 4561 L
6255  389 mt 6255  442 L
6172 4760 mt 
(1.5) s
 899 4615 mt  952 4615 L
6255 4615 mt 6201 4615 L
 728 4659 mt 
(-1) s
 899 3910 mt  952 3910 L
6255 3910 mt 6201 3910 L
 798 3954 mt 
(0) s
 899 3206 mt  952 3206 L
6255 3206 mt 6201 3206 L
 798 3250 mt 
(1) s
 899 2502 mt  952 2502 L
6255 2502 mt 6201 2502 L
 798 2546 mt 
(2) s
 899 1797 mt  952 1797 L
6255 1797 mt 6201 1797 L
 798 1841 mt 
(3) s
 899 1093 mt  952 1093 L
6255 1093 mt 6201 1093 L
 798 1137 mt 
(4) s
 899  389 mt  952  389 L
6255  389 mt 6201  389 L
 798  433 mt 
(5) s
 899 4615 mt 6255 4615 L
 899  389 mt 6255  389 L
 899 4615 mt  899  389 L
6255 4615 mt 6255  389 L
gs 899 389 5357 4227 MR c np
/c8 { 1.000000 0.000000 0.000000 sr} bdef
c8
14 -294 18 -342 17 -315 18 -291 18 -267 18 -245 18 -223 18 -204 
18 -185 17 -166 18 -150 18 -135 18 -119 18 -106 18 -93 18 -80 
17 -70 18 -58 18 -49 18 -41 18 -31 18 -24 18 -17 17 -11 
18 -5 18 1 18 5 18 10 18 13 18 16 17 20 18 22 
18 24 18 26 18 28 18 28 17 30 18 30 18 30 18 30 
18 30 18 30 18 29 17 29 18 27 18 27 18 26 18 24 
18 23 18 21 17 20 18 18 18 16 18 15 18 13 18 12 
18 10 17 7 18 6 18 5 18 2 18 1 18 -1 18 -2 
17 -4 18 -6 18 -7 18 -9 18 -10 18 -11 18 -13 17 -14 
18 -14 18 -16 18 -17 18 -18 18 -19 17 -19 18 -20 18 -20 
18 -21 18 -21 18 -22 18 -22 17 -22 18 -21 18 -22 18 -22 
18 -21 18 -22 18 -21 17 -20 18 -20 18 -19 18 -19 18 -18 
18 -17 18 -16 17 -16 3809 3808 100 MP stroke
18 -14 18 -14 18 -12 18 -12 18 -10 18 -10 17 -8 18 -6 
18 -6 18 -4 18 -4 18 -2 17 0 18 0 18 2 18 4 
18 4 18 6 18 6 17 8 18 10 18 10 18 12 18 12 
18 14 18 14 17 16 18 16 18 17 18 18 18 19 18 19 
18 20 17 20 18 21 18 22 18 21 18 22 18 22 18 21 
17 22 18 22 18 22 18 21 18 21 18 20 18 20 17 19 
18 19 18 18 18 17 18 16 18 14 17 14 18 13 18 11 
18 10 18 9 18 7 18 6 17 4 18 2 18 1 18 -1 
18 -2 18 -5 18 -6 17 -7 18 -10 18 -12 18 -13 18 -15 
18 -16 18 -18 17 -20 18 -21 18 -23 18 -24 18 -26 18 -27 
18 -27 17 -29 18 -29 18 -30 18 -30 18 -30 18 -30 17 -30 
18 -30 18 -28 18 -28 18 -26 18 -24 18 -22 17 -20 18 -16 
18 -13 18 -10 18 -5 2041 3909 100 MP stroke
18 -1 18 5 17 11 18 17 18 24 18 31 18 41 18 49 
18 58 17 70 18 80 18 93 18 106 18 119 18 135 18 150 
17 166 18 185 18 204 18 223 18 245 18 267 18 291 17 315 
18 342 14 294 1581 389 27 MP stroke
/c9 { 0.000000 1.000000 0.000000 sr} bdef
c9
10 -382 18 -586 18 -503 18 -430 17 -363 18 -303 18 -250 18 -202 
18 -161 18 -124 18 -92 17 -63 18 -40 18 -19 18 -2 18 12 
18 24 18 34 17 40 18 46 18 49 18 51 18 51 18 51 
18 50 17 47 18 45 18 40 18 37 18 32 18 28 17 23 
18 18 18 13 18 8 18 4 18 -1 18 -5 17 -10 18 -13 
18 -17 18 -20 18 -23 18 -26 18 -27 17 -30 18 -31 18 -33 
18 -33 18 -34 18 -34 18 -34 17 -33 18 -33 18 -32 18 -30 
18 -29 18 -27 18 -26 17 -23 18 -21 18 -19 18 -17 18 -13 
18 -12 18 -8 17 -6 18 -3 18 -1 18 2 18 5 18 7 
17 9 18 12 18 14 18 16 18 19 18 20 18 21 17 23 
18 25 18 26 18 26 18 28 18 28 18 28 17 29 18 29 
18 28 18 28 18 28 18 27 18 26 17 25 18 24 18 23 
18 21 18 20 18 17 3719 3276 100 MP stroke
18 16 17 14 18 12 18 10 18 8 18 6 18 3 17 1 
18 -1 18 -3 18 -6 18 -8 18 -10 18 -12 17 -14 18 -16 
18 -17 18 -20 18 -21 18 -23 18 -24 17 -25 18 -26 18 -27 
18 -28 18 -28 18 -28 18 -29 17 -29 18 -28 18 -28 18 -28 
18 -26 18 -26 18 -25 17 -23 18 -21 18 -20 18 -19 18 -16 
18 -14 18 -12 17 -9 18 -7 18 -5 18 -2 18 1 18 3 
17 6 18 8 18 12 18 13 18 17 18 19 18 21 17 23 
18 26 18 27 18 29 18 30 18 32 18 33 17 33 18 34 
18 34 18 34 18 33 18 33 18 31 17 30 18 27 18 26 
18 23 18 20 18 17 18 13 17 10 18 5 18 1 18 -4 
18 -8 18 -13 17 -18 18 -23 18 -28 18 -32 18 -37 18 -40 
18 -45 17 -47 18 -50 18 -51 18 -51 18 -51 18 -49 18 -46 
17 -40 18 -34 18 -24 1952 3897 100 MP stroke
18 -12 18 2 18 19 18 40 17 63 18 92 18 124 18 161 
18 202 18 250 18 303 17 363 18 430 18 503 18 586 10 382 
1674 389 17 MP stroke
0 sg
3 -207 18 -920 17 -721 18 -555 18 -414 18 -297 18 -203 18 -125 
18 -63 17 -16 18 20 18 46 18 63 18 74 18 78 18 79 
17 75 18 68 18 60 18 50 18 40 18 28 18 17 17 6 
18 -4 18 -13 18 -22 18 -30 18 -36 17 -40 18 -45 18 -48 
18 -50 18 -50 18 -49 18 -48 17 -46 18 -44 18 -39 18 -35 
18 -31 18 -25 18 -21 17 -15 18 -9 18 -4 18 1 18 7 
18 12 18 16 17 21 18 25 18 28 18 32 18 34 18 36 
18 38 17 39 18 39 18 40 18 39 18 38 18 37 18 35 
17 33 18 31 18 27 18 25 18 21 18 18 17 13 18 11 
18 6 18 2 18 -1 18 -6 18 -9 17 -13 18 -16 18 -19 
18 -23 18 -25 18 -28 18 -29 17 -32 18 -33 18 -35 18 -35 
18 -35 18 -36 18 -35 17 -35 18 -34 18 -32 18 -31 18 -29 
18 -26 18 -24 17 -22 3684 3849 100 MP stroke
18 -18 18 -15 18 -12 18 -9 18 -5 17 -2 18 2 18 5 
18 9 18 12 18 15 18 18 17 22 18 24 18 26 18 29 
18 31 18 32 18 34 17 35 18 35 18 36 18 35 18 35 
18 35 18 33 17 32 18 29 18 28 18 25 18 23 18 19 
18 16 17 13 18 9 18 6 18 1 18 -2 18 -6 18 -11 
17 -13 18 -18 18 -21 18 -25 18 -27 18 -31 17 -33 18 -35 
18 -37 18 -38 18 -39 18 -40 18 -39 17 -39 18 -38 18 -36 
18 -34 18 -32 18 -28 18 -25 17 -21 18 -16 18 -12 18 -7 
18 -1 18 4 18 9 17 15 18 21 18 25 18 31 18 35 
18 39 18 44 17 46 18 48 18 49 18 50 18 50 18 48 
17 45 18 40 18 36 18 30 18 22 18 13 18 4 17 -6 
18 -17 18 -28 18 -40 18 -50 18 -60 18 -68 17 -75 18 -79 
18 -78 18 -74 18 -63 1916 3844 100 MP stroke
18 -46 18 -20 17 16 18 63 18 125 18 203 18 297 18 414 
18 555 17 721 18 920 3 207 1717 389 13 MP stroke
gr

 592 2643 mt  -90 rotate
(T) s
90 rotate
%%IncludeResource: font Helvetica
/Helvetica /ISOLatin1Encoding 96 FMSR

 652 2570 mt  -90 rotate
(N) s
90 rotate
 532 2570 mt  -90 rotate
(2) s
90 rotate
%%IncludeResource: font Helvetica
/Helvetica /ISOLatin1Encoding 120 FMSR

 592 2501 mt  -90 rotate
(\(x\)) s
90 rotate
3546 4903 mt 
(x) s
2351  294 mt 
(Quadrato dei polinomi di Chebyshev N=4, 5, 6) s

end %%Color Dict

eplot
%%EndObject

epage
end

showpage

%%Trailer
%%EOF
