%!PS-Adobe-2.0 EPSF-1.2
%%Creator: MATLAB, The Mathworks, Inc. Version 7.5.0.338 (R2007b). Operating System: Linux 2.6.35-32-generic #67-Ubuntu SMP Mon Mar 5 19:39:49 UTC 2012 x86_64.
%%Title: ./poli_q_costante.eps
%%CreationDate: 04/23/2012  16:53:56
%%DocumentNeededFonts: Helvetica
%%DocumentProcessColors: Cyan Magenta Yellow Black
%%Extensions: CMYK
%%Pages: 1
%%BoundingBox:    60   198   546   602
%%EndComments

%%BeginProlog
% MathWorks dictionary
/MathWorks 160 dict begin
% definition operators
/bdef {bind def} bind def
/ldef {load def} bind def
/xdef {exch def} bdef
/xstore {exch store} bdef
% operator abbreviations
/c  /clip ldef
/cc /concat ldef
/cp /closepath ldef
/gr /grestore ldef
/gs /gsave ldef
/mt /moveto ldef
/np /newpath ldef
/cm /currentmatrix ldef
/sm /setmatrix ldef
/rm /rmoveto ldef
/rl /rlineto ldef
/s {show newpath} bdef
/sc {setcmykcolor} bdef
/sr /setrgbcolor ldef
/sg /setgray ldef
/w /setlinewidth ldef
/j /setlinejoin ldef
/cap /setlinecap ldef
/rc {rectclip} bdef
/rf {rectfill} bdef
% page state control
/pgsv () def
/bpage {/pgsv save def} bdef
/epage {pgsv restore} bdef
/bplot /gsave ldef
/eplot {stroke grestore} bdef
% orientation switch
/portraitMode 0 def /landscapeMode 1 def /rotateMode 2 def
% coordinate system mappings
/dpi2point 0 def
% font control
/FontSize 0 def
/FMS {/FontSize xstore findfont [FontSize 0 0 FontSize neg 0 0]
  makefont setfont} bdef
/reencode {exch dup where {pop load} {pop StandardEncoding} ifelse
  exch dup 3 1 roll findfont dup length dict begin
  { 1 index /FID ne {def}{pop pop} ifelse } forall
  /Encoding exch def currentdict end definefont pop} bdef
/isroman {findfont /CharStrings get /Agrave known} bdef
/FMSR {3 1 roll 1 index dup isroman {reencode} {pop pop} ifelse
  exch FMS} bdef
/csm {1 dpi2point div -1 dpi2point div scale neg translate
 dup landscapeMode eq {pop -90 rotate}
  {rotateMode eq {90 rotate} if} ifelse} bdef
% line types: solid, dotted, dashed, dotdash
/SO { [] 0 setdash } bdef
/DO { [.5 dpi2point mul 4 dpi2point mul] 0 setdash } bdef
/DA { [6 dpi2point mul] 0 setdash } bdef
/DD { [.5 dpi2point mul 4 dpi2point mul 6 dpi2point mul 4
  dpi2point mul] 0 setdash } bdef
% macros for lines and objects
/L {lineto stroke} bdef
/MP {3 1 roll moveto 1 sub {rlineto} repeat} bdef
/AP {{rlineto} repeat} bdef
/PDlw -1 def
/W {/PDlw currentlinewidth def setlinewidth} def
/PP {closepath eofill} bdef
/DP {closepath stroke} bdef
/MR {4 -2 roll moveto dup  0 exch rlineto exch 0 rlineto
  neg 0 exch rlineto closepath} bdef
/FR {MR stroke} bdef
/PR {MR fill} bdef
/L1i {{currentfile picstr readhexstring pop} image} bdef
/tMatrix matrix def
/MakeOval {newpath tMatrix currentmatrix pop translate scale
0 0 1 0 360 arc tMatrix setmatrix} bdef
/FO {MakeOval stroke} bdef
/PO {MakeOval fill} bdef
/PD {currentlinewidth 2 div 0 360 arc fill
   PDlw -1 eq not {PDlw w /PDlw -1 def} if} def
/FA {newpath tMatrix currentmatrix pop translate scale
  0 0 1 5 -2 roll arc tMatrix setmatrix stroke} bdef
/PA {newpath tMatrix currentmatrix pop	translate 0 0 moveto scale
  0 0 1 5 -2 roll arc closepath tMatrix setmatrix fill} bdef
/FAn {newpath tMatrix currentmatrix pop translate scale
  0 0 1 5 -2 roll arcn tMatrix setmatrix stroke} bdef
/PAn {newpath tMatrix currentmatrix pop translate 0 0 moveto scale
  0 0 1 5 -2 roll arcn closepath tMatrix setmatrix fill} bdef
/vradius 0 def /hradius 0 def /lry 0 def
/lrx 0 def /uly 0 def /ulx 0 def /rad 0 def
/MRR {/vradius xdef /hradius xdef /lry xdef /lrx xdef /uly xdef
  /ulx xdef newpath tMatrix currentmatrix pop ulx hradius add uly
  vradius add translate hradius vradius scale 0 0 1 180 270 arc 
  tMatrix setmatrix lrx hradius sub uly vradius add translate
  hradius vradius scale 0 0 1 270 360 arc tMatrix setmatrix
  lrx hradius sub lry vradius sub translate hradius vradius scale
  0 0 1 0 90 arc tMatrix setmatrix ulx hradius add lry vradius sub
  translate hradius vradius scale 0 0 1 90 180 arc tMatrix setmatrix
  closepath} bdef
/FRR {MRR stroke } bdef
/PRR {MRR fill } bdef
/MlrRR {/lry xdef /lrx xdef /uly xdef /ulx xdef /rad lry uly sub 2 div def
  newpath tMatrix currentmatrix pop ulx rad add uly rad add translate
  rad rad scale 0 0 1 90 270 arc tMatrix setmatrix lrx rad sub lry rad
  sub translate rad rad scale 0 0 1 270 90 arc tMatrix setmatrix
  closepath} bdef
/FlrRR {MlrRR stroke } bdef
/PlrRR {MlrRR fill } bdef
/MtbRR {/lry xdef /lrx xdef /uly xdef /ulx xdef /rad lrx ulx sub 2 div def
  newpath tMatrix currentmatrix pop ulx rad add uly rad add translate
  rad rad scale 0 0 1 180 360 arc tMatrix setmatrix lrx rad sub lry rad
  sub translate rad rad scale 0 0 1 0 180 arc tMatrix setmatrix
  closepath} bdef
/FtbRR {MtbRR stroke } bdef
/PtbRR {MtbRR fill } bdef
/stri 6 array def /dtri 6 array def
/smat 6 array def /dmat 6 array def
/tmat1 6 array def /tmat2 6 array def /dif 3 array def
/asub {/ind2 exch def /ind1 exch def dup dup
  ind1 get exch ind2 get sub exch } bdef
/tri_to_matrix {
  2 0 asub 3 1 asub 4 0 asub 5 1 asub
  dup 0 get exch 1 get 7 -1 roll astore } bdef
/compute_transform {
  dmat dtri tri_to_matrix tmat1 invertmatrix 
  smat stri tri_to_matrix tmat2 concatmatrix } bdef
/ds {stri astore pop} bdef
/dt {dtri astore pop} bdef
/db {2 copy /cols xdef /rows xdef mul dup 3 mul string
  currentfile exch readhexstring pop
  dup 0 3 index getinterval /rbmap xdef
  dup 2 index dup getinterval /gbmap xdef
  1 index dup 2 mul exch getinterval /bbmap xdef pop pop}bdef
/it {gs np dtri aload pop moveto lineto lineto cp c
  cols rows 8 compute_transform 
  rbmap gbmap bbmap true 3 colorimage gr}bdef
/il {newpath moveto lineto stroke}bdef
currentdict end def
%%EndProlog

%%BeginSetup
MathWorks begin

0 cap

end
%%EndSetup

%%Page: 1 1
%%BeginPageSetup
%%PageBoundingBox:    60   198   546   602
MathWorks begin
bpage
%%EndPageSetup

%%BeginObject: obj1
bplot

/dpi2point 12 def
portraitMode 0216 7344 csm

  510   110  5827  4853 MR c np
86 dict begin %Colortable dictionary
/c0 { 0.000000 0.000000 0.000000 sr} bdef
/c1 { 1.000000 1.000000 1.000000 sr} bdef
/c2 { 0.900000 0.000000 0.000000 sr} bdef
/c3 { 0.000000 0.820000 0.000000 sr} bdef
/c4 { 0.000000 0.000000 0.800000 sr} bdef
/c5 { 0.910000 0.820000 0.320000 sr} bdef
/c6 { 1.000000 0.260000 0.820000 sr} bdef
/c7 { 0.000000 0.820000 0.820000 sr} bdef
c0
1 j
1 sg
   0    0 6913 5186 PR
6 w
0 4226 5356 0 0 -4226 899 4615 4 MP
PP
-5356 0 0 4226 5356 0 0 -4226 899 4615 5 MP stroke
4 w
DO
0 sg
1047 4615 mt 1047  389 L
1047  389 mt 1047  389 L
1791 4615 mt 1791  389 L
1791  389 mt 1791  389 L
2535 4615 mt 2535  389 L
2535  389 mt 2535  389 L
3279 4615 mt 3279  389 L
3279  389 mt 3279  389 L
4023 4615 mt 4023  389 L
4023  389 mt 4023  389 L
4767 4615 mt 4767  389 L
4767  389 mt 4767  389 L
5511 4615 mt 5511  389 L
5511  389 mt 5511  389 L
6255 4615 mt 6255  389 L
6255  389 mt 6255  389 L
 899 4262 mt 6255 4262 L
6255 4262 mt 6255 4262 L
 899 3675 mt 6255 3675 L
6255 3675 mt 6255 3675 L
 899 3088 mt 6255 3088 L
6255 3088 mt 6255 3088 L
 899 2502 mt 6255 2502 L
6255 2502 mt 6255 2502 L
 899 1915 mt 6255 1915 L
6255 1915 mt 6255 1915 L
 899 1328 mt 6255 1328 L
6255 1328 mt 6255 1328 L
 899  741 mt 6255  741 L
6255  741 mt 6255  741 L
SO
6 w
 899 4615 mt 6255 4615 L
 899  389 mt 6255  389 L
 899 4615 mt  899  389 L
6255 4615 mt 6255  389 L
 899 4615 mt 6255 4615 L
 899 4615 mt  899  389 L
1047 4615 mt 1047 4561 L
1047  389 mt 1047  442 L
%%IncludeResource: font Helvetica
/Helvetica /ISOLatin1Encoding 120 FMSR

 944 4760 mt 
(-7) s
1791 4615 mt 1791 4561 L
1791  389 mt 1791  442 L
1688 4760 mt 
(-6) s
2535 4615 mt 2535 4561 L
2535  389 mt 2535  442 L
2432 4760 mt 
(-5) s
3279 4615 mt 3279 4561 L
3279  389 mt 3279  442 L
3176 4760 mt 
(-4) s
4023 4615 mt 4023 4561 L
4023  389 mt 4023  442 L
3920 4760 mt 
(-3) s
4767 4615 mt 4767 4561 L
4767  389 mt 4767  442 L
4664 4760 mt 
(-2) s
5511 4615 mt 5511 4561 L
5511  389 mt 5511  442 L
5408 4760 mt 
(-1) s
6255 4615 mt 6255 4561 L
6255  389 mt 6255  442 L
6222 4760 mt 
(0) s
5938 4962 mt 
(x 10) s
%%IncludeResource: font Helvetica
/Helvetica /ISOLatin1Encoding 80 FMSR

6164 4888 mt 
(-3) s
 899 4262 mt  952 4262 L
6255 4262 mt 6201 4262 L
%%IncludeResource: font Helvetica
/Helvetica /ISOLatin1Encoding 120 FMSR

 728 4306 mt 
(-3) s
 899 3675 mt  952 3675 L
6255 3675 mt 6201 3675 L
 728 3719 mt 
(-2) s
 899 3088 mt  952 3088 L
6255 3088 mt 6201 3088 L
 728 3132 mt 
(-1) s
 899 2502 mt  952 2502 L
6255 2502 mt 6201 2502 L
 798 2546 mt 
(0) s
 899 1915 mt  952 1915 L
6255 1915 mt 6201 1915 L
 798 1959 mt 
(1) s
 899 1328 mt  952 1328 L
6255 1328 mt 6201 1328 L
 798 1372 mt 
(2) s
 899  741 mt  952  741 L
6255  741 mt 6201  741 L
 798  785 mt 
(3) s
 899 4615 mt 6255 4615 L
 899  389 mt 6255  389 L
 899 4615 mt  899  389 L
6255 4615 mt 6255  389 L
gs 899 389 5357 4227 MR c np
gr

/c8 { 0.000000 0.000000 1.000000 sr} bdef
c8
5785 2308 mt 5905 2308 L
5845 2248 mt 5845 2368 L
5785 2695 mt 5905 2695 L
5845 2635 mt 5845 2755 L
5803 2266 mt 5887 2350 L
5887 2266 mt 5803 2350 L
5803 2653 mt 5887 2737 L
5887 2653 mt 5803 2737 L
gs 899 389 5357 4227 MR c np
gr

/c9 { 1.000000 0.000000 0.000000 sr} bdef
c9
4955 1915 mt 5075 1915 L
5015 1855 mt 5015 1975 L
4955 3088 mt 5075 3088 L
5015 3028 mt 5015 3148 L
4973 1873 mt 5057 1957 L
5057 1873 mt 4973 1957 L
4973 3046 mt 5057 3130 L
5057 3046 mt 4973 3130 L
gs 899 389 5357 4227 MR c np
gr

/c10 { 0.000000 1.000000 0.000000 sr} bdef
c10
2475  741 mt 2595  741 L
2535  681 mt 2535  801 L
2475 4262 mt 2595 4262 L
2535 4202 mt 2535 4322 L
2493  699 mt 2577  783 L
2577  699 mt 2493  783 L
2493 4220 mt 2577 4304 L
2577 4220 mt 2493 4304 L
gs 899 389 5357 4227 MR c np
DA
c8
-3720 -1761 6255 2502 2 MP stroke
-3720 1760 6255 2502 2 MP stroke
gr

c8
DA
0 sg
2541  294 mt 
(Posizione dei poli per filtri a Q costante) s
3426 4903 mt 
(Re\(p\)) s
 646 2643 mt  -90 rotate
(Im\(p\)) s
90 rotate
SO

end %%Color Dict

eplot
%%EndObject

epage
end

showpage

%%Trailer
%%EOF
