%!PS-Adobe-2.0 EPSF-1.2
%%Creator: MATLAB, The Mathworks, Inc. Version 7.5.0.338 (R2007b). Operating System: Linux 2.6.35-32-generic #67-Ubuntu SMP Mon Mar 5 19:39:49 UTC 2012 x86_64.
%%Title: ./filtri_ellittici_zoom.eps
%%CreationDate: 04/23/2012  13:32:31
%%DocumentNeededFonts: Helvetica
%%DocumentProcessColors: Cyan Magenta Yellow Black
%%Extensions: CMYK
%%Pages: 1
%%BoundingBox:    53   196   546   602
%%EndComments

%%BeginProlog
% MathWorks dictionary
/MathWorks 160 dict begin
% definition operators
/bdef {bind def} bind def
/ldef {load def} bind def
/xdef {exch def} bdef
/xstore {exch store} bdef
% operator abbreviations
/c  /clip ldef
/cc /concat ldef
/cp /closepath ldef
/gr /grestore ldef
/gs /gsave ldef
/mt /moveto ldef
/np /newpath ldef
/cm /currentmatrix ldef
/sm /setmatrix ldef
/rm /rmoveto ldef
/rl /rlineto ldef
/s {show newpath} bdef
/sc {setcmykcolor} bdef
/sr /setrgbcolor ldef
/sg /setgray ldef
/w /setlinewidth ldef
/j /setlinejoin ldef
/cap /setlinecap ldef
/rc {rectclip} bdef
/rf {rectfill} bdef
% page state control
/pgsv () def
/bpage {/pgsv save def} bdef
/epage {pgsv restore} bdef
/bplot /gsave ldef
/eplot {stroke grestore} bdef
% orientation switch
/portraitMode 0 def /landscapeMode 1 def /rotateMode 2 def
% coordinate system mappings
/dpi2point 0 def
% font control
/FontSize 0 def
/FMS {/FontSize xstore findfont [FontSize 0 0 FontSize neg 0 0]
  makefont setfont} bdef
/reencode {exch dup where {pop load} {pop StandardEncoding} ifelse
  exch dup 3 1 roll findfont dup length dict begin
  { 1 index /FID ne {def}{pop pop} ifelse } forall
  /Encoding exch def currentdict end definefont pop} bdef
/isroman {findfont /CharStrings get /Agrave known} bdef
/FMSR {3 1 roll 1 index dup isroman {reencode} {pop pop} ifelse
  exch FMS} bdef
/csm {1 dpi2point div -1 dpi2point div scale neg translate
 dup landscapeMode eq {pop -90 rotate}
  {rotateMode eq {90 rotate} if} ifelse} bdef
% line types: solid, dotted, dashed, dotdash
/SO { [] 0 setdash } bdef
/DO { [.5 dpi2point mul 4 dpi2point mul] 0 setdash } bdef
/DA { [6 dpi2point mul] 0 setdash } bdef
/DD { [.5 dpi2point mul 4 dpi2point mul 6 dpi2point mul 4
  dpi2point mul] 0 setdash } bdef
% macros for lines and objects
/L {lineto stroke} bdef
/MP {3 1 roll moveto 1 sub {rlineto} repeat} bdef
/AP {{rlineto} repeat} bdef
/PDlw -1 def
/W {/PDlw currentlinewidth def setlinewidth} def
/PP {closepath eofill} bdef
/DP {closepath stroke} bdef
/MR {4 -2 roll moveto dup  0 exch rlineto exch 0 rlineto
  neg 0 exch rlineto closepath} bdef
/FR {MR stroke} bdef
/PR {MR fill} bdef
/L1i {{currentfile picstr readhexstring pop} image} bdef
/tMatrix matrix def
/MakeOval {newpath tMatrix currentmatrix pop translate scale
0 0 1 0 360 arc tMatrix setmatrix} bdef
/FO {MakeOval stroke} bdef
/PO {MakeOval fill} bdef
/PD {currentlinewidth 2 div 0 360 arc fill
   PDlw -1 eq not {PDlw w /PDlw -1 def} if} def
/FA {newpath tMatrix currentmatrix pop translate scale
  0 0 1 5 -2 roll arc tMatrix setmatrix stroke} bdef
/PA {newpath tMatrix currentmatrix pop	translate 0 0 moveto scale
  0 0 1 5 -2 roll arc closepath tMatrix setmatrix fill} bdef
/FAn {newpath tMatrix currentmatrix pop translate scale
  0 0 1 5 -2 roll arcn tMatrix setmatrix stroke} bdef
/PAn {newpath tMatrix currentmatrix pop translate 0 0 moveto scale
  0 0 1 5 -2 roll arcn closepath tMatrix setmatrix fill} bdef
/vradius 0 def /hradius 0 def /lry 0 def
/lrx 0 def /uly 0 def /ulx 0 def /rad 0 def
/MRR {/vradius xdef /hradius xdef /lry xdef /lrx xdef /uly xdef
  /ulx xdef newpath tMatrix currentmatrix pop ulx hradius add uly
  vradius add translate hradius vradius scale 0 0 1 180 270 arc 
  tMatrix setmatrix lrx hradius sub uly vradius add translate
  hradius vradius scale 0 0 1 270 360 arc tMatrix setmatrix
  lrx hradius sub lry vradius sub translate hradius vradius scale
  0 0 1 0 90 arc tMatrix setmatrix ulx hradius add lry vradius sub
  translate hradius vradius scale 0 0 1 90 180 arc tMatrix setmatrix
  closepath} bdef
/FRR {MRR stroke } bdef
/PRR {MRR fill } bdef
/MlrRR {/lry xdef /lrx xdef /uly xdef /ulx xdef /rad lry uly sub 2 div def
  newpath tMatrix currentmatrix pop ulx rad add uly rad add translate
  rad rad scale 0 0 1 90 270 arc tMatrix setmatrix lrx rad sub lry rad
  sub translate rad rad scale 0 0 1 270 90 arc tMatrix setmatrix
  closepath} bdef
/FlrRR {MlrRR stroke } bdef
/PlrRR {MlrRR fill } bdef
/MtbRR {/lry xdef /lrx xdef /uly xdef /ulx xdef /rad lrx ulx sub 2 div def
  newpath tMatrix currentmatrix pop ulx rad add uly rad add translate
  rad rad scale 0 0 1 180 360 arc tMatrix setmatrix lrx rad sub lry rad
  sub translate rad rad scale 0 0 1 0 180 arc tMatrix setmatrix
  closepath} bdef
/FtbRR {MtbRR stroke } bdef
/PtbRR {MtbRR fill } bdef
/stri 6 array def /dtri 6 array def
/smat 6 array def /dmat 6 array def
/tmat1 6 array def /tmat2 6 array def /dif 3 array def
/asub {/ind2 exch def /ind1 exch def dup dup
  ind1 get exch ind2 get sub exch } bdef
/tri_to_matrix {
  2 0 asub 3 1 asub 4 0 asub 5 1 asub
  dup 0 get exch 1 get 7 -1 roll astore } bdef
/compute_transform {
  dmat dtri tri_to_matrix tmat1 invertmatrix 
  smat stri tri_to_matrix tmat2 concatmatrix } bdef
/ds {stri astore pop} bdef
/dt {dtri astore pop} bdef
/db {2 copy /cols xdef /rows xdef mul dup 3 mul string
  currentfile exch readhexstring pop
  dup 0 3 index getinterval /rbmap xdef
  dup 2 index dup getinterval /gbmap xdef
  1 index dup 2 mul exch getinterval /bbmap xdef pop pop}bdef
/it {gs np dtri aload pop moveto lineto lineto cp c
  cols rows 8 compute_transform 
  rbmap gbmap bbmap true 3 colorimage gr}bdef
/il {newpath moveto lineto stroke}bdef
currentdict end def
%%EndProlog

%%BeginSetup
MathWorks begin

0 cap

end
%%EndSetup

%%Page: 1 1
%%BeginPageSetup
%%PageBoundingBox:    53   196   546   602
MathWorks begin
bpage
%%EndPageSetup

%%BeginObject: obj1
bplot

/dpi2point 12 def
portraitMode 0216 7344 csm

  422   110  5923  4882 MR c np
86 dict begin %Colortable dictionary
/c0 { 0.000000 0.000000 0.000000 sr} bdef
/c1 { 1.000000 1.000000 1.000000 sr} bdef
/c2 { 0.900000 0.000000 0.000000 sr} bdef
/c3 { 0.000000 0.820000 0.000000 sr} bdef
/c4 { 0.000000 0.000000 0.800000 sr} bdef
/c5 { 0.910000 0.820000 0.320000 sr} bdef
/c6 { 1.000000 0.260000 0.820000 sr} bdef
/c7 { 0.000000 0.820000 0.820000 sr} bdef
c0
1 j
1 sg
   0    0 6913 5186 PR
6 w
0 4226 5356 0 0 -4226 899 4615 4 MP
PP
-5356 0 0 4226 5356 0 0 -4226 899 4615 5 MP stroke
4 w
DO
0 sg
1109 4615 mt 1109  389 L
1109  389 mt 1109  389 L
1717 4615 mt 1717  389 L
1717  389 mt 1717  389 L
2325 4615 mt 2325  389 L
2325  389 mt 2325  389 L
2934 4615 mt 2934  389 L
2934  389 mt 2934  389 L
3542 4615 mt 3542  389 L
3542  389 mt 3542  389 L
4150 4615 mt 4150  389 L
4150  389 mt 4150  389 L
4759 4615 mt 4759  389 L
4759  389 mt 4759  389 L
5367 4615 mt 5367  389 L
5367  389 mt 5367  389 L
5975 4615 mt 5975  389 L
5975  389 mt 5975  389 L
 899 4615 mt 6255 4615 L
6255 4615 mt 6255 4615 L
 899  556 mt 6255  556 L
6255  556 mt 6255  556 L
SO
6 w
 899 4615 mt 6255 4615 L
 899  389 mt 6255  389 L
 899 4615 mt  899  389 L
6255 4615 mt 6255  389 L
 899 4615 mt 6255 4615 L
 899 4615 mt  899  389 L
 899 4615 mt  899 4615 L
 899 4615 mt  899 4615 L
DO
 899 4615 mt  899 4615 L
 899 4615 mt  899 4615 L
SO
 899 4615 mt  899 4615 L
 899 4615 mt  899 4615 L
DO
 899 4615 mt  899 4615 L
 899 4615 mt  899 4615 L
SO
 899 4615 mt  899 4615 L
 899 4615 mt  899 4615 L
DO
 899 4615 mt  899 4615 L
 899 4615 mt  899 4615 L
SO
 899 4615 mt  899 4615 L
 899 4615 mt  899 4615 L
DO
 899 4615 mt  899 4615 L
 899 4615 mt  899 4615 L
SO
 899 4615 mt  899 4615 L
 899 4615 mt  899 4615 L
DO
 899 4615 mt  899 4615 L
 899 4615 mt  899 4615 L
SO
 899 4615 mt  899 4615 L
 899 4615 mt  899 4615 L
DO
 899 4615 mt  899 4615 L
 899 4615 mt  899 4615 L
SO
 899 4615 mt  899 4615 L
 899 4615 mt  899 4615 L
DO
 899 4615 mt  899 4615 L
 899 4615 mt  899 4615 L
SO
 899 4615 mt  899 4615 L
 899 4615 mt  899 4615 L
DO
 899 4615 mt  899 4615 L
 899 4615 mt  899 4615 L
SO
 899 4615 mt  899 4615 L
 899 4615 mt  899 4615 L
DO
 899 4615 mt  899 4615 L
 899 4615 mt  899 4615 L
SO
1109 4615 mt 1109 4561 L
1109  389 mt 1109  442 L
%%IncludeResource: font Helvetica
/Helvetica /ISOLatin1Encoding 120 FMSR

 942 4797 mt 
(10) s
%%IncludeResource: font Helvetica
/Helvetica /ISOLatin1Encoding 80 FMSR

1075 4723 mt 
(-0.09) s
 899 4615 mt  899 4615 L
 899 4615 mt  899 4615 L
DO
 899 4615 mt  899 4615 L
 899 4615 mt  899 4615 L
SO
 899 4615 mt  899 4615 L
 899 4615 mt  899 4615 L
DO
 899 4615 mt  899 4615 L
 899 4615 mt  899 4615 L
SO
 899 4615 mt  899 4615 L
 899 4615 mt  899 4615 L
DO
 899 4615 mt  899 4615 L
 899 4615 mt  899 4615 L
SO
 899 4615 mt  899 4615 L
 899 4615 mt  899 4615 L
DO
 899 4615 mt  899 4615 L
 899 4615 mt  899 4615 L
SO
 899 4615 mt  899 4615 L
 899 4615 mt  899 4615 L
DO
 899 4615 mt  899 4615 L
 899 4615 mt  899 4615 L
SO
 899 4615 mt  899 4615 L
 899 4615 mt  899 4615 L
DO
 899 4615 mt  899 4615 L
 899 4615 mt  899 4615 L
SO
 899 4615 mt  899 4615 L
 899 4615 mt  899 4615 L
DO
 899 4615 mt  899 4615 L
 899 4615 mt  899 4615 L
SO
 899 4615 mt  899 4615 L
 899 4615 mt  899 4615 L
DO
 899 4615 mt  899 4615 L
 899 4615 mt  899 4615 L
SO
 899 4615 mt  899 4615 L
 899 4615 mt  899 4615 L
DO
 899 4615 mt  899 4615 L
 899 4615 mt  899 4615 L
SO
1717 4615 mt 1717 4561 L
1717  389 mt 1717  442 L
%%IncludeResource: font Helvetica
/Helvetica /ISOLatin1Encoding 120 FMSR

1550 4797 mt 
(10) s
%%IncludeResource: font Helvetica
/Helvetica /ISOLatin1Encoding 80 FMSR

1683 4723 mt 
(-0.07) s
 899 4615 mt  899 4615 L
 899 4615 mt  899 4615 L
DO
 899 4615 mt  899 4615 L
 899 4615 mt  899 4615 L
SO
 899 4615 mt  899 4615 L
 899 4615 mt  899 4615 L
DO
 899 4615 mt  899 4615 L
 899 4615 mt  899 4615 L
SO
 899 4615 mt  899 4615 L
 899 4615 mt  899 4615 L
DO
 899 4615 mt  899 4615 L
 899 4615 mt  899 4615 L
SO
 899 4615 mt  899 4615 L
 899 4615 mt  899 4615 L
DO
 899 4615 mt  899 4615 L
 899 4615 mt  899 4615 L
SO
 899 4615 mt  899 4615 L
 899 4615 mt  899 4615 L
DO
 899 4615 mt  899 4615 L
 899 4615 mt  899 4615 L
SO
 899 4615 mt  899 4615 L
 899 4615 mt  899 4615 L
DO
 899 4615 mt  899 4615 L
 899 4615 mt  899 4615 L
SO
 899 4615 mt  899 4615 L
 899 4615 mt  899 4615 L
DO
 899 4615 mt  899 4615 L
 899 4615 mt  899 4615 L
SO
 899 4615 mt  899 4615 L
 899 4615 mt  899 4615 L
DO
 899 4615 mt  899 4615 L
 899 4615 mt  899 4615 L
SO
 899 4615 mt  899 4615 L
 899 4615 mt  899 4615 L
DO
 899 4615 mt  899 4615 L
 899 4615 mt  899 4615 L
SO
2325 4615 mt 2325 4561 L
2325  389 mt 2325  442 L
%%IncludeResource: font Helvetica
/Helvetica /ISOLatin1Encoding 120 FMSR

2158 4797 mt 
(10) s
%%IncludeResource: font Helvetica
/Helvetica /ISOLatin1Encoding 80 FMSR

2291 4723 mt 
(-0.05) s
 899 4615 mt  899 4615 L
 899 4615 mt  899 4615 L
DO
 899 4615 mt  899 4615 L
 899 4615 mt  899 4615 L
SO
 899 4615 mt  899 4615 L
 899 4615 mt  899 4615 L
DO
 899 4615 mt  899 4615 L
 899 4615 mt  899 4615 L
SO
 899 4615 mt  899 4615 L
 899 4615 mt  899 4615 L
DO
 899 4615 mt  899 4615 L
 899 4615 mt  899 4615 L
SO
 899 4615 mt  899 4615 L
 899 4615 mt  899 4615 L
DO
 899 4615 mt  899 4615 L
 899 4615 mt  899 4615 L
SO
 899 4615 mt  899 4615 L
 899 4615 mt  899 4615 L
DO
 899 4615 mt  899 4615 L
 899 4615 mt  899 4615 L
SO
 899 4615 mt  899 4615 L
 899 4615 mt  899 4615 L
DO
 899 4615 mt  899 4615 L
 899 4615 mt  899 4615 L
SO
 899 4615 mt  899 4615 L
 899 4615 mt  899 4615 L
DO
 899 4615 mt  899 4615 L
 899 4615 mt  899 4615 L
SO
 899 4615 mt  899 4615 L
 899 4615 mt  899 4615 L
DO
 899 4615 mt  899 4615 L
 899 4615 mt  899 4615 L
SO
 899 4615 mt  899 4615 L
 899 4615 mt  899 4615 L
DO
 899 4615 mt  899 4615 L
 899 4615 mt  899 4615 L
SO
2934 4615 mt 2934 4561 L
2934  389 mt 2934  442 L
%%IncludeResource: font Helvetica
/Helvetica /ISOLatin1Encoding 120 FMSR

2767 4797 mt 
(10) s
%%IncludeResource: font Helvetica
/Helvetica /ISOLatin1Encoding 80 FMSR

2900 4723 mt 
(-0.03) s
 899 4615 mt  899 4615 L
 899 4615 mt  899 4615 L
DO
 899 4615 mt  899 4615 L
 899 4615 mt  899 4615 L
SO
 899 4615 mt  899 4615 L
 899 4615 mt  899 4615 L
DO
 899 4615 mt  899 4615 L
 899 4615 mt  899 4615 L
SO
 899 4615 mt  899 4615 L
 899 4615 mt  899 4615 L
DO
 899 4615 mt  899 4615 L
 899 4615 mt  899 4615 L
SO
 899 4615 mt  899 4615 L
 899 4615 mt  899 4615 L
DO
 899 4615 mt  899 4615 L
 899 4615 mt  899 4615 L
SO
 899 4615 mt  899 4615 L
 899 4615 mt  899 4615 L
DO
 899 4615 mt  899 4615 L
 899 4615 mt  899 4615 L
SO
 899 4615 mt  899 4615 L
 899 4615 mt  899 4615 L
DO
 899 4615 mt  899 4615 L
 899 4615 mt  899 4615 L
SO
 899 4615 mt  899 4615 L
 899 4615 mt  899 4615 L
DO
 899 4615 mt  899 4615 L
 899 4615 mt  899 4615 L
SO
 899 4615 mt  899 4615 L
 899 4615 mt  899 4615 L
DO
 899 4615 mt  899 4615 L
 899 4615 mt  899 4615 L
SO
 899 4615 mt  899 4615 L
 899 4615 mt  899 4615 L
DO
 899 4615 mt  899 4615 L
 899 4615 mt  899 4615 L
SO
3542 4615 mt 3542 4561 L
3542  389 mt 3542  442 L
%%IncludeResource: font Helvetica
/Helvetica /ISOLatin1Encoding 120 FMSR

3375 4797 mt 
(10) s
%%IncludeResource: font Helvetica
/Helvetica /ISOLatin1Encoding 80 FMSR

3508 4723 mt 
(-0.01) s
 899 4615 mt  899 4615 L
 899 4615 mt  899 4615 L
DO
 899 4615 mt  899 4615 L
 899 4615 mt  899 4615 L
SO
 899 4615 mt  899 4615 L
 899 4615 mt  899 4615 L
DO
 899 4615 mt  899 4615 L
 899 4615 mt  899 4615 L
SO
 899 4615 mt  899 4615 L
 899 4615 mt  899 4615 L
DO
 899 4615 mt  899 4615 L
 899 4615 mt  899 4615 L
SO
 899 4615 mt  899 4615 L
 899 4615 mt  899 4615 L
DO
 899 4615 mt  899 4615 L
 899 4615 mt  899 4615 L
SO
 899 4615 mt  899 4615 L
 899 4615 mt  899 4615 L
DO
 899 4615 mt  899 4615 L
 899 4615 mt  899 4615 L
SO
 899 4615 mt  899 4615 L
 899 4615 mt  899 4615 L
DO
 899 4615 mt  899 4615 L
 899 4615 mt  899 4615 L
SO
 899 4615 mt  899 4615 L
 899 4615 mt  899 4615 L
DO
 899 4615 mt  899 4615 L
 899 4615 mt  899 4615 L
SO
 899 4615 mt  899 4615 L
 899 4615 mt  899 4615 L
DO
 899 4615 mt  899 4615 L
 899 4615 mt  899 4615 L
SO
 899 4615 mt  899 4615 L
 899 4615 mt  899 4615 L
DO
 899 4615 mt  899 4615 L
 899 4615 mt  899 4615 L
SO
4150 4615 mt 4150 4561 L
4150  389 mt 4150  442 L
%%IncludeResource: font Helvetica
/Helvetica /ISOLatin1Encoding 120 FMSR

4006 4797 mt 
(10) s
%%IncludeResource: font Helvetica
/Helvetica /ISOLatin1Encoding 80 FMSR

4139 4723 mt 
(0.01) s
 899 4615 mt  899 4615 L
 899 4615 mt  899 4615 L
DO
 899 4615 mt  899 4615 L
 899 4615 mt  899 4615 L
SO
 899 4615 mt  899 4615 L
 899 4615 mt  899 4615 L
DO
 899 4615 mt  899 4615 L
 899 4615 mt  899 4615 L
SO
 899 4615 mt  899 4615 L
 899 4615 mt  899 4615 L
DO
 899 4615 mt  899 4615 L
 899 4615 mt  899 4615 L
SO
 899 4615 mt  899 4615 L
 899 4615 mt  899 4615 L
DO
 899 4615 mt  899 4615 L
 899 4615 mt  899 4615 L
SO
 899 4615 mt  899 4615 L
 899 4615 mt  899 4615 L
DO
 899 4615 mt  899 4615 L
 899 4615 mt  899 4615 L
SO
 899 4615 mt  899 4615 L
 899 4615 mt  899 4615 L
DO
 899 4615 mt  899 4615 L
 899 4615 mt  899 4615 L
SO
 899 4615 mt  899 4615 L
 899 4615 mt  899 4615 L
DO
 899 4615 mt  899 4615 L
 899 4615 mt  899 4615 L
SO
 899 4615 mt  899 4615 L
 899 4615 mt  899 4615 L
DO
 899 4615 mt  899 4615 L
 899 4615 mt  899 4615 L
SO
 899 4615 mt  899 4615 L
 899 4615 mt  899 4615 L
DO
 899 4615 mt  899 4615 L
 899 4615 mt  899 4615 L
SO
4759 4615 mt 4759 4561 L
4759  389 mt 4759  442 L
%%IncludeResource: font Helvetica
/Helvetica /ISOLatin1Encoding 120 FMSR

4615 4797 mt 
(10) s
%%IncludeResource: font Helvetica
/Helvetica /ISOLatin1Encoding 80 FMSR

4748 4723 mt 
(0.03) s
 899 4615 mt  899 4615 L
 899 4615 mt  899 4615 L
DO
 899 4615 mt  899 4615 L
 899 4615 mt  899 4615 L
SO
 899 4615 mt  899 4615 L
 899 4615 mt  899 4615 L
DO
 899 4615 mt  899 4615 L
 899 4615 mt  899 4615 L
SO
 899 4615 mt  899 4615 L
 899 4615 mt  899 4615 L
DO
 899 4615 mt  899 4615 L
 899 4615 mt  899 4615 L
SO
 899 4615 mt  899 4615 L
 899 4615 mt  899 4615 L
DO
 899 4615 mt  899 4615 L
 899 4615 mt  899 4615 L
SO
 899 4615 mt  899 4615 L
 899 4615 mt  899 4615 L
DO
 899 4615 mt  899 4615 L
 899 4615 mt  899 4615 L
SO
 899 4615 mt  899 4615 L
 899 4615 mt  899 4615 L
DO
 899 4615 mt  899 4615 L
 899 4615 mt  899 4615 L
SO
 899 4615 mt  899 4615 L
 899 4615 mt  899 4615 L
DO
 899 4615 mt  899 4615 L
 899 4615 mt  899 4615 L
SO
 899 4615 mt  899 4615 L
 899 4615 mt  899 4615 L
DO
 899 4615 mt  899 4615 L
 899 4615 mt  899 4615 L
SO
 899 4615 mt  899 4615 L
 899 4615 mt  899 4615 L
DO
 899 4615 mt  899 4615 L
 899 4615 mt  899 4615 L
SO
5367 4615 mt 5367 4561 L
5367  389 mt 5367  442 L
%%IncludeResource: font Helvetica
/Helvetica /ISOLatin1Encoding 120 FMSR

5223 4797 mt 
(10) s
%%IncludeResource: font Helvetica
/Helvetica /ISOLatin1Encoding 80 FMSR

5356 4723 mt 
(0.05) s
 899 4615 mt  899 4615 L
 899 4615 mt  899 4615 L
DO
 899 4615 mt  899 4615 L
 899 4615 mt  899 4615 L
SO
 899 4615 mt  899 4615 L
 899 4615 mt  899 4615 L
DO
 899 4615 mt  899 4615 L
 899 4615 mt  899 4615 L
SO
 899 4615 mt  899 4615 L
 899 4615 mt  899 4615 L
DO
 899 4615 mt  899 4615 L
 899 4615 mt  899 4615 L
SO
 899 4615 mt  899 4615 L
 899 4615 mt  899 4615 L
DO
 899 4615 mt  899 4615 L
 899 4615 mt  899 4615 L
SO
 899 4615 mt  899 4615 L
 899 4615 mt  899 4615 L
DO
 899 4615 mt  899 4615 L
 899 4615 mt  899 4615 L
SO
 899 4615 mt  899 4615 L
 899 4615 mt  899 4615 L
DO
 899 4615 mt  899 4615 L
 899 4615 mt  899 4615 L
SO
 899 4615 mt  899 4615 L
 899 4615 mt  899 4615 L
DO
 899 4615 mt  899 4615 L
 899 4615 mt  899 4615 L
SO
 899 4615 mt  899 4615 L
 899 4615 mt  899 4615 L
DO
 899 4615 mt  899 4615 L
 899 4615 mt  899 4615 L
SO
 899 4615 mt  899 4615 L
 899 4615 mt  899 4615 L
DO
 899 4615 mt  899 4615 L
 899 4615 mt  899 4615 L
SO
5975 4615 mt 5975 4561 L
5975  389 mt 5975  442 L
%%IncludeResource: font Helvetica
/Helvetica /ISOLatin1Encoding 120 FMSR

5831 4797 mt 
(10) s
%%IncludeResource: font Helvetica
/Helvetica /ISOLatin1Encoding 80 FMSR

5964 4723 mt 
(0.07) s
 899 4615 mt  899 4615 L
 899 4615 mt  899 4615 L
DO
 899 4615 mt  899 4615 L
 899 4615 mt  899 4615 L
SO
 899 4615 mt  899 4615 L
 899 4615 mt  899 4615 L
DO
 899 4615 mt  899 4615 L
 899 4615 mt  899 4615 L
SO
 899 4615 mt  899 4615 L
 899 4615 mt  899 4615 L
DO
 899 4615 mt  899 4615 L
 899 4615 mt  899 4615 L
SO
 899 4615 mt  899 4615 L
 899 4615 mt  899 4615 L
DO
 899 4615 mt  899 4615 L
 899 4615 mt  899 4615 L
SO
 899 4615 mt  899 4615 L
 899 4615 mt  899 4615 L
DO
 899 4615 mt  899 4615 L
 899 4615 mt  899 4615 L
SO
 899 4615 mt  899 4615 L
 899 4615 mt  899 4615 L
DO
 899 4615 mt  899 4615 L
 899 4615 mt  899 4615 L
SO
 899 4615 mt  899 4615 L
 899 4615 mt  899 4615 L
DO
 899 4615 mt  899 4615 L
 899 4615 mt  899 4615 L
SO
 899 4615 mt  899 4615 L
 899 4615 mt  899 4615 L
DO
 899 4615 mt  899 4615 L
 899 4615 mt  899 4615 L
SO
 899 4615 mt  899 4615 L
 899 4615 mt  899 4615 L
DO
 899 4615 mt  899 4615 L
 899 4615 mt  899 4615 L
SO
 899 4615 mt  925 4615 L
6255 4615 mt 6228 4615 L
DO
 899 4615 mt 6255 4615 L
6255 4615 mt 6255 4615 L
SO
 899 4615 mt  952 4615 L
6255 4615 mt 6201 4615 L
%%IncludeResource: font Helvetica
/Helvetica /ISOLatin1Encoding 120 FMSR

 640 4659 mt 
(10) s
%%IncludeResource: font Helvetica
/Helvetica /ISOLatin1Encoding 80 FMSR

 773 4585 mt 
(-1) s
 899 3393 mt  925 3393 L
6255 3393 mt 6228 3393 L
DO
 899 3393 mt 6255 3393 L
6255 3393 mt 6255 3393 L
SO
 899 2678 mt  925 2678 L
6255 2678 mt 6228 2678 L
DO
 899 2678 mt 6255 2678 L
6255 2678 mt 6255 2678 L
SO
 899 2171 mt  925 2171 L
6255 2171 mt 6228 2171 L
DO
 899 2171 mt 6255 2171 L
6255 2171 mt 6255 2171 L
SO
 899 1778 mt  925 1778 L
6255 1778 mt 6228 1778 L
DO
 899 1778 mt 6255 1778 L
6255 1778 mt 6255 1778 L
SO
 899 1457 mt  925 1457 L
6255 1457 mt 6228 1457 L
DO
 899 1457 mt 6255 1457 L
6255 1457 mt 6255 1457 L
SO
 899 1185 mt  925 1185 L
6255 1185 mt 6228 1185 L
DO
 899 1185 mt 6255 1185 L
6255 1185 mt 6255 1185 L
SO
 899  950 mt  925  950 L
6255  950 mt 6228  950 L
DO
 899  950 mt 6255  950 L
6255  950 mt 6255  950 L
SO
 899  742 mt  925  742 L
6255  742 mt 6228  742 L
DO
 899  742 mt 6255  742 L
6255  742 mt 6255  742 L
SO
 899  556 mt  925  556 L
6255  556 mt 6228  556 L
DO
 899  556 mt 6255  556 L
6255  556 mt 6255  556 L
SO
 899  556 mt  952  556 L
6255  556 mt 6201  556 L
%%IncludeResource: font Helvetica
/Helvetica /ISOLatin1Encoding 120 FMSR

 640  600 mt 
(10) s
%%IncludeResource: font Helvetica
/Helvetica /ISOLatin1Encoding 80 FMSR

 773  526 mt 
(0) s
 899 4615 mt 6255 4615 L
 899  389 mt 6255  389 L
 899 4615 mt  899  389 L
6255 4615 mt 6255  389 L
gs 899 389 5357 4227 MR c np
/c8 { 0.000000 0.000000 1.000000 sr} bdef
c8
24 56 61 134 61 132 61 129 61 128 61 125 61 124 61 123 
61 121 60 120 61 118 61 118 61 116 61 116 61 114 61 113 
61 113 61 111 60 111 61 109 61 108 61 107 61 105 61 103 
61 102 61 99 61 97 61 93 60 91 61 87 61 83 61 79 
61 74 61 70 61 64 61 59 61 53 60 47 61 42 61 37 
61 31 61 26 61 21 61 17 61 13 61 10 60 6 61 3 
61 2 61 -1 61 -3 61 -4 61 -5 61 -6 61 -7 61 -7 
60 -8 61 -8 61 -8 61 -8 61 -8 61 -8 61 -8 61 -7 
61 -7 60 -7 61 -7 61 -7 61 -6 61 -5 61 -6 61 -5 
61 -5 61 -4 60 -4 61 -4 61 -3 61 -4 61 -2 61 -3 
61 -2 61 -2 61 -2 61 -1 60 -2 61 -1 55 0 899 741 88 MP stroke
DA
/c9 { 1.000000 0.000000 0.000000 sr} bdef
c9
56 712 61 711 61 672 61 633 61 564 60 434 61 248 61 82 
61 -11 61 -44 61 -46 61 -37 61 -25 61 -14 60 -5 61 2 
61 8 61 13 61 14 61 17 61 17 61 17 61 17 61 15 
60 15 61 12 61 11 61 9 61 7 61 6 61 3 61 2 
61 0 60 0 61 -3 61 -3 61 -4 61 -5 61 -6 61 -6 
61 -7 61 -7 60 -7 61 -7 61 -8 61 -7 61 -7 61 -8 
61 -7 61 -7 61 -6 61 -7 60 -6 61 -6 55 -5 899 686 56 MP stroke
DD
/c10 { 0.000000 1.000000 0.000000 sr} bdef
c10
30 2451 61 1576 61 -153 61 75 61 85 61 25 61 -21 61 -41 
61 -43 60 -35 61 -24 61 -15 61 -6 61 1 61 7 61 11 
61 15 61 15 61 17 60 17 61 17 61 16 61 14 61 13 
61 12 61 9 61 8 61 6 60 4 61 3 61 1 61 -1 
61 -2 61 -3 61 -3 61 -5 61 -5 60 -6 61 -7 61 -7 
61 -7 61 -7 61 -7 61 -8 61 -7 61 -7 61 -8 60 -7 
61 -6 55 -6 899 665 51 MP stroke
gr

c10
DD
0 sg
%%IncludeResource: font Helvetica
/Helvetica /ISOLatin1Encoding 120 FMSR

3559 4940 mt 
(f) s
 558 2634 mt  -90 rotate
(|H\(f\)|) s
90 rotate
2641  294 mt 
(Risposta in frequenza di filtri ellittici) s
 882 4658 mt 
( ) s
6239  431 mt 
( ) s
SO
1 sg
0 480 729 0 0 -480 5466 929 4 MP
PP
-729 0 0 480 729 0 0 -480 5466 929 5 MP stroke
4 w
DO
SO
6 w
0 sg
5466  929 mt 6195  929 L
5466  449 mt 6195  449 L
5466  929 mt 5466  449 L
6195  929 mt 6195  449 L
5466  929 mt 6195  929 L
5466  929 mt 5466  449 L
5466  929 mt 6195  929 L
5466  449 mt 6195  449 L
5466  929 mt 5466  449 L
6195  929 mt 6195  449 L
5925  582 mt 
(N=4) s
gs 5466 449 730 481 MR c np
c8
353 0 5536 539 2 MP stroke
gr

c8
0 sg
5925  732 mt 
(N=6) s
gs 5466 449 730 481 MR c np
DA
c9
353 0 5536 689 2 MP stroke
SO
gr

c9
0 sg
5925  881 mt 
(N=8) s
gs 5466 449 730 481 MR c np
DD
c10
353 0 5536 838 2 MP stroke
SO
gr

c10

end %%Color Dict

eplot
%%EndObject

epage
end

showpage

%%Trailer
%%EOF
