<?xml version="1.0" encoding="UTF-8" standalone="no"?>
<!-- Created with Inkscape (http://www.inkscape.org/) -->

<svg
   width="336.70535mm"
   height="34.692875mm"
   viewBox="0 0 336.70536 34.692877"
   version="1.1"
   id="svg18076"
   inkscape:version="1.1.2 (0a00cf5339, 2022-02-04)"
   sodipodi:docname="prova-unicita.svg"
   inkscape:export-filename="/home/rpr/tex/Didattica/Dispense/farrow/int-e-samp.png"
   inkscape:export-xdpi="96"
   inkscape:export-ydpi="96"
   xmlns:inkscape="http://www.inkscape.org/namespaces/inkscape"
   xmlns:sodipodi="http://sodipodi.sourceforge.net/DTD/sodipodi-0.dtd"
   xmlns="http://www.w3.org/2000/svg"
   xmlns:svg="http://www.w3.org/2000/svg"
   xmlns:rdf="http://www.w3.org/1999/02/22-rdf-syntax-ns#"
   xmlns:cc="http://creativecommons.org/ns#"
   xmlns:dc="http://purl.org/dc/elements/1.1/">
  <metadata
     id="metadata49">
    <rdf:RDF>
      <cc:Work
         rdf:about="">
        <dc:format>image/svg+xml</dc:format>
        <dc:type
           rdf:resource="http://purl.org/dc/dcmitype/StillImage" />
      </cc:Work>
    </rdf:RDF>
  </metadata>
  <sodipodi:namedview
     id="namedview18078"
     pagecolor="#ffffff"
     bordercolor="#666666"
     borderopacity="1.0"
     inkscape:pageshadow="2"
     inkscape:pageopacity="0.0"
     inkscape:pagecheckerboard="0"
     inkscape:document-units="mm"
     showgrid="false"
     inkscape:zoom="1.3413619"
     inkscape:cx="636.29359"
     inkscape:cy="65.604963"
     inkscape:window-width="1920"
     inkscape:window-height="1011"
     inkscape:window-x="0"
     inkscape:window-y="32"
     inkscape:window-maximized="1"
     inkscape:current-layer="layer1" />
  <defs
     id="defs18073">
    <marker
       style="overflow:visible"
       id="Arrow1Lend"
       refX="0"
       refY="0"
       orient="auto"
       inkscape:stockid="Arrow1Lend"
       inkscape:isstock="true">
      <path
         transform="matrix(-0.8,0,0,-0.8,-10,0)"
         style="fill:context-stroke;fill-rule:evenodd;stroke:context-stroke;stroke-width:1pt"
         d="M 0,0 5,-5 -12.5,0 5,5 Z"
         id="path884"
         inkscape:connector-curvature="0" />
    </marker>
  </defs>
  <g
     inkscape:label="Layer 1"
     inkscape:groupmode="layer"
     id="layer1"
     transform="translate(-115.30375,-171.52718)">
    <g
       transform="rotate(-90,282.73799,100.59763)"
       id="g209">
      <path
         style="fill:none;stroke:#000000;stroke-width:0.264583px;stroke-linecap:butt;stroke-linejoin:miter;stroke-opacity:1"
         d="m 192.23521,154.98968 v 13.86629"
         id="path203"
         inkscape:connector-curvature="0" />
      <path
         inkscape:connector-curvature="0"
         id="path205"
         d="m 196.46854,154.98968 v 13.86629"
         style="fill:none;stroke:#000000;stroke-width:0.264583px;stroke-linecap:butt;stroke-linejoin:miter;stroke-opacity:1" />
      <path
         style="fill:none;stroke:#000000;stroke-width:0.264583px;stroke-linecap:butt;stroke-linejoin:miter;stroke-opacity:1"
         d="m 200.70187,154.98968 v 13.86629"
         id="path207"
         inkscape:connector-curvature="0" />
    </g>
    <text
       xml:space="preserve"
       style="font-size:9.87777px;line-height:1.25;font-family:'Nimbus Sans';-inkscape-font-specification:'Nimbus Sans';text-align:center;text-anchor:middle;stroke-width:0.264583"
       x="221.89964"
       y="190.418"
       id="text19791-3"><tspan
         sodipodi:role="line"
         id="tspan19789-6"
         style="stroke-width:0.264583"
         x="221.89964"
         y="190.418">rect<tspan
   style="font-size:65%;baseline-shift:super"
   id="tspan681">*k+1</tspan></tspan></text>
    <path
       inkscape:connector-curvature="0"
       id="path145"
       d="m 121.82337,186.86708 h 19.05664"
       style="fill:none;stroke:#000000;stroke-width:0.385;stroke-linecap:round;stroke-linejoin:round;stroke-miterlimit:4;stroke-dasharray:none;marker-end:url(#Arrow1Lend)"
       sodipodi:nodetypes="cc" />
    <rect
       y="171.71968"
       x="142.2968"
       height="30.2948"
       width="38.203163"
       id="rect147"
       style="fill:none;stroke:#000000;stroke-width:0.385;stroke-linecap:round;stroke-linejoin:round" />
    <path
       inkscape:connector-curvature="0"
       id="path151"
       d="M 180.56086,186.86708 H 199.6175"
       style="fill:none;stroke:#000000;stroke-width:0.385;stroke-linecap:round;stroke-linejoin:round;stroke-miterlimit:4;stroke-dasharray:none;marker-end:url(#Arrow1Lend)"
       sodipodi:nodetypes="cc" />
    <rect
       y="171.71968"
       x="201.0343"
       height="30.2948"
       width="38.203163"
       id="rect153"
       style="fill:none;stroke:#000000;stroke-width:0.385;stroke-linecap:round;stroke-linejoin:round" />
    <path
       inkscape:connector-curvature="0"
       id="path163"
       d="m 161.416,199.80659 v -24.3483"
       style="fill:none;stroke:#000000;stroke-width:0.385;stroke-linecap:round;stroke-linejoin:round;stroke-miterlimit:4;stroke-dasharray:none;marker-end:url(#Arrow1Lend)" />
    <text
       id="text167"
       y="206.22005"
       x="135.87263"
       style="font-size:9.87777px;line-height:1.25;font-family:'Nimbus Sans';-inkscape-font-specification:'Nimbus Sans';text-align:center;text-anchor:middle;stroke-width:0.264583"
       xml:space="preserve"><tspan
         y="206.22005"
         x="135.87263"
         style="stroke-width:0.264583"
         id="tspan165"
         sodipodi:role="line">ℤ</tspan></text>
    <text
       id="text171"
       y="206.22005"
       x="186.6727"
       style="font-size:9.87777px;line-height:1.25;font-family:'Nimbus Sans';-inkscape-font-specification:'Nimbus Sans';text-align:center;text-anchor:middle;stroke-width:0.264583"
       xml:space="preserve"><tspan
         y="206.22005"
         x="186.6727"
         style="stroke-width:0.264583"
         id="tspan169"
         sodipodi:role="line">ℝ</tspan></text>
    <g
       transform="translate(16.139583,59.823519)"
       id="g187">
      <rect
         y="111.89616"
         x="243.10309"
         height="30.2948"
         width="38.203163"
         id="rect173"
         style="fill:none;stroke:#000000;stroke-width:0.385;stroke-linecap:round;stroke-linejoin:round" />
      <path
         inkscape:connector-curvature="0"
         id="path175"
         d="m 281.58522,127.04356 h 19.05671"
         style="fill:none;stroke:#000000;stroke-width:0.385;stroke-linecap:round;stroke-linejoin:round;stroke-miterlimit:4;stroke-dasharray:none;marker-end:url(#Arrow1Lend)"
         sodipodi:nodetypes="cc" />
      <path
         style="fill:none;stroke:#000000;stroke-width:0.385;stroke-linecap:round;stroke-linejoin:round;stroke-miterlimit:4;stroke-dasharray:none;marker-end:url(#Arrow1Lend)"
         d="m 261.69317,115.07981 v 24.3483"
         id="path177"
         inkscape:connector-curvature="0" />
      <text
         xml:space="preserve"
         style="font-size:9.87777px;line-height:1.25;font-family:'Nimbus Sans';-inkscape-font-specification:'Nimbus Sans';text-align:center;text-anchor:middle;stroke-width:0.264583"
         x="288.00809"
         y="146.39653"
         id="text181"><tspan
           sodipodi:role="line"
           id="tspan179"
           style="stroke-width:0.264583"
           x="288.00809"
           y="146.39653">ℤ</tspan></text>
      <text
         xml:space="preserve"
         style="font-size:9.87777px;line-height:1.25;font-family:'Nimbus Sans';-inkscape-font-specification:'Nimbus Sans';text-align:center;text-anchor:middle;stroke-width:0.264583"
         x="237.7373"
         y="146.39653"
         id="text185"><tspan
           sodipodi:role="line"
           id="tspan183"
           style="stroke-width:0.264583"
           x="237.7373"
           y="146.39653">ℝ</tspan></text>
    </g>
    <text
       id="text191"
       y="189.45511"
       x="117.46697"
       style="font-size:9.87777px;line-height:1.25;font-family:'Nimbus Sans';-inkscape-font-specification:'Nimbus Sans';text-align:center;text-anchor:middle;stroke-width:0.264583"
       xml:space="preserve"><tspan
         y="189.45511"
         x="117.46697"
         style="stroke-width:0.264583"
         id="tspan189"
         sodipodi:role="line">c</tspan></text>
    <text
       id="text7092"
       y="189.45511"
       x="326.48785"
       style="font-size:9.87777px;line-height:1.25;font-family:'Nimbus Sans';-inkscape-font-specification:'Nimbus Sans';text-align:center;text-anchor:middle;stroke-width:0.264583"
       xml:space="preserve"><tspan
         y="189.45511"
         x="326.48785"
         style="stroke-width:0.264583"
         id="tspan7090"
         sodipodi:role="line">s</tspan></text>
    <path
       inkscape:connector-curvature="0"
       id="path7415"
       d="m 239.48713,186.86708 h 19.05664"
       style="fill:none;stroke:#000000;stroke-width:0.385;stroke-linecap:round;stroke-linejoin:round;stroke-miterlimit:4;stroke-dasharray:none;marker-end:url(#Arrow1Lend)"
       sodipodi:nodetypes="cc" />
    <g
       id="g20767"
       transform="translate(165.60714,-67.905517)">
      <text
         xml:space="preserve"
         style="font-size:9.87777px;line-height:1.25;font-family:'Nimbus Sans';-inkscape-font-specification:'Nimbus Sans';text-align:center;text-anchor:middle;stroke-width:0.264583"
         x="241.89494"
         y="259.17157"
         id="text19791-3-7"><tspan
           sodipodi:role="line"
           id="tspan19789-6-5"
           style="stroke-width:0.264583"
           x="241.89494"
           y="259.17157">r<tspan
   style="font-size:65%;baseline-shift:super"
   id="tspan681-3">(k+1)</tspan></tspan></text>
      <g
         id="g8263">
        <g
           id="g476"
           transform="translate(37.248056,174.62505)">
          <g
             id="g3785"
             transform="translate(133.67042,-46.699279)">
            <path
               style="fill:none;stroke:#000000;stroke-width:0.385;stroke-linecap:round;stroke-linejoin:round;stroke-miterlimit:4;stroke-dasharray:none;marker-end:url(#Arrow1Lend)"
               d="M 31.071278,127.04356 H 50.12792"
               id="path3781"
               inkscape:connector-curvature="0"
               sodipodi:nodetypes="cc" />
            <rect
               style="fill:none;stroke:#000000;stroke-width:0.385;stroke-linecap:round;stroke-linejoin:round"
               id="rect3783"
               width="38.203163"
               height="30.2948"
               x="51.54472"
               y="111.89616" />
          </g>
          <path
             inkscape:connector-curvature="0"
             sodipodi:nodetypes="cc"
             id="path3787"
             d="m 223.47924,80.344281 h 18.52747"
             style="fill:none;stroke:#000000;stroke-width:0.385;stroke-linecap:round;stroke-linejoin:round;stroke-miterlimit:4;stroke-dasharray:none;marker-end:url(#Arrow1Lend)" />
          <text
             xml:space="preserve"
             style="font-size:9.87777px;line-height:1.25;font-family:'Nimbus Sans';-inkscape-font-specification:'Nimbus Sans';text-align:center;text-anchor:middle;stroke-width:0.264583"
             x="155.24316"
             y="82.932251"
             id="text3839"><tspan
               sodipodi:role="line"
               id="tspan3837"
               style="stroke-width:0.264583"
               x="155.24316"
               y="82.932251">c</tspan></text>
          <text
             id="text23719-3"
             y="99.500511"
             x="229.116"
             style="font-size:9.87777px;line-height:1.25;font-family:'Nimbus Sans';-inkscape-font-specification:'Nimbus Sans';text-align:center;text-anchor:middle;stroke-width:0.264583"
             xml:space="preserve"><tspan
               y="99.500511"
               x="229.116"
               style="stroke-width:0.264583"
               id="tspan23717-6"
               sodipodi:role="line">ℤ</tspan></text>
          <text
             xml:space="preserve"
             style="font-size:9.87777px;line-height:1.25;font-family:'Nimbus Sans';-inkscape-font-specification:'Nimbus Sans';text-align:center;text-anchor:middle;stroke-width:0.264583"
             x="179.90347"
             y="99.500511"
             id="text86"><tspan
               sodipodi:role="line"
               id="tspan84"
               style="stroke-width:0.264583"
               x="179.90347"
               y="99.500511">ℤ</tspan></text>
          <g
             transform="translate(-5.3643727,-5.8208334)"
             id="g456" />
        </g>
        <g
           transform="translate(-107.28713,128.71749)"
           id="g251-3">
          <text
             xml:space="preserve"
             style="font-size:9.87777px;line-height:1.25;font-family:'Nimbus Sans';-inkscape-font-specification:'Nimbus Sans';text-align:center;text-anchor:middle;stroke-width:0.264583"
             x="391.62463"
             y="128.61069"
             id="text243-5"><tspan
               sodipodi:role="line"
               id="tspan241-1"
               style="stroke-width:0.264583"
               x="391.62463"
               y="128.61069">s</tspan></text>
        </g>
      </g>
      <text
         xml:space="preserve"
         style="font-size:9.87777px;line-height:1.25;font-family:'Nimbus Sans';-inkscape-font-specification:'Nimbus Sans';text-align:center;text-anchor:middle;stroke-width:0.264583"
         x="238.11398"
         y="266.57993"
         id="text20561"><tspan
           sodipodi:role="line"
           id="tspan20559"
           style="stroke-width:0.264583"
           x="238.11398"
           y="266.57993"><tspan
             style="font-size:65%;baseline-shift:super"
             id="tspan20557">0</tspan></tspan></text>
    </g>
  </g>
</svg>
