<?xml version="1.0" encoding="UTF-8" standalone="no"?>
<!-- Created with Inkscape (http://www.inkscape.org/) -->

<svg
   width="143.70102mm"
   height="114.59916mm"
   viewBox="0 0 143.70102 114.59916"
   version="1.1"
   id="svg5"
   inkscape:version="1.1.2 (0a00cf5339, 2022-02-04)"
   sodipodi:docname="raw-r4.svg"
   xmlns:inkscape="http://www.inkscape.org/namespaces/inkscape"
   xmlns:sodipodi="http://sodipodi.sourceforge.net/DTD/sodipodi-0.dtd"
   xmlns="http://www.w3.org/2000/svg"
   xmlns:svg="http://www.w3.org/2000/svg">
  <sodipodi:namedview
     id="namedview7"
     pagecolor="#ffffff"
     bordercolor="#666666"
     borderopacity="1.0"
     inkscape:pageshadow="2"
     inkscape:pageopacity="0.0"
     inkscape:pagecheckerboard="0"
     inkscape:document-units="mm"
     showgrid="false"
     inkscape:zoom="1.8516351"
     inkscape:cx="377.77421"
     inkscape:cy="216.56534"
     inkscape:window-width="1920"
     inkscape:window-height="1011"
     inkscape:window-x="0"
     inkscape:window-y="32"
     inkscape:window-maximized="1"
     inkscape:current-layer="layer1" />
  <defs
     id="defs2">
    <marker
       style="overflow:visible"
       id="Arrow1Lend"
       refX="0"
       refY="0"
       orient="auto"
       inkscape:stockid="Arrow1Lend"
       inkscape:isstock="true">
      <path
         transform="matrix(-0.8,0,0,-0.8,-10,0)"
         style="fill:context-stroke;fill-rule:evenodd;stroke:context-stroke;stroke-width:1pt"
         d="M 0,0 5,-5 -12.5,0 5,5 Z"
         id="path884" />
    </marker>
  </defs>
  <g
     inkscape:label="Layer 1"
     inkscape:groupmode="layer"
     id="layer1"
     transform="translate(19.262327,-28.556903)">
    <path
       style="fill:#cccccc;stroke:#000000;stroke-width:0.385;stroke-linecap:round;stroke-linejoin:round;stroke-miterlimit:4;stroke-dasharray:none;marker-end:url(#Arrow1Lend)"
       d="M 28.401401,52.74543 H 93.97326"
       id="path64" />
    <text
       xml:space="preserve"
       style="font-size:9.87777px;line-height:1.25;font-family:'Nimbus Sans';-inkscape-font-specification:'Nimbus Sans';text-align:center;text-anchor:middle;stroke-width:0.264583"
       x="63.835571"
       y="47.577316"
       id="text2111"><tspan
         sodipodi:role="line"
         id="tspan2109"
         style="stroke-width:0.264583"
         x="63.835571"
         y="47.577316">Q<tspan
   style="font-size:65%;baseline-shift:sub"
   id="tspan3733">3</tspan>(z)</tspan></text>
    <path
       style="fill:#cccccc;stroke:#000000;stroke-width:0.385;stroke-linecap:round;stroke-linejoin:round;stroke-miterlimit:4;stroke-dasharray:none;marker-end:url(#Arrow1Lend)"
       d="M 93.97326,52.74543 V 82.463414"
       id="path4484" />
    <text
       xml:space="preserve"
       style="font-size:9.87777px;line-height:1.25;font-family:'Nimbus Sans';-inkscape-font-specification:'Nimbus Sans';text-align:center;text-anchor:middle;stroke-width:0.264583"
       x="100.26284"
       y="68.561546"
       id="text6438"><tspan
         sodipodi:role="line"
         id="tspan6436"
         style="stroke-width:0.264583"
         x="100.26284"
         y="68.561546">ε</tspan></text>
    <path
       style="fill:#cccccc;stroke:#000000;stroke-width:0.385;stroke-linecap:round;stroke-linejoin:round;stroke-miterlimit:4;stroke-dasharray:none;marker-end:url(#Arrow1Lend)"
       d="M 28.401401,81.320433 H 93.97326"
       id="path6600" />
    <text
       xml:space="preserve"
       style="font-size:9.87777px;line-height:1.25;font-family:'Nimbus Sans';-inkscape-font-specification:'Nimbus Sans';text-align:center;text-anchor:middle;stroke-width:0.264583"
       x="63.835571"
       y="76.152321"
       id="text6606"><tspan
         sodipodi:role="line"
         id="tspan6604"
         style="stroke-width:0.264583"
         x="63.835571"
         y="76.152321">Q<tspan
   style="font-size:65%;baseline-shift:sub"
   id="tspan6602">2</tspan>(z)</tspan></text>
    <path
       style="fill:#cccccc;stroke:#000000;stroke-width:0.385;stroke-linecap:round;stroke-linejoin:round;stroke-miterlimit:4;stroke-dasharray:none;marker-end:url(#Arrow1Lend)"
       d="M 93.97326,81.320433 V 111.03843"
       id="path6608" />
    <text
       xml:space="preserve"
       style="font-size:9.87777px;line-height:1.25;font-family:'Nimbus Sans';-inkscape-font-specification:'Nimbus Sans';text-align:center;text-anchor:middle;stroke-width:0.264583"
       x="100.26284"
       y="97.136536"
       id="text6612"><tspan
         sodipodi:role="line"
         id="tspan6610"
         style="stroke-width:0.264583"
         x="100.26284"
         y="97.136536">ε</tspan></text>
    <path
       style="fill:#cccccc;stroke:#000000;stroke-width:0.385;stroke-linecap:round;stroke-linejoin:round;stroke-miterlimit:4;stroke-dasharray:none;marker-end:url(#Arrow1Lend)"
       d="M 28.401401,111.05426 H 93.97326"
       id="path6614" />
    <text
       xml:space="preserve"
       style="font-size:9.87777px;line-height:1.25;font-family:'Nimbus Sans';-inkscape-font-specification:'Nimbus Sans';text-align:center;text-anchor:middle;stroke-width:0.264583"
       x="63.835571"
       y="106.31482"
       id="text6620"><tspan
         sodipodi:role="line"
         id="tspan6618"
         style="stroke-width:0.264583"
         x="63.835571"
         y="106.31482">Q<tspan
   style="font-size:65%;baseline-shift:sub"
   id="tspan6616">1</tspan>(z)</tspan></text>
    <path
       style="fill:#cccccc;stroke:#000000;stroke-width:0.385;stroke-linecap:round;stroke-linejoin:round;stroke-miterlimit:4;stroke-dasharray:none;marker-end:url(#Arrow1Lend)"
       d="m 93.97326,111.48293 v 29.71801"
       id="path6622" />
    <text
       xml:space="preserve"
       style="font-size:9.87777px;line-height:1.25;font-family:'Nimbus Sans';-inkscape-font-specification:'Nimbus Sans';text-align:center;text-anchor:middle;stroke-width:0.264583"
       x="100.26284"
       y="127.29901"
       id="text6626"><tspan
         sodipodi:role="line"
         id="tspan6624"
         style="stroke-width:0.264583"
         x="100.26284"
         y="127.29901">ε</tspan></text>
    <path
       style="fill:#cccccc;stroke:#000000;stroke-width:0.385;stroke-linecap:round;stroke-linejoin:round;stroke-miterlimit:4;stroke-dasharray:none;marker-end:url(#Arrow1Lend)"
       d="M 28.401401,141.40208 H 93.97326"
       id="path6628" />
    <text
       xml:space="preserve"
       style="font-size:9.87777px;line-height:1.25;font-family:'Nimbus Sans';-inkscape-font-specification:'Nimbus Sans';text-align:center;text-anchor:middle;stroke-width:0.264583"
       x="63.835571"
       y="135.41895"
       id="text6634"><tspan
         sodipodi:role="line"
         id="tspan6632"
         style="stroke-width:0.264583"
         x="63.835571"
         y="135.41895">Q<tspan
   style="font-size:65%;baseline-shift:sub"
   id="tspan6630">0</tspan>(z)</tspan></text>
    <path
       style="fill:#cccccc;stroke:#000000;stroke-width:0.385;stroke-linecap:round;stroke-linejoin:round;stroke-miterlimit:4;stroke-dasharray:none;marker-end:url(#Arrow1Lend)"
       d="m 93.97326,141.20094 h 29.71801"
       id="path6636" />
    <path
       style="fill:none;stroke:#000000;stroke-width:0.385;stroke-linecap:round;stroke-linejoin:round;stroke-miterlimit:4;stroke-dasharray:none;marker-end:url(#Arrow1Lend)"
       d="M -19.069827,30.512027 H 5.2784817"
       id="path7241" />
    <path
       style="fill:none;stroke:#000000;stroke-width:0.385;stroke-linecap:round;stroke-linejoin:round;stroke-miterlimit:4;stroke-dasharray:none"
       d="M 28.401401,141.1587 V 30.512027 H 5.8334063"
       id="path6835"
       sodipodi:nodetypes="ccc" />
  </g>
</svg>
