{
    "disabled": {
        "opacity": "0.5"
    },
    
    "primary":{
        "backgroundColor": "#1351b4",
        "border": "1px solid rgba(0, 0, 0, 0)",
        "fontColor": "#fff",
        "fontWeight": "600",
        "fontSize": "16.8px",
        "fontFamily": "Rawline, Raleway, sans-serif"
    },
    
    "secondary":{
        "backgroundColor": "#fff",
        "border": "1px solid rgb(19, 81, 180)",
        "fontColor": "#1351b4",
        "fontWeight": "600",
        "fontSize": "16.8px",
        "fontFamily": "Rawline, Raleway, sans-serif"
    },
    
    "tertiary":{
        "backgroundColor": "#fff",
        "border": "1px solid rgba(0, 0, 0, 0)",
        "fontColor": "#1351b4",
        "fontWeight": "600",
        "fontSize": "16.8px",
        "fontFamily": "Rawline, Raleway, sans-serif"
    },
    
    "rectangular": {
        "borderRadius": "8px"
    },
    
    "circle":{
        "borderRadius": "50%",
        "padding": "0",
        "width": "40px",
        "iconPaddingRight": "10px"
    },
    
    "density": {     
        "xsmall": "24px",
        "smallHeight": "32px",
        "smallPadding": "0 32px",
        "mediumHeight": "40px",
        "mediumPadding": "0px 40px",
        "largeHeight": "48px",
        "largePadding": "0px 48px"
    },
    
    "focus": {
        "backgroundColorOnFocus": "#fff",
        "backgroundImageOnFocus": "linear-gradient(rgba(242, 227, 23, 0.3), rgba(242, 227, 23, 0.3))",
        "fontColorOnFocus": "#1351b4"
    },
    
    "otherColours": {
        "button-danger": "#e60000",
        "button-success": "#168821",
        "button-warning": "#ffcd07", 
        "button-info":"#155bcb"
    },
    
    "active": {
        "backgroundColor": "#071d41",
        "color": "#fff"
    },
    
    "hover" : {
        "backgroundColor": "#dbe8fb",
        "color": "#1351b4"
    },
    
    "loading": {
        "border-style": "solid",
        "border-color": "#1351b4 #1351b4 transparent"
    }
}
