<mxfile host="Electron" modified="2024-05-15T21:02:49.755Z" agent="Mozilla/5.0 (X11; Linux x86_64) AppleWebKit/537.36 (KHTML, like Gecko) draw.io/24.4.0 Chrome/120.0.6099.109 Electron/28.1.0 Safari/537.36" etag="TLrBBF5W_SubFBm4hgLU" version="24.4.0" type="device">
  <diagram name="Page-1" id="6LQNy81jWlbH6SpiXYpw">
    <mxGraphModel dx="1199" dy="1203" grid="1" gridSize="10" guides="1" tooltips="1" connect="1" arrows="1" fold="1" page="1" pageScale="1" pageWidth="1169" pageHeight="827" math="0" shadow="0">
      <root>
        <mxCell id="0" />
        <mxCell id="1" parent="0" />
        <mxCell id="n9jR0CweBcXWVH9RgRVb-9" style="edgeStyle=orthogonalEdgeStyle;rounded=0;orthogonalLoop=1;jettySize=auto;html=1;exitX=0.5;exitY=0;exitDx=0;exitDy=0;entryX=0;entryY=0.25;entryDx=0;entryDy=0;fillColor=#f8cecc;strokeColor=#b85450;strokeWidth=3;" parent="1" source="n9jR0CweBcXWVH9RgRVb-1" target="n9jR0CweBcXWVH9RgRVb-2" edge="1">
          <mxGeometry relative="1" as="geometry">
            <Array as="points">
              <mxPoint x="330" y="140" />
            </Array>
          </mxGeometry>
        </mxCell>
        <mxCell id="n9jR0CweBcXWVH9RgRVb-14" value="150&lt;div style=&quot;font-size: 14px;&quot;&gt;MHz&lt;/div&gt;" style="edgeLabel;html=1;align=center;verticalAlign=middle;resizable=0;points=[];fontSize=14;" parent="n9jR0CweBcXWVH9RgRVb-9" vertex="1" connectable="0">
          <mxGeometry x="0.4917" y="1" relative="1" as="geometry">
            <mxPoint x="-56" as="offset" />
          </mxGeometry>
        </mxCell>
        <mxCell id="n9jR0CweBcXWVH9RgRVb-15" value="EXT_CLK" style="edgeLabel;html=1;align=center;verticalAlign=middle;resizable=0;points=[];fontSize=14;" parent="n9jR0CweBcXWVH9RgRVb-9" vertex="1" connectable="0">
          <mxGeometry x="0.7708" y="-2" relative="1" as="geometry">
            <mxPoint x="-13" y="-2" as="offset" />
          </mxGeometry>
        </mxCell>
        <mxCell id="n9jR0CweBcXWVH9RgRVb-11" style="edgeStyle=orthogonalEdgeStyle;rounded=0;orthogonalLoop=1;jettySize=auto;html=1;exitX=1;exitY=0;exitDx=0;exitDy=0;entryX=0;entryY=0.75;entryDx=0;entryDy=0;fillColor=#e1d5e7;strokeColor=#0000FF;strokeWidth=3;" parent="1" source="n9jR0CweBcXWVH9RgRVb-1" target="n9jR0CweBcXWVH9RgRVb-2" edge="1">
          <mxGeometry relative="1" as="geometry">
            <Array as="points">
              <mxPoint x="420" y="280" />
              <mxPoint x="420" y="180" />
            </Array>
          </mxGeometry>
        </mxCell>
        <mxCell id="n9jR0CweBcXWVH9RgRVb-12" value="375&lt;div style=&quot;font-size: 14px;&quot;&gt;Hz&lt;/div&gt;" style="edgeLabel;html=1;align=center;verticalAlign=middle;resizable=0;points=[];fontSize=14;" parent="n9jR0CweBcXWVH9RgRVb-11" vertex="1" connectable="0">
          <mxGeometry x="0.5208" y="2" relative="1" as="geometry">
            <mxPoint x="-76" as="offset" />
          </mxGeometry>
        </mxCell>
        <mxCell id="n9jR0CweBcXWVH9RgRVb-13" value="EXT_SYS_P/N" style="edgeLabel;html=1;align=center;verticalAlign=middle;resizable=0;points=[];fontSize=14;" parent="n9jR0CweBcXWVH9RgRVb-11" vertex="1" connectable="0">
          <mxGeometry x="0.7875" relative="1" as="geometry">
            <mxPoint x="-37" as="offset" />
          </mxGeometry>
        </mxCell>
        <mxCell id="n9jR0CweBcXWVH9RgRVb-17" style="edgeStyle=orthogonalEdgeStyle;rounded=0;orthogonalLoop=1;jettySize=auto;html=1;exitX=1;exitY=0.25;exitDx=0;exitDy=0;entryX=0.25;entryY=1;entryDx=0;entryDy=0;fillColor=#e1d5e7;strokeColor=#0000FF;strokeWidth=3;" parent="1" source="n9jR0CweBcXWVH9RgRVb-1" target="n9jR0CweBcXWVH9RgRVb-16" edge="1">
          <mxGeometry relative="1" as="geometry" />
        </mxCell>
        <mxCell id="n9jR0CweBcXWVH9RgRVb-18" value="375 Hz" style="edgeLabel;html=1;align=center;verticalAlign=middle;resizable=0;points=[];fontSize=14;" parent="n9jR0CweBcXWVH9RgRVb-17" vertex="1" connectable="0">
          <mxGeometry x="0.7464" y="2" relative="1" as="geometry">
            <mxPoint as="offset" />
          </mxGeometry>
        </mxCell>
        <mxCell id="n9jR0CweBcXWVH9RgRVb-19" value="PMOD1_7" style="edgeLabel;html=1;align=center;verticalAlign=middle;resizable=0;points=[];fontSize=14;" parent="n9jR0CweBcXWVH9RgRVb-17" vertex="1" connectable="0">
          <mxGeometry x="0.9071" y="-1" relative="1" as="geometry">
            <mxPoint y="9" as="offset" />
          </mxGeometry>
        </mxCell>
        <mxCell id="n9jR0CweBcXWVH9RgRVb-38" style="edgeStyle=orthogonalEdgeStyle;rounded=0;orthogonalLoop=1;jettySize=auto;html=1;exitX=1;exitY=0.75;exitDx=0;exitDy=0;entryX=0.25;entryY=0;entryDx=0;entryDy=0;fillColor=#e1d5e7;strokeColor=#0000FF;strokeWidth=3;" parent="1" source="n9jR0CweBcXWVH9RgRVb-1" target="n9jR0CweBcXWVH9RgRVb-37" edge="1">
          <mxGeometry relative="1" as="geometry" />
        </mxCell>
        <mxCell id="n9jR0CweBcXWVH9RgRVb-39" value="PMOD1_7" style="edgeLabel;html=1;align=center;verticalAlign=middle;resizable=0;points=[];fontSize=14;" parent="n9jR0CweBcXWVH9RgRVb-38" vertex="1" connectable="0">
          <mxGeometry x="0.8963" y="-2" relative="1" as="geometry">
            <mxPoint as="offset" />
          </mxGeometry>
        </mxCell>
        <mxCell id="n9jR0CweBcXWVH9RgRVb-40" value="375 Hz" style="edgeLabel;html=1;align=center;verticalAlign=middle;resizable=0;points=[];fontSize=14;" parent="n9jR0CweBcXWVH9RgRVb-38" vertex="1" connectable="0">
          <mxGeometry x="0.7407" y="1" relative="1" as="geometry">
            <mxPoint as="offset" />
          </mxGeometry>
        </mxCell>
        <mxCell id="n9jR0CweBcXWVH9RgRVb-43" style="edgeStyle=orthogonalEdgeStyle;rounded=0;orthogonalLoop=1;jettySize=auto;html=1;exitX=0.5;exitY=1;exitDx=0;exitDy=0;entryX=0;entryY=0.75;entryDx=0;entryDy=0;fillColor=#f8cecc;strokeColor=#b85450;strokeWidth=3;" parent="1" source="n9jR0CweBcXWVH9RgRVb-1" target="n9jR0CweBcXWVH9RgRVb-33" edge="1">
          <mxGeometry relative="1" as="geometry" />
        </mxCell>
        <mxCell id="n9jR0CweBcXWVH9RgRVb-44" value="EXT_CLK" style="edgeLabel;html=1;align=center;verticalAlign=middle;resizable=0;points=[];fontSize=14;" parent="n9jR0CweBcXWVH9RgRVb-43" vertex="1" connectable="0">
          <mxGeometry x="0.6776" relative="1" as="geometry">
            <mxPoint x="-1" as="offset" />
          </mxGeometry>
        </mxCell>
        <mxCell id="n9jR0CweBcXWVH9RgRVb-45" value="150&lt;div style=&quot;font-size: 14px;&quot;&gt;MHz&lt;/div&gt;" style="edgeLabel;html=1;align=center;verticalAlign=middle;resizable=0;points=[];fontSize=14;" parent="n9jR0CweBcXWVH9RgRVb-43" vertex="1" connectable="0">
          <mxGeometry x="0.2571" y="-3" relative="1" as="geometry">
            <mxPoint as="offset" />
          </mxGeometry>
        </mxCell>
        <mxCell id="n9jR0CweBcXWVH9RgRVb-1" value="Reference Generator Test Board&lt;div&gt;(RGTB)&lt;/div&gt;" style="rounded=1;whiteSpace=wrap;html=1;fontStyle=1" parent="1" vertex="1">
          <mxGeometry x="270" y="280" width="120" height="80" as="geometry" />
        </mxCell>
        <mxCell id="n9jR0CweBcXWVH9RgRVb-2" value="AD9082-FMC-EBZ&lt;div&gt;&lt;br&gt;&lt;/div&gt;&lt;div&gt;FMC ADC&lt;/div&gt;" style="rounded=1;whiteSpace=wrap;html=1;fontStyle=1" parent="1" vertex="1">
          <mxGeometry x="600" y="120" width="120" height="80" as="geometry" />
        </mxCell>
        <mxCell id="n9jR0CweBcXWVH9RgRVb-6" style="edgeStyle=orthogonalEdgeStyle;rounded=0;orthogonalLoop=1;jettySize=auto;html=1;exitX=1;exitY=0.5;exitDx=0;exitDy=0;entryX=0;entryY=0.5;entryDx=0;entryDy=0;" parent="1" source="n9jR0CweBcXWVH9RgRVb-4" target="n9jR0CweBcXWVH9RgRVb-5" edge="1">
          <mxGeometry relative="1" as="geometry" />
        </mxCell>
        <mxCell id="n9jR0CweBcXWVH9RgRVb-7" value="RF OUT2" style="edgeLabel;html=1;align=center;verticalAlign=middle;resizable=0;points=[];fontSize=14;" parent="n9jR0CweBcXWVH9RgRVb-6" vertex="1" connectable="0">
          <mxGeometry x="-0.35" relative="1" as="geometry">
            <mxPoint as="offset" />
          </mxGeometry>
        </mxCell>
        <mxCell id="n9jR0CweBcXWVH9RgRVb-4" value="RF SIGNAL GENERATOR&lt;div&gt;(Valon 5009)&lt;/div&gt;" style="rounded=1;whiteSpace=wrap;html=1;fontStyle=1" parent="1" vertex="1">
          <mxGeometry x="140" y="400" width="120" height="80" as="geometry" />
        </mxCell>
        <mxCell id="n9jR0CweBcXWVH9RgRVb-31" style="edgeStyle=orthogonalEdgeStyle;rounded=0;orthogonalLoop=1;jettySize=auto;html=1;exitX=0.5;exitY=0;exitDx=0;exitDy=0;entryX=0.25;entryY=1;entryDx=0;entryDy=0;" parent="1" source="n9jR0CweBcXWVH9RgRVb-5" target="n9jR0CweBcXWVH9RgRVb-2" edge="1">
          <mxGeometry relative="1" as="geometry" />
        </mxCell>
        <mxCell id="n9jR0CweBcXWVH9RgRVb-32" value="ADC0" style="edgeLabel;html=1;align=center;verticalAlign=middle;resizable=0;points=[];fontSize=14;" parent="n9jR0CweBcXWVH9RgRVb-31" vertex="1" connectable="0">
          <mxGeometry x="0.8878" relative="1" as="geometry">
            <mxPoint y="19" as="offset" />
          </mxGeometry>
        </mxCell>
        <mxCell id="n9jR0CweBcXWVH9RgRVb-41" style="edgeStyle=orthogonalEdgeStyle;rounded=0;orthogonalLoop=1;jettySize=auto;html=1;exitX=0.5;exitY=1;exitDx=0;exitDy=0;entryX=0.25;entryY=0;entryDx=0;entryDy=0;" parent="1" source="n9jR0CweBcXWVH9RgRVb-5" target="n9jR0CweBcXWVH9RgRVb-33" edge="1">
          <mxGeometry relative="1" as="geometry" />
        </mxCell>
        <mxCell id="n9jR0CweBcXWVH9RgRVb-42" value="ADC0" style="edgeLabel;html=1;align=center;verticalAlign=middle;resizable=0;points=[];fontSize=14;" parent="n9jR0CweBcXWVH9RgRVb-41" vertex="1" connectable="0">
          <mxGeometry x="0.05" y="1" relative="1" as="geometry">
            <mxPoint x="-1" y="-1" as="offset" />
          </mxGeometry>
        </mxCell>
        <mxCell id="n9jR0CweBcXWVH9RgRVb-5" value="RF splitter (Minicircuits&lt;div&gt;&lt;span style=&quot;color: rgb(34, 34, 34); font-family: Arial, Helvetica, sans-serif; font-size: small; text-align: start; background-color: rgb(255, 255, 255);&quot;&gt;ZESC-2-11&lt;/span&gt;)&lt;/div&gt;" style="rounded=1;whiteSpace=wrap;html=1;fontStyle=1" parent="1" vertex="1">
          <mxGeometry x="590" y="400" width="80" height="80" as="geometry" />
        </mxCell>
        <mxCell id="n9jR0CweBcXWVH9RgRVb-22" style="edgeStyle=orthogonalEdgeStyle;rounded=0;orthogonalLoop=1;jettySize=auto;html=1;exitX=1;exitY=0.25;exitDx=0;exitDy=0;entryX=0;entryY=0.25;entryDx=0;entryDy=0;" parent="1" source="n9jR0CweBcXWVH9RgRVb-8" target="n9jR0CweBcXWVH9RgRVb-1" edge="1">
          <mxGeometry relative="1" as="geometry" />
        </mxCell>
        <mxCell id="n9jR0CweBcXWVH9RgRVb-23" value="CH1" style="edgeLabel;html=1;align=center;verticalAlign=middle;resizable=0;points=[];fontSize=14;" parent="n9jR0CweBcXWVH9RgRVb-22" vertex="1" connectable="0">
          <mxGeometry x="-0.7455" relative="1" as="geometry">
            <mxPoint as="offset" />
          </mxGeometry>
        </mxCell>
        <mxCell id="n9jR0CweBcXWVH9RgRVb-24" value="1PPS" style="edgeLabel;html=1;align=center;verticalAlign=middle;resizable=0;points=[];fontSize=14;" parent="n9jR0CweBcXWVH9RgRVb-22" vertex="1" connectable="0">
          <mxGeometry x="0.2182" y="-1" relative="1" as="geometry">
            <mxPoint as="offset" />
          </mxGeometry>
        </mxCell>
        <mxCell id="n9jR0CweBcXWVH9RgRVb-25" style="edgeStyle=orthogonalEdgeStyle;rounded=0;orthogonalLoop=1;jettySize=auto;html=1;exitX=0.75;exitY=1;exitDx=0;exitDy=0;entryX=0;entryY=0.75;entryDx=0;entryDy=0;" parent="1" source="n9jR0CweBcXWVH9RgRVb-8" target="n9jR0CweBcXWVH9RgRVb-1" edge="1">
          <mxGeometry relative="1" as="geometry">
            <mxPoint x="120" y="380" as="sourcePoint" />
            <mxPoint x="260" y="360" as="targetPoint" />
          </mxGeometry>
        </mxCell>
        <mxCell id="n9jR0CweBcXWVH9RgRVb-27" value="10MHz" style="edgeLabel;html=1;align=center;verticalAlign=middle;resizable=0;points=[];fontSize=14;" parent="n9jR0CweBcXWVH9RgRVb-25" vertex="1" connectable="0">
          <mxGeometry x="0.2" y="-1" relative="1" as="geometry">
            <mxPoint x="-6" y="-1" as="offset" />
          </mxGeometry>
        </mxCell>
        <mxCell id="n9jR0CweBcXWVH9RgRVb-28" style="edgeStyle=orthogonalEdgeStyle;rounded=0;orthogonalLoop=1;jettySize=auto;html=1;exitX=0.25;exitY=1;exitDx=0;exitDy=0;entryX=0;entryY=0.5;entryDx=0;entryDy=0;" parent="1" source="n9jR0CweBcXWVH9RgRVb-8" target="n9jR0CweBcXWVH9RgRVb-4" edge="1">
          <mxGeometry relative="1" as="geometry" />
        </mxCell>
        <mxCell id="n9jR0CweBcXWVH9RgRVb-29" value="10 MHz" style="edgeLabel;html=1;align=center;verticalAlign=middle;resizable=0;points=[];fontSize=14;" parent="n9jR0CweBcXWVH9RgRVb-28" vertex="1" connectable="0">
          <mxGeometry x="-0.6769" y="-1" relative="1" as="geometry">
            <mxPoint as="offset" />
          </mxGeometry>
        </mxCell>
        <mxCell id="n9jR0CweBcXWVH9RgRVb-30" value="EXTREF" style="edgeLabel;html=1;align=center;verticalAlign=middle;resizable=0;points=[];fontSize=14;" parent="n9jR0CweBcXWVH9RgRVb-28" vertex="1" connectable="0">
          <mxGeometry x="0.4769" y="-1" relative="1" as="geometry">
            <mxPoint as="offset" />
          </mxGeometry>
        </mxCell>
        <mxCell id="n9jR0CweBcXWVH9RgRVb-8" value="Keysight 33500B Waveform Generator" style="rounded=1;whiteSpace=wrap;html=1;fontStyle=1" parent="1" vertex="1">
          <mxGeometry x="40" y="280" width="120" height="80" as="geometry" />
        </mxCell>
        <mxCell id="n9jR0CweBcXWVH9RgRVb-16" value="&lt;b&gt;iWave ZU11&amp;nbsp;&lt;/b&gt;&lt;div&gt;&lt;b&gt;iW-RainboW-G35M Development Kit&lt;/b&gt;&lt;/div&gt;" style="rounded=1;whiteSpace=wrap;html=1;" parent="1" vertex="1">
          <mxGeometry x="720" y="120" width="120" height="80" as="geometry" />
        </mxCell>
        <mxCell id="n9jR0CweBcXWVH9RgRVb-21" style="edgeStyle=orthogonalEdgeStyle;rounded=0;orthogonalLoop=1;jettySize=auto;html=1;exitX=0.5;exitY=0;exitDx=0;exitDy=0;entryX=1;entryY=0.5;entryDx=0;entryDy=0;startArrow=classic;startFill=1;" parent="1" source="n9jR0CweBcXWVH9RgRVb-20" target="n9jR0CweBcXWVH9RgRVb-16" edge="1">
          <mxGeometry relative="1" as="geometry" />
        </mxCell>
        <mxCell id="n9jR0CweBcXWVH9RgRVb-46" style="edgeStyle=orthogonalEdgeStyle;rounded=0;orthogonalLoop=1;jettySize=auto;html=1;exitX=0.5;exitY=1;exitDx=0;exitDy=0;entryX=1;entryY=0.5;entryDx=0;entryDy=0;startArrow=classic;startFill=1;" parent="1" source="n9jR0CweBcXWVH9RgRVb-20" target="n9jR0CweBcXWVH9RgRVb-37" edge="1">
          <mxGeometry relative="1" as="geometry" />
        </mxCell>
        <mxCell id="n9jR0CweBcXWVH9RgRVb-20" value="1 GbE Network Switch" style="rounded=1;whiteSpace=wrap;html=1;fontStyle=1" parent="1" vertex="1">
          <mxGeometry x="810" y="300" width="120" height="80" as="geometry" />
        </mxCell>
        <mxCell id="n9jR0CweBcXWVH9RgRVb-33" value="&lt;span style=&quot;font-weight: 700;&quot;&gt;AD9082-FMC-EBZ&lt;/span&gt;&lt;div style=&quot;font-weight: 700;&quot;&gt;&lt;br&gt;&lt;/div&gt;&lt;div style=&quot;font-weight: 700;&quot;&gt;FMC ADC&lt;/div&gt;" style="rounded=1;whiteSpace=wrap;html=1;" parent="1" vertex="1">
          <mxGeometry x="600" y="530" width="120" height="80" as="geometry" />
        </mxCell>
        <mxCell id="n9jR0CweBcXWVH9RgRVb-34" style="edgeStyle=orthogonalEdgeStyle;rounded=0;orthogonalLoop=1;jettySize=auto;html=1;exitX=1;exitY=1;exitDx=0;exitDy=0;entryX=0;entryY=0.25;entryDx=0;entryDy=0;fillColor=#e1d5e7;strokeColor=#0000FF;strokeWidth=3;" parent="1" source="n9jR0CweBcXWVH9RgRVb-1" target="n9jR0CweBcXWVH9RgRVb-33" edge="1">
          <mxGeometry relative="1" as="geometry">
            <mxPoint x="400" y="290" as="sourcePoint" />
            <mxPoint x="610" y="190" as="targetPoint" />
            <Array as="points">
              <mxPoint x="420" y="360" />
              <mxPoint x="420" y="550" />
            </Array>
          </mxGeometry>
        </mxCell>
        <mxCell id="n9jR0CweBcXWVH9RgRVb-35" value="375&lt;div style=&quot;font-size: 14px;&quot;&gt;Hz&lt;/div&gt;" style="edgeLabel;html=1;align=center;verticalAlign=middle;resizable=0;points=[];fontSize=14;" parent="n9jR0CweBcXWVH9RgRVb-34" vertex="1" connectable="0">
          <mxGeometry x="0.5208" y="2" relative="1" as="geometry">
            <mxPoint x="-57" as="offset" />
          </mxGeometry>
        </mxCell>
        <mxCell id="n9jR0CweBcXWVH9RgRVb-36" value="EXT_SYS_P/N" style="edgeLabel;html=1;align=center;verticalAlign=middle;resizable=0;points=[];fontSize=14;" parent="n9jR0CweBcXWVH9RgRVb-34" vertex="1" connectable="0">
          <mxGeometry x="0.7875" relative="1" as="geometry">
            <mxPoint x="-29" as="offset" />
          </mxGeometry>
        </mxCell>
        <mxCell id="n9jR0CweBcXWVH9RgRVb-37" value="&lt;b&gt;iWave ZU11&amp;nbsp;&lt;/b&gt;&lt;div&gt;&lt;b&gt;iW-RainboW-G35M Development Kit&lt;/b&gt;&lt;/div&gt;" style="rounded=1;whiteSpace=wrap;html=1;" parent="1" vertex="1">
          <mxGeometry x="720" y="530" width="120" height="80" as="geometry" />
        </mxCell>
        <mxCell id="n9jR0CweBcXWVH9RgRVb-48" style="edgeStyle=orthogonalEdgeStyle;rounded=0;orthogonalLoop=1;jettySize=auto;html=1;exitX=0;exitY=0.5;exitDx=0;exitDy=0;entryX=1;entryY=0.5;entryDx=0;entryDy=0;startArrow=classicThin;startFill=1;" parent="1" source="n9jR0CweBcXWVH9RgRVb-47" target="n9jR0CweBcXWVH9RgRVb-20" edge="1">
          <mxGeometry relative="1" as="geometry" />
        </mxCell>
        <mxCell id="hsddWxP_KnY-S4Wngbyp-1" style="edgeStyle=orthogonalEdgeStyle;rounded=0;orthogonalLoop=1;jettySize=auto;html=1;exitX=0.5;exitY=1;exitDx=0;exitDy=0;entryX=0.5;entryY=1;entryDx=0;entryDy=0;" parent="1" source="n9jR0CweBcXWVH9RgRVb-47" target="n9jR0CweBcXWVH9RgRVb-4" edge="1">
          <mxGeometry relative="1" as="geometry">
            <Array as="points">
              <mxPoint x="1060" y="640" />
              <mxPoint x="200" y="640" />
            </Array>
          </mxGeometry>
        </mxCell>
        <mxCell id="hsddWxP_KnY-S4Wngbyp-2" value="&lt;font style=&quot;font-size: 14px;&quot;&gt;USB&lt;/font&gt;" style="edgeLabel;html=1;align=center;verticalAlign=middle;resizable=0;points=[];" parent="hsddWxP_KnY-S4Wngbyp-1" vertex="1" connectable="0">
          <mxGeometry x="0.9625" relative="1" as="geometry">
            <mxPoint as="offset" />
          </mxGeometry>
        </mxCell>
        <mxCell id="hsddWxP_KnY-S4Wngbyp-3" value="&lt;font style=&quot;font-size: 14px;&quot;&gt;/dev/ttyUSB0&lt;/font&gt;" style="edgeLabel;html=1;align=center;verticalAlign=middle;resizable=0;points=[];" parent="hsddWxP_KnY-S4Wngbyp-1" vertex="1" connectable="0">
          <mxGeometry x="-0.9594" y="3" relative="1" as="geometry">
            <mxPoint as="offset" />
          </mxGeometry>
        </mxCell>
        <mxCell id="hsddWxP_KnY-S4Wngbyp-4" value="&lt;font style=&quot;font-size: 14px;&quot;&gt;USB&lt;/font&gt;" style="edgeLabel;html=1;align=center;verticalAlign=middle;resizable=0;points=[];" parent="hsddWxP_KnY-S4Wngbyp-1" vertex="1" connectable="0">
          <mxGeometry x="0.1234" y="-1" relative="1" as="geometry">
            <mxPoint as="offset" />
          </mxGeometry>
        </mxCell>
        <mxCell id="n9jR0CweBcXWVH9RgRVb-47" value="Control Server (maze)" style="rounded=1;whiteSpace=wrap;html=1;fontStyle=1" parent="1" vertex="1">
          <mxGeometry x="1000" y="300" width="120" height="80" as="geometry" />
        </mxCell>
      </root>
    </mxGraphModel>
  </diagram>
</mxfile>
