<mxfile host="Electron" modified="2024-05-20T09:58:21.450Z" agent="Mozilla/5.0 (X11; Linux x86_64) AppleWebKit/537.36 (KHTML, like Gecko) draw.io/24.4.0 Chrome/120.0.6099.109 Electron/28.1.0 Safari/537.36" etag="TRhJPDBOdya7cixlIOav" version="24.4.0" type="device">
  <diagram id="UPvFvG33wL7ltLrafEqC" name="Page-2">
    <mxGraphModel dx="1199" dy="1203" grid="1" gridSize="10" guides="1" tooltips="1" connect="1" arrows="1" fold="1" page="1" pageScale="1" pageWidth="1169" pageHeight="827" math="0" shadow="0">
      <root>
        <mxCell id="0" />
        <mxCell id="1" parent="0" />
        <mxCell id="p0-bGwKZl8cp2tFxGhFI-1" style="edgeStyle=orthogonalEdgeStyle;rounded=0;orthogonalLoop=1;jettySize=auto;html=1;entryX=0;entryY=0.25;entryDx=0;entryDy=0;strokeWidth=3;" parent="1" target="p0-bGwKZl8cp2tFxGhFI-3" edge="1">
          <mxGeometry relative="1" as="geometry">
            <mxPoint x="200" y="210" as="targetPoint" />
            <mxPoint x="50" y="210" as="sourcePoint" />
          </mxGeometry>
        </mxCell>
        <mxCell id="p0-bGwKZl8cp2tFxGhFI-2" style="edgeStyle=orthogonalEdgeStyle;rounded=0;orthogonalLoop=1;jettySize=auto;html=1;entryX=0;entryY=0.75;entryDx=0;entryDy=0;" parent="1" target="p0-bGwKZl8cp2tFxGhFI-3" edge="1">
          <mxGeometry relative="1" as="geometry">
            <mxPoint x="200" y="270" as="targetPoint" />
            <mxPoint x="50" y="270" as="sourcePoint" />
          </mxGeometry>
        </mxCell>
        <mxCell id="fe_qozoAIMJnWjxmX6NR-1" style="edgeStyle=orthogonalEdgeStyle;rounded=0;orthogonalLoop=1;jettySize=auto;html=1;exitX=1;exitY=0.75;exitDx=0;exitDy=0;" parent="1" source="p0-bGwKZl8cp2tFxGhFI-3" edge="1">
          <mxGeometry relative="1" as="geometry">
            <mxPoint x="210" y="270" as="targetPoint" />
          </mxGeometry>
        </mxCell>
        <mxCell id="fe_qozoAIMJnWjxmX6NR-2" value="&lt;font style=&quot;font-size: 14px;&quot;&gt;VLD&lt;/font&gt;" style="edgeLabel;html=1;align=center;verticalAlign=middle;resizable=0;points=[];" parent="fe_qozoAIMJnWjxmX6NR-1" vertex="1" connectable="0">
          <mxGeometry x="-0.4855" relative="1" as="geometry">
            <mxPoint x="14" as="offset" />
          </mxGeometry>
        </mxCell>
        <mxCell id="p0-bGwKZl8cp2tFxGhFI-3" value="&lt;div&gt;FIFO&lt;/div&gt;" style="rounded=1;whiteSpace=wrap;html=1;" parent="1" vertex="1">
          <mxGeometry x="120" y="180" width="30" height="120" as="geometry" />
        </mxCell>
        <mxCell id="p0-bGwKZl8cp2tFxGhFI-4" value="&lt;div style=&quot;font-size: 14px;&quot;&gt;&lt;font style=&quot;font-size: 14px;&quot;&gt;From JESD&lt;/font&gt;&lt;/div&gt;&lt;div style=&quot;font-size: 14px;&quot;&gt;&lt;font style=&quot;font-size: 14px;&quot;&gt;Interface&lt;/font&gt;&lt;/div&gt;" style="text;html=1;align=center;verticalAlign=middle;resizable=0;points=[];autosize=1;strokeColor=none;fillColor=none;" parent="1" vertex="1">
          <mxGeometry x="20" y="215" width="100" height="50" as="geometry" />
        </mxCell>
        <mxCell id="Qu_Ayf8SvLcf67Ih65Fr-4" style="edgeStyle=orthogonalEdgeStyle;rounded=0;orthogonalLoop=1;jettySize=auto;html=1;exitX=0.9;exitY=0.5;exitDx=0;exitDy=0;entryX=0;entryY=0.5;entryDx=0;entryDy=0;exitPerimeter=0;strokeWidth=3;" parent="1" source="Qu_Ayf8SvLcf67Ih65Fr-1" target="Qu_Ayf8SvLcf67Ih65Fr-3" edge="1">
          <mxGeometry relative="1" as="geometry" />
        </mxCell>
        <mxCell id="TB5yCKABHIEbAzzMd0G8-2" style="edgeStyle=orthogonalEdgeStyle;rounded=0;orthogonalLoop=1;jettySize=auto;html=1;exitX=0;exitY=0.75;exitDx=0;exitDy=0;entryX=0;entryY=0.5;entryDx=0;entryDy=0;" parent="1" source="Qu_Ayf8SvLcf67Ih65Fr-1" target="TB5yCKABHIEbAzzMd0G8-1" edge="1">
          <mxGeometry relative="1" as="geometry" />
        </mxCell>
        <mxCell id="TB5yCKABHIEbAzzMd0G8-3" value="375 Hz" style="edgeLabel;html=1;align=center;verticalAlign=middle;resizable=0;points=[];fontSize=14;" parent="TB5yCKABHIEbAzzMd0G8-2" vertex="1" connectable="0">
          <mxGeometry x="0.3846" y="-1" relative="1" as="geometry">
            <mxPoint x="-31" as="offset" />
          </mxGeometry>
        </mxCell>
        <mxCell id="Qu_Ayf8SvLcf67Ih65Fr-1" value="" style="shape=curlyBracket;whiteSpace=wrap;html=1;rounded=1;flipH=1;labelPosition=right;verticalLabelPosition=middle;align=left;verticalAlign=middle;size=0.5;rotation=-180;" parent="1" vertex="1">
          <mxGeometry x="180" y="180" width="30" height="60" as="geometry" />
        </mxCell>
        <mxCell id="Qu_Ayf8SvLcf67Ih65Fr-2" style="edgeStyle=orthogonalEdgeStyle;rounded=0;orthogonalLoop=1;jettySize=auto;html=1;exitX=1;exitY=0.25;exitDx=0;exitDy=0;entryX=0.1;entryY=0.5;entryDx=0;entryDy=0;entryPerimeter=0;strokeWidth=3;" parent="1" source="p0-bGwKZl8cp2tFxGhFI-3" target="Qu_Ayf8SvLcf67Ih65Fr-1" edge="1">
          <mxGeometry relative="1" as="geometry" />
        </mxCell>
        <mxCell id="Qu_Ayf8SvLcf67Ih65Fr-3" value="ADC SNAPSHOT" style="rounded=1;whiteSpace=wrap;html=1;" parent="1" vertex="1">
          <mxGeometry x="620" y="321" width="100" height="40" as="geometry" />
        </mxCell>
        <mxCell id="TB5yCKABHIEbAzzMd0G8-6" style="edgeStyle=orthogonalEdgeStyle;rounded=0;orthogonalLoop=1;jettySize=auto;html=1;exitX=1;exitY=0.5;exitDx=0;exitDy=0;entryX=0;entryY=0.5;entryDx=0;entryDy=0;" parent="1" source="TB5yCKABHIEbAzzMd0G8-1" target="TB5yCKABHIEbAzzMd0G8-5" edge="1">
          <mxGeometry relative="1" as="geometry" />
        </mxCell>
        <mxCell id="TB5yCKABHIEbAzzMd0G8-1" value="Programmable Delay" style="rounded=1;whiteSpace=wrap;html=1;" parent="1" vertex="1">
          <mxGeometry x="250" y="100" width="80" height="60" as="geometry" />
        </mxCell>
        <mxCell id="xTJQIj7_E2ENgTjhvaVT-6" style="edgeStyle=orthogonalEdgeStyle;rounded=0;orthogonalLoop=1;jettySize=auto;html=1;exitX=1;exitY=0.5;exitDx=0;exitDy=0;exitPerimeter=0;" parent="1" source="TB5yCKABHIEbAzzMd0G8-4" target="xTJQIj7_E2ENgTjhvaVT-5" edge="1">
          <mxGeometry relative="1" as="geometry" />
        </mxCell>
        <mxCell id="xTJQIj7_E2ENgTjhvaVT-7" value="RST" style="edgeLabel;html=1;align=center;verticalAlign=middle;resizable=0;points=[];fontSize=14;" parent="xTJQIj7_E2ENgTjhvaVT-6" vertex="1" connectable="0">
          <mxGeometry x="-0.3258" y="-1" relative="1" as="geometry">
            <mxPoint x="19" y="-11" as="offset" />
          </mxGeometry>
        </mxCell>
        <mxCell id="58X2djmL_3Qrv32-UluB-3" style="edgeStyle=orthogonalEdgeStyle;rounded=0;orthogonalLoop=1;jettySize=auto;html=1;exitX=1;exitY=0.5;exitDx=0;exitDy=0;exitPerimeter=0;entryX=0.75;entryY=0;entryDx=0;entryDy=0;" parent="1" source="TB5yCKABHIEbAzzMd0G8-4" target="58X2djmL_3Qrv32-UluB-1" edge="1">
          <mxGeometry relative="1" as="geometry" />
        </mxCell>
        <mxCell id="TB5yCKABHIEbAzzMd0G8-4" value="AND" style="shape=or;whiteSpace=wrap;html=1;" parent="1" vertex="1">
          <mxGeometry x="490" y="110" width="50" height="80" as="geometry" />
        </mxCell>
        <mxCell id="TB5yCKABHIEbAzzMd0G8-7" value="" style="edgeStyle=orthogonalEdgeStyle;rounded=0;orthogonalLoop=1;jettySize=auto;html=1;entryX=0;entryY=0.25;entryDx=0;entryDy=0;entryPerimeter=0;" parent="1" source="TB5yCKABHIEbAzzMd0G8-5" target="TB5yCKABHIEbAzzMd0G8-4" edge="1">
          <mxGeometry relative="1" as="geometry" />
        </mxCell>
        <mxCell id="58X2djmL_3Qrv32-UluB-4" style="edgeStyle=orthogonalEdgeStyle;rounded=0;orthogonalLoop=1;jettySize=auto;html=1;exitX=1;exitY=0.5;exitDx=0;exitDy=0;entryX=0.5;entryY=0;entryDx=0;entryDy=0;" parent="1" source="TB5yCKABHIEbAzzMd0G8-5" target="58X2djmL_3Qrv32-UluB-1" edge="1">
          <mxGeometry relative="1" as="geometry">
            <Array as="points">
              <mxPoint x="470" y="130" />
              <mxPoint x="470" y="210" />
              <mxPoint x="515" y="210" />
            </Array>
          </mxGeometry>
        </mxCell>
        <mxCell id="TB5yCKABHIEbAzzMd0G8-5" value="pulse 32-cycles on posedge" style="rounded=1;whiteSpace=wrap;html=1;" parent="1" vertex="1">
          <mxGeometry x="360" y="100" width="80" height="60" as="geometry" />
        </mxCell>
        <mxCell id="TB5yCKABHIEbAzzMd0G8-8" style="edgeStyle=orthogonalEdgeStyle;rounded=0;orthogonalLoop=1;jettySize=auto;html=1;exitX=0.75;exitY=0.25;exitDx=0;exitDy=0;exitPerimeter=0;entryX=0;entryY=0.75;entryDx=0;entryDy=0;entryPerimeter=0;" parent="1" source="Qu_Ayf8SvLcf67Ih65Fr-1" target="TB5yCKABHIEbAzzMd0G8-4" edge="1">
          <mxGeometry relative="1" as="geometry" />
        </mxCell>
        <mxCell id="TB5yCKABHIEbAzzMd0G8-9" value="LMFC&lt;div style=&quot;font-size: 14px;&quot;&gt;9.375 MHz&lt;/div&gt;" style="edgeLabel;html=1;align=center;verticalAlign=middle;resizable=0;points=[];fontSize=14;" parent="TB5yCKABHIEbAzzMd0G8-8" vertex="1" connectable="0">
          <mxGeometry x="0.6712" y="1" relative="1" as="geometry">
            <mxPoint x="-34" y="11" as="offset" />
          </mxGeometry>
        </mxCell>
        <mxCell id="xTJQIj7_E2ENgTjhvaVT-1" style="edgeStyle=orthogonalEdgeStyle;rounded=0;orthogonalLoop=1;jettySize=auto;html=1;entryX=0.5;entryY=0;entryDx=0;entryDy=0;exitX=1.001;exitY=0.511;exitDx=0;exitDy=0;exitPerimeter=0;strokeColor=#FF0000;" parent="1" source="xTJQIj7_E2ENgTjhvaVT-2" target="TB5yCKABHIEbAzzMd0G8-1" edge="1">
          <mxGeometry relative="1" as="geometry">
            <mxPoint x="120" y="80" as="targetPoint" />
            <mxPoint x="160" y="80" as="sourcePoint" />
          </mxGeometry>
        </mxCell>
        <mxCell id="xTJQIj7_E2ENgTjhvaVT-4" style="edgeStyle=orthogonalEdgeStyle;rounded=0;orthogonalLoop=1;jettySize=auto;html=1;entryX=0.5;entryY=0;entryDx=0;entryDy=0;strokeColor=#ff0000;" parent="1" source="xTJQIj7_E2ENgTjhvaVT-2" target="TB5yCKABHIEbAzzMd0G8-5" edge="1">
          <mxGeometry relative="1" as="geometry" />
        </mxCell>
        <mxCell id="13BM9KjQ4NDjuQlUNKlt-1" style="edgeStyle=orthogonalEdgeStyle;rounded=0;orthogonalLoop=1;jettySize=auto;html=1;entryX=0.5;entryY=0;entryDx=0;entryDy=0;strokeColor=#ff0000;" parent="1" source="xTJQIj7_E2ENgTjhvaVT-2" target="xTJQIj7_E2ENgTjhvaVT-5" edge="1">
          <mxGeometry relative="1" as="geometry" />
        </mxCell>
        <mxCell id="13BM9KjQ4NDjuQlUNKlt-2" style="edgeStyle=orthogonalEdgeStyle;rounded=0;orthogonalLoop=1;jettySize=auto;html=1;entryX=0.5;entryY=0;entryDx=0;entryDy=0;exitX=1.007;exitY=0.517;exitDx=0;exitDy=0;exitPerimeter=0;strokeColor=#ff0000;" parent="1" source="xTJQIj7_E2ENgTjhvaVT-2" target="p0-bGwKZl8cp2tFxGhFI-3" edge="1">
          <mxGeometry relative="1" as="geometry" />
        </mxCell>
        <mxCell id="13BM9KjQ4NDjuQlUNKlt-3" style="edgeStyle=orthogonalEdgeStyle;rounded=0;orthogonalLoop=1;jettySize=auto;html=1;entryX=0.5;entryY=1;entryDx=0;entryDy=0;strokeColor=#ff0000;" parent="1" source="xTJQIj7_E2ENgTjhvaVT-2" target="Qu_Ayf8SvLcf67Ih65Fr-3" edge="1">
          <mxGeometry relative="1" as="geometry">
            <Array as="points">
              <mxPoint x="740" y="79" />
              <mxPoint x="740" y="380" />
              <mxPoint x="650" y="380" />
            </Array>
          </mxGeometry>
        </mxCell>
        <mxCell id="58X2djmL_3Qrv32-UluB-2" style="edgeStyle=orthogonalEdgeStyle;rounded=0;orthogonalLoop=1;jettySize=auto;html=1;entryX=0.5;entryY=1;entryDx=0;entryDy=0;strokeColor=#ff0000;" parent="1" source="xTJQIj7_E2ENgTjhvaVT-2" target="58X2djmL_3Qrv32-UluB-1" edge="1">
          <mxGeometry relative="1" as="geometry">
            <Array as="points">
              <mxPoint x="740" y="79" />
              <mxPoint x="740" y="380" />
              <mxPoint x="515" y="380" />
            </Array>
          </mxGeometry>
        </mxCell>
        <mxCell id="xTJQIj7_E2ENgTjhvaVT-2" value="&lt;div style=&quot;font-size: 14px;&quot;&gt;ADC synchronous&lt;/div&gt;&lt;div style=&quot;font-size: 14px;&quot;&gt;clock&lt;/div&gt;&lt;div style=&quot;font-size: 14px;&quot;&gt;300 MHz&lt;/div&gt;" style="text;html=1;align=center;verticalAlign=middle;resizable=0;points=[];autosize=1;strokeColor=none;fillColor=none;" parent="1" vertex="1">
          <mxGeometry y="49" width="140" height="60" as="geometry" />
        </mxCell>
        <mxCell id="xTJQIj7_E2ENgTjhvaVT-9" style="edgeStyle=orthogonalEdgeStyle;rounded=0;orthogonalLoop=1;jettySize=auto;html=1;exitX=0.5;exitY=1;exitDx=0;exitDy=0;entryX=0.5;entryY=0;entryDx=0;entryDy=0;" parent="1" source="xTJQIj7_E2ENgTjhvaVT-5" target="xTJQIj7_E2ENgTjhvaVT-8" edge="1">
          <mxGeometry relative="1" as="geometry" />
        </mxCell>
        <mxCell id="xTJQIj7_E2ENgTjhvaVT-12" value="Timestamp" style="edgeLabel;html=1;align=center;verticalAlign=middle;resizable=0;points=[];fontSize=14;" parent="xTJQIj7_E2ENgTjhvaVT-9" vertex="1" connectable="0">
          <mxGeometry x="-0.2784" relative="1" as="geometry">
            <mxPoint as="offset" />
          </mxGeometry>
        </mxCell>
        <mxCell id="xTJQIj7_E2ENgTjhvaVT-5" value="TT counter (programmable reset value)" style="rounded=1;whiteSpace=wrap;html=1;" parent="1" vertex="1">
          <mxGeometry x="620" y="110" width="100" height="80" as="geometry" />
        </mxCell>
        <mxCell id="xTJQIj7_E2ENgTjhvaVT-10" style="edgeStyle=orthogonalEdgeStyle;rounded=0;orthogonalLoop=1;jettySize=auto;html=1;exitX=0.5;exitY=1;exitDx=0;exitDy=0;" parent="1" source="xTJQIj7_E2ENgTjhvaVT-8" target="Qu_Ayf8SvLcf67Ih65Fr-3" edge="1">
          <mxGeometry relative="1" as="geometry" />
        </mxCell>
        <mxCell id="xTJQIj7_E2ENgTjhvaVT-14" value="Snapshot Trigger" style="edgeLabel;html=1;align=center;verticalAlign=middle;resizable=0;points=[];fontSize=14;" parent="xTJQIj7_E2ENgTjhvaVT-10" vertex="1" connectable="0">
          <mxGeometry x="-0.2241" y="-1" relative="1" as="geometry">
            <mxPoint as="offset" />
          </mxGeometry>
        </mxCell>
        <mxCell id="xTJQIj7_E2ENgTjhvaVT-8" value="=?&lt;div&gt;Programmable&lt;/div&gt;&lt;div&gt;Comparator&lt;/div&gt;" style="rounded=1;whiteSpace=wrap;html=1;" parent="1" vertex="1">
          <mxGeometry x="620" y="231" width="100" height="50" as="geometry" />
        </mxCell>
        <mxCell id="58X2djmL_3Qrv32-UluB-5" style="edgeStyle=orthogonalEdgeStyle;rounded=0;orthogonalLoop=1;jettySize=auto;html=1;exitX=0.25;exitY=0;exitDx=0;exitDy=0;startArrow=classic;startFill=1;endArrow=none;endFill=0;" parent="1" source="58X2djmL_3Qrv32-UluB-1" edge="1">
          <mxGeometry relative="1" as="geometry">
            <mxPoint x="450" y="170" as="targetPoint" />
            <Array as="points">
              <mxPoint x="490" y="220" />
              <mxPoint x="451" y="220" />
              <mxPoint x="451" y="170" />
            </Array>
          </mxGeometry>
        </mxCell>
        <mxCell id="58X2djmL_3Qrv32-UluB-1" value="TIMING SNAPSHOT" style="rounded=1;whiteSpace=wrap;html=1;" parent="1" vertex="1">
          <mxGeometry x="465" y="240" width="100" height="40" as="geometry" />
        </mxCell>
        <mxCell id="Xv2-wIXdoSnkFfjBSmoS-2" style="edgeStyle=orthogonalEdgeStyle;rounded=0;orthogonalLoop=1;jettySize=auto;html=1;entryX=0.25;entryY=0;entryDx=0;entryDy=0;" edge="1" parent="1" source="Xv2-wIXdoSnkFfjBSmoS-1" target="xTJQIj7_E2ENgTjhvaVT-5">
          <mxGeometry relative="1" as="geometry" />
        </mxCell>
        <mxCell id="Xv2-wIXdoSnkFfjBSmoS-1" value="&lt;div style=&quot;font-size: 14px;&quot;&gt;&lt;b&gt;Software Reset Enable&lt;/b&gt;&lt;/div&gt;" style="text;html=1;align=center;verticalAlign=middle;resizable=0;points=[];autosize=1;strokeColor=none;fillColor=none;" vertex="1" parent="1">
          <mxGeometry x="440" y="25" width="170" height="30" as="geometry" />
        </mxCell>
      </root>
    </mxGraphModel>
  </diagram>
</mxfile>
