{
  "board": {
    "3dviewports": [],
    "design_settings": {
      "defaults": {
        "board_outline_line_width": 0.09999999999999999,
        "copper_line_width": 0.19999999999999998,
        "copper_text_italic": false,
        "copper_text_size_h": 1.5,
        "copper_text_size_v": 1.5,
        "copper_text_thickness": 0.3,
        "copper_text_upright": false,
        "courtyard_line_width": 0.049999999999999996,
        "dimension_precision": 4,
        "dimension_units": 3,
        "dimensions": {
          "arrow_length": 1270000,
          "extension_offset": 500000,
          "keep_text_aligned": true,
          "suppress_zeroes": false,
          "text_position": 0,
          "units_format": 1
        },
        "fab_line_width": 0.09999999999999999,
        "fab_text_italic": false,
        "fab_text_size_h": 1.0,
        "fab_text_size_v": 1.0,
        "fab_text_thickness": 0.15,
        "fab_text_upright": false,
        "other_line_width": 0.15,
        "other_text_italic": false,
        "other_text_size_h": 1.0,
        "other_text_size_v": 1.0,
        "other_text_thickness": 0.15,
        "other_text_upright": false,
        "pads": {
          "drill": 0.762,
          "height": 1.524,
          "width": 1.524
        },
        "silk_line_width": 0.15,
        "silk_text_italic": false,
        "silk_text_size_h": 1.0,
        "silk_text_size_v": 1.0,
        "silk_text_thickness": 0.15,
        "silk_text_upright": false,
        "zones": {
          "min_clearance": 0.19999999999999998
        }
      },
      "diff_pair_dimensions": [
        {
          "gap": 0.0,
          "via_gap": 0.0,
          "width": 0.0
        }
      ],
      "drc_exclusions": [
        "copper_edge_clearance|129400000|105650000|9eb9c8d4-4163-4031-8123-e033f9856ee9|79133d2b-ae25-4c04-8aa4-0a8518c2735d",
        "copper_edge_clearance|129400000|70650000|9eb9c8d4-4163-4031-8123-e033f9856ee9|eb878b3e-287c-4210-b1ba-609b585ef79d",
        "copper_edge_clearance|129615000|76575000|9eb9c8d4-4163-4031-8123-e033f9856ee9|99dceb55-0aa5-45d7-b882-67c7b28267b9",
        "copper_edge_clearance|129615000|76575000|9eb9c8d4-4163-4031-8123-e033f9856ee9|d7825314-f6cb-4ee9-8d64-0e018e27e240",
        "copper_edge_clearance|129615000|79350000|9eb9c8d4-4163-4031-8123-e033f9856ee9|b1afe599-a579-491c-a0f6-e37db3a7294a",
        "copper_edge_clearance|129615000|81925000|9eb9c8d4-4163-4031-8123-e033f9856ee9|6757e196-794b-4939-aacb-beb7226baa67",
        "copper_edge_clearance|129615000|81925000|9eb9c8d4-4163-4031-8123-e033f9856ee9|82daabb8-40d0-4a7b-903f-7b250ff41a45",
        "copper_edge_clearance|135287501|107799999|9eb9c8d4-4163-4031-8123-e033f9856ee9|ca949c82-f34f-4080-90cb-dee3dde42547",
        "copper_edge_clearance|145987501|107799999|9eb9c8d4-4163-4031-8123-e033f9856ee9|677a3e19-f985-4a4d-92ce-a9673363ba15",
        "copper_edge_clearance|147325000|68350000|9eb9c8d4-4163-4031-8123-e033f9856ee9|b824963b-5028-4f13-a335-9b1d366d31d1",
        "copper_edge_clearance|147325000|68350000|9eb9c8d4-4163-4031-8123-e033f9856ee9|eeb7f452-b46e-4e51-b4be-ca01ab5ab84b",
        "copper_edge_clearance|150100000|68350000|9eb9c8d4-4163-4031-8123-e033f9856ee9|d3ff4f0a-ac9f-46da-b59d-3a6ca643dea9",
        "copper_edge_clearance|152675000|68350000|9eb9c8d4-4163-4031-8123-e033f9856ee9|05a8bd28-c74b-4d59-a67f-8d64dc5abbc8",
        "copper_edge_clearance|152675000|68350000|9eb9c8d4-4163-4031-8123-e033f9856ee9|76472610-ec65-4328-81b6-58165eb872a7",
        "copper_edge_clearance|162325000|68350000|9eb9c8d4-4163-4031-8123-e033f9856ee9|92d2b789-6663-44eb-ac34-3bebc5bf098b",
        "copper_edge_clearance|162325000|68350000|9eb9c8d4-4163-4031-8123-e033f9856ee9|b419557d-5e4e-478f-a2aa-2e2ee7bdbee4",
        "copper_edge_clearance|165100000|68350000|9eb9c8d4-4163-4031-8123-e033f9856ee9|7f5e21aa-8dc9-4ec3-806f-dc8566304990",
        "copper_edge_clearance|167675000|68350000|9eb9c8d4-4163-4031-8123-e033f9856ee9|9cfbdd5e-24f1-416d-a3de-a5dd9c09d218",
        "copper_edge_clearance|167675000|68350000|9eb9c8d4-4163-4031-8123-e033f9856ee9|fd5271b5-c48f-41e8-8f16-31c436928dd7",
        "copper_edge_clearance|176900000|68150000|9eb9c8d4-4163-4031-8123-e033f9856ee9|d68bc940-33ed-438e-a0c1-3ca23e803f75",
        "copper_edge_clearance|179200000|86975000|9eb9c8d4-4163-4031-8123-e033f9856ee9|009c19cd-bd17-4b1a-94e5-27d1dc203bea",
        "copper_edge_clearance|179200000|86975000|9eb9c8d4-4163-4031-8123-e033f9856ee9|1f4dc659-f202-41e5-bbf9-b8947e078a57",
        "copper_edge_clearance|179200000|89550000|9eb9c8d4-4163-4031-8123-e033f9856ee9|3b3bff0c-0f2f-4012-8cfb-ebdba88d27c6",
        "copper_edge_clearance|179200000|92325000|9eb9c8d4-4163-4031-8123-e033f9856ee9|4e69adf6-a943-4052-9d96-c5fa19d283c5",
        "copper_edge_clearance|179200000|92325000|9eb9c8d4-4163-4031-8123-e033f9856ee9|687d116f-19c3-4d37-a696-373a7663e384",
        "copper_edge_clearance|179400000|105650000|9eb9c8d4-4163-4031-8123-e033f9856ee9|823962cf-5c0a-4f5f-953b-64fa04fca430",
        "items_not_allowed|132790000|80350000|b1afe599-a579-491c-a0f6-e37db3a7294a|00000000-0000-0000-0000-000000000000",
        "items_not_allowed|150600000|70275000|d3ff4f0a-ac9f-46da-b59d-3a6ca643dea9|00000000-0000-0000-0000-000000000000",
        "items_not_allowed|165600000|70275000|7f5e21aa-8dc9-4ec3-806f-dc8566304990|00000000-0000-0000-0000-000000000000",
        "items_not_allowed|177275000|89050000|3b3bff0c-0f2f-4012-8cfb-ebdba88d27c6|00000000-0000-0000-0000-000000000000",
        "lib_footprint_issues|139400000|105350000|c3b3c001-0de5-4817-9a48-6a8396ab1fdf|00000000-0000-0000-0000-000000000000",
        "lib_footprint_issues|155200000|104037500|d71fbc81-0ea8-40c4-83b7-c92d04767917|00000000-0000-0000-0000-000000000000",
        "lib_footprint_issues|157800000|104037500|a66a5f7a-e1b1-4e6c-9678-8d28aaa4144b|00000000-0000-0000-0000-000000000000",
        "lib_footprint_issues|160400000|104037500|4ef8e116-62c6-4a2c-a779-02b0681ca968|00000000-0000-0000-0000-000000000000",
        "silk_over_copper|135409853|97101054|49d15abd-a79b-42e3-9d39-43a02fe5676c|00000000-0000-0000-0000-000000000000",
        "silk_over_copper|135942506|96793924|355cb088-1ee6-4154-8cf6-d09b36dc0815|00000000-0000-0000-0000-000000000000",
        "silk_over_copper|135991083|96799242|bcdc2453-f957-4327-9a4e-6338cf67c63a|00000000-0000-0000-0000-000000000000",
        "silk_over_copper|138521685|96617490|17b1b6b4-838b-4836-b91a-4b05d2830961|00000000-0000-0000-0000-000000000000",
        "silk_over_copper|138775925|96506093|3e948aa7-5f48-40b6-9cee-cc637fe6c39a|00000000-0000-0000-0000-000000000000",
        "silk_over_copper|139094449|96386508|aeb771c8-0631-445a-a52e-da726c5d4e9f|00000000-0000-0000-0000-000000000000",
        "silk_over_copper|140731996|96388008|f6f00daa-fc2c-4df4-ae10-48ae253dcbb1|00000000-0000-0000-0000-000000000000",
        "silk_over_copper|140980362|96271017|ac8bcb35-2ab6-44e8-b317-bd714f9d52a4|00000000-0000-0000-0000-000000000000",
        "silk_over_copper|141872148|96101197|2c6ed3bf-0977-44f0-8514-5596341b5fad|00000000-0000-0000-0000-000000000000"
      ],
      "meta": {
        "version": 2
      },
      "rule_severities": {
        "annular_width": "error",
        "clearance": "error",
        "connection_width": "warning",
        "copper_edge_clearance": "error",
        "copper_sliver": "warning",
        "courtyards_overlap": "error",
        "diff_pair_gap_out_of_range": "error",
        "diff_pair_uncoupled_length_too_long": "error",
        "drill_out_of_range": "error",
        "duplicate_footprints": "warning",
        "extra_footprint": "warning",
        "footprint": "error",
        "footprint_type_mismatch": "ignore",
        "hole_clearance": "error",
        "hole_near_hole": "error",
        "invalid_outline": "error",
        "isolated_copper": "warning",
        "item_on_disabled_layer": "error",
        "items_not_allowed": "error",
        "length_out_of_range": "error",
        "lib_footprint_issues": "warning",
        "lib_footprint_mismatch": "warning",
        "malformed_courtyard": "error",
        "microvia_drill_out_of_range": "error",
        "missing_courtyard": "ignore",
        "missing_footprint": "warning",
        "net_conflict": "warning",
        "npth_inside_courtyard": "ignore",
        "padstack": "warning",
        "pth_inside_courtyard": "ignore",
        "shorting_items": "error",
        "silk_edge_clearance": "warning",
        "silk_over_copper": "warning",
        "silk_overlap": "warning",
        "skew_out_of_range": "error",
        "solder_mask_bridge": "error",
        "starved_thermal": "error",
        "text_height": "warning",
        "text_thickness": "warning",
        "through_hole_pad_without_hole": "error",
        "too_many_vias": "error",
        "track_dangling": "warning",
        "track_width": "error",
        "tracks_crossing": "error",
        "unconnected_items": "error",
        "unresolved_variable": "error",
        "via_dangling": "warning",
        "zones_intersect": "error"
      },
      "rules": {
        "max_error": 0.005,
        "min_clearance": 0.127,
        "min_connection": 0.127,
        "min_copper_edge_clearance": 0.5,
        "min_hole_clearance": 0.25,
        "min_hole_to_hole": 0.25,
        "min_microvia_diameter": 0.19999999999999998,
        "min_microvia_drill": 0.09999999999999999,
        "min_resolved_spokes": 2,
        "min_silk_clearance": 0.0,
        "min_text_height": 0.7999999999999999,
        "min_text_thickness": 0.08,
        "min_through_hole_diameter": 0.254,
        "min_track_width": 0.127,
        "min_via_annular_width": 0.1016,
        "min_via_diameter": 0.4572,
        "solder_mask_clearance": 0.0,
        "solder_mask_min_width": 0.0,
        "solder_mask_to_copper_clearance": 0.0,
        "use_height_for_length_calcs": true
      },
      "teardrop_options": [
        {
          "td_allow_use_two_tracks": true,
          "td_curve_segcount": 5,
          "td_on_pad_in_zone": false,
          "td_onpadsmd": false,
          "td_onroundshapesonly": false,
          "td_ontrackend": false,
          "td_onviapad": true
        }
      ],
      "teardrop_parameters": [
        {
          "td_curve_segcount": 0,
          "td_height_ratio": 1.0,
          "td_length_ratio": 0.5,
          "td_maxheight": 2.0,
          "td_maxlen": 1.0,
          "td_target_name": "td_round_shape",
          "td_width_to_size_filter_ratio": 0.9
        },
        {
          "td_curve_segcount": 0,
          "td_height_ratio": 1.0,
          "td_length_ratio": 0.5,
          "td_maxheight": 2.0,
          "td_maxlen": 1.0,
          "td_target_name": "td_rect_shape",
          "td_width_to_size_filter_ratio": 0.9
        },
        {
          "td_curve_segcount": 0,
          "td_height_ratio": 1.0,
          "td_length_ratio": 0.5,
          "td_maxheight": 2.0,
          "td_maxlen": 1.0,
          "td_target_name": "td_track_end",
          "td_width_to_size_filter_ratio": 0.9
        }
      ],
      "track_widths": [
        0.0,
        0.0,
        0.2032,
        0.254,
        0.34,
        0.381,
        0.42,
        0.725
      ],
      "via_dimensions": [
        {
          "diameter": 0.0,
          "drill": 0.0
        },
        {
          "diameter": 0.4572,
          "drill": 0.254
        }
      ],
      "zones_allow_external_fillets": false
    },
    "layer_presets": [],
    "viewports": []
  },
  "boards": [],
  "cvpcb": {
    "equivalence_files": []
  },
  "erc": {
    "erc_exclusions": [],
    "meta": {
      "version": 0
    },
    "pin_map": [
      [
        0,
        0,
        0,
        0,
        0,
        0,
        1,
        0,
        0,
        0,
        0,
        2
      ],
      [
        0,
        2,
        0,
        1,
        0,
        0,
        1,
        0,
        2,
        2,
        2,
        2
      ],
      [
        0,
        0,
        0,
        0,
        0,
        0,
        1,
        0,
        1,
        0,
        1,
        2
      ],
      [
        0,
        1,
        0,
        0,
        0,
        0,
        1,
        1,
        2,
        1,
        1,
        2
      ],
      [
        0,
        0,
        0,
        0,
        0,
        0,
        1,
        0,
        0,
        0,
        0,
        2
      ],
      [
        0,
        0,
        0,
        0,
        0,
        0,
        0,
        0,
        0,
        0,
        0,
        2
      ],
      [
        1,
        1,
        1,
        1,
        1,
        0,
        1,
        1,
        1,
        1,
        1,
        2
      ],
      [
        0,
        0,
        0,
        1,
        0,
        0,
        1,
        0,
        0,
        0,
        0,
        2
      ],
      [
        0,
        2,
        1,
        2,
        0,
        0,
        1,
        0,
        2,
        2,
        2,
        2
      ],
      [
        0,
        2,
        0,
        1,
        0,
        0,
        1,
        0,
        2,
        0,
        0,
        2
      ],
      [
        0,
        2,
        1,
        1,
        0,
        0,
        1,
        0,
        2,
        0,
        0,
        2
      ],
      [
        2,
        2,
        2,
        2,
        2,
        2,
        2,
        2,
        2,
        2,
        2,
        2
      ]
    ],
    "rule_severities": {
      "bus_definition_conflict": "error",
      "bus_entry_needed": "error",
      "bus_to_bus_conflict": "error",
      "bus_to_net_conflict": "error",
      "conflicting_netclasses": "error",
      "different_unit_footprint": "error",
      "different_unit_net": "error",
      "duplicate_reference": "error",
      "duplicate_sheet_names": "error",
      "endpoint_off_grid": "warning",
      "extra_units": "error",
      "global_label_dangling": "warning",
      "hier_label_mismatch": "error",
      "label_dangling": "error",
      "lib_symbol_issues": "warning",
      "missing_bidi_pin": "warning",
      "missing_input_pin": "warning",
      "missing_power_pin": "error",
      "missing_unit": "warning",
      "multiple_net_names": "warning",
      "net_not_bus_member": "warning",
      "no_connect_connected": "warning",
      "no_connect_dangling": "warning",
      "pin_not_connected": "error",
      "pin_not_driven": "error",
      "pin_to_pin": "error",
      "power_pin_not_driven": "error",
      "similar_labels": "warning",
      "simulation_model_issue": "ignore",
      "unannotated": "error",
      "unit_value_mismatch": "error",
      "unresolved_variable": "error",
      "wire_dangling": "error"
    }
  },
  "libraries": {
    "pinned_footprint_libs": [
      "DSA2K"
    ],
    "pinned_symbol_libs": [
      "DSA2K"
    ]
  },
  "meta": {
    "filename": "ftx.kicad_pro",
    "version": 1
  },
  "net_settings": {
    "classes": [
      {
        "bus_width": 12,
        "clearance": 0.127,
        "diff_pair_gap": 0.25,
        "diff_pair_via_gap": 0.25,
        "diff_pair_width": 0.2,
        "line_style": 0,
        "microvia_diameter": 0.3,
        "microvia_drill": 0.1,
        "name": "Default",
        "pcb_color": "rgba(0, 0, 0, 0.000)",
        "schematic_color": "rgba(0, 0, 0, 0.000)",
        "track_width": 0.254,
        "via_diameter": 0.4572,
        "via_drill": 0.254,
        "wire_width": 6
      }
    ],
    "meta": {
      "version": 3
    },
    "net_colors": null,
    "netclass_assignments": null,
    "netclass_patterns": []
  },
  "pcbnew": {
    "last_paths": {
      "gencad": "",
      "idf": "",
      "netlist": "",
      "specctra_dsn": "",
      "step": "",
      "vrml": ""
    },
    "page_layout_descr_file": ""
  },
  "schematic": {
    "annotate_start_num": 0,
    "drawing": {
      "dashed_lines_dash_length_ratio": 12.0,
      "dashed_lines_gap_length_ratio": 3.0,
      "default_line_thickness": 6.0,
      "default_text_size": 50.0,
      "field_names": [],
      "intersheets_ref_own_page": false,
      "intersheets_ref_prefix": "",
      "intersheets_ref_short": false,
      "intersheets_ref_show": false,
      "intersheets_ref_suffix": "",
      "junction_size_choice": 3,
      "label_size_ratio": 0.375,
      "pin_symbol_size": 25.0,
      "text_offset_ratio": 0.15
    },
    "legacy_lib_dir": "",
    "legacy_lib_list": [],
    "meta": {
      "version": 1
    },
    "net_format_name": "",
    "page_layout_descr_file": "",
    "plot_directory": "../../../../",
    "spice_current_sheet_as_root": false,
    "spice_external_command": "spice \"%I\"",
    "spice_model_current_sheet_as_root": true,
    "spice_save_all_currents": false,
    "spice_save_all_voltages": false,
    "subpart_first_id": 65,
    "subpart_id_separator": 0
  },
  "sheets": [
    [
      "9da63cf1-7a13-4903-bc82-176c674403f0",
      ""
    ],
    [
      "eb136dee-8e82-4540-9cf5-03584b9ea699",
      "RF"
    ],
    [
      "0149645a-b066-4f32-a406-591f997f9861",
      "Digital"
    ],
    [
      "d3cfbb1e-00bc-44fc-9016-5cffa10300a7",
      "Power"
    ]
  ],
  "text_variables": {}
}
