(kicad_sch (version 20230121) (generator eeschema)

  (uuid 2f335f6f-90a7-47aa-982c-57b263033f12)

  (paper "A4")

  (lib_symbols
    (symbol "DSA2K:MAX9920" (in_bom yes) (on_board yes)
      (property "Reference" "U" (at 0 8.89 0)
        (effects (font (size 1.27 1.27)))
      )
      (property "Value" "MAX9920" (at 0 -8.89 0)
        (effects (font (size 1.27 1.27)))
      )
      (property "Footprint" "Package_SO:SOIC-8-1EP_3.9x4.9mm_P1.27mm_EP2.29x3mm" (at 0 0 0)
        (effects (font (size 1.27 1.27)) hide)
      )
      (property "Datasheet" "https://www.analog.com/media/en/technical-documentation/data-sheets/MAX9918-MAX9920.pdf" (at 0 0 0)
        (effects (font (size 1.27 1.27)) hide)
      )
      (property "MPN" "MAX9920ASA" (at 0 0 0)
        (effects (font (size 1.27 1.27)) hide)
      )
      (symbol "MAX9920_1_1"
        (rectangle (start -7.62 7.62) (end 6.35 -6.985)
          (stroke (width 0) (type default))
          (fill (type background))
        )
        (pin passive line (at -10.16 1.27 0) (length 2.54)
          (name "RS+" (effects (font (size 1.27 1.27))))
          (number "1" (effects (font (size 1.27 1.27))))
        )
        (pin passive line (at -10.16 -1.27 0) (length 2.54)
          (name "RS-" (effects (font (size 1.27 1.27))))
          (number "2" (effects (font (size 1.27 1.27))))
        )
        (pin input line (at 8.89 6.35 180) (length 2.54)
          (name "SHDN" (effects (font (size 1.27 1.27))))
          (number "3" (effects (font (size 1.27 1.27))))
        )
        (pin power_in line (at -10.16 -5.08 0) (length 2.54)
          (name "GND" (effects (font (size 1.27 1.27))))
          (number "4" (effects (font (size 1.27 1.27))))
        )
        (pin output line (at 8.89 2.54 180) (length 2.54)
          (name "OUT" (effects (font (size 1.27 1.27))))
          (number "5" (effects (font (size 1.27 1.27))))
        )
        (pin input line (at 8.89 -2.54 180) (length 2.54)
          (name "FB" (effects (font (size 1.27 1.27))))
          (number "6" (effects (font (size 1.27 1.27))))
        )
        (pin input line (at 8.89 -5.08 180) (length 2.54)
          (name "REFIN" (effects (font (size 1.27 1.27))))
          (number "7" (effects (font (size 1.27 1.27))))
        )
        (pin power_in line (at -10.16 6.35 0) (length 2.54)
          (name "VCC" (effects (font (size 1.27 1.27))))
          (number "8" (effects (font (size 1.27 1.27))))
        )
        (pin power_in line (at -10.16 -5.08 0) (length 2.54) hide
          (name "EP" (effects (font (size 1.27 1.27))))
          (number "9" (effects (font (size 1.27 1.27))))
        )
      )
    )
    (symbol "Device:C" (pin_numbers hide) (pin_names (offset 0.254)) (in_bom yes) (on_board yes)
      (property "Reference" "C" (at 0.635 2.54 0)
        (effects (font (size 1.27 1.27)) (justify left))
      )
      (property "Value" "C" (at 0.635 -2.54 0)
        (effects (font (size 1.27 1.27)) (justify left))
      )
      (property "Footprint" "" (at 0.9652 -3.81 0)
        (effects (font (size 1.27 1.27)) hide)
      )
      (property "Datasheet" "~" (at 0 0 0)
        (effects (font (size 1.27 1.27)) hide)
      )
      (property "ki_keywords" "cap capacitor" (at 0 0 0)
        (effects (font (size 1.27 1.27)) hide)
      )
      (property "ki_description" "Unpolarized capacitor" (at 0 0 0)
        (effects (font (size 1.27 1.27)) hide)
      )
      (property "ki_fp_filters" "C_*" (at 0 0 0)
        (effects (font (size 1.27 1.27)) hide)
      )
      (symbol "C_0_1"
        (polyline
          (pts
            (xy -2.032 -0.762)
            (xy 2.032 -0.762)
          )
          (stroke (width 0.508) (type default))
          (fill (type none))
        )
        (polyline
          (pts
            (xy -2.032 0.762)
            (xy 2.032 0.762)
          )
          (stroke (width 0.508) (type default))
          (fill (type none))
        )
      )
      (symbol "C_1_1"
        (pin passive line (at 0 3.81 270) (length 2.794)
          (name "~" (effects (font (size 1.27 1.27))))
          (number "1" (effects (font (size 1.27 1.27))))
        )
        (pin passive line (at 0 -3.81 90) (length 2.794)
          (name "~" (effects (font (size 1.27 1.27))))
          (number "2" (effects (font (size 1.27 1.27))))
        )
      )
    )
    (symbol "Device:R" (pin_numbers hide) (pin_names (offset 0)) (in_bom yes) (on_board yes)
      (property "Reference" "R" (at 2.032 0 90)
        (effects (font (size 1.27 1.27)))
      )
      (property "Value" "R" (at 0 0 90)
        (effects (font (size 1.27 1.27)))
      )
      (property "Footprint" "" (at -1.778 0 90)
        (effects (font (size 1.27 1.27)) hide)
      )
      (property "Datasheet" "~" (at 0 0 0)
        (effects (font (size 1.27 1.27)) hide)
      )
      (property "ki_keywords" "R res resistor" (at 0 0 0)
        (effects (font (size 1.27 1.27)) hide)
      )
      (property "ki_description" "Resistor" (at 0 0 0)
        (effects (font (size 1.27 1.27)) hide)
      )
      (property "ki_fp_filters" "R_*" (at 0 0 0)
        (effects (font (size 1.27 1.27)) hide)
      )
      (symbol "R_0_1"
        (rectangle (start -1.016 -2.54) (end 1.016 2.54)
          (stroke (width 0.254) (type default))
          (fill (type none))
        )
      )
      (symbol "R_1_1"
        (pin passive line (at 0 3.81 270) (length 1.27)
          (name "~" (effects (font (size 1.27 1.27))))
          (number "1" (effects (font (size 1.27 1.27))))
        )
        (pin passive line (at 0 -3.81 90) (length 1.27)
          (name "~" (effects (font (size 1.27 1.27))))
          (number "2" (effects (font (size 1.27 1.27))))
        )
      )
    )
    (symbol "Potentiometer_Digital:AD5280" (pin_names (offset 0.762)) (in_bom yes) (on_board yes)
      (property "Reference" "U" (at -7.62 11.43 0)
        (effects (font (size 1.27 1.27)) (justify left))
      )
      (property "Value" "AD5280" (at 5.588 11.43 0)
        (effects (font (size 1.27 1.27)) (justify left))
      )
      (property "Footprint" "Package_SO:TSSOP-14_4.4x5mm_P0.65mm" (at 0 -15.24 0)
        (effects (font (size 1.27 1.27)) hide)
      )
      (property "Datasheet" "https://www.analog.com/media/en/technical-documentation/data-sheets/AD5280_5282.pdf" (at 2.54 -5.08 0)
        (effects (font (size 1.27 1.27)) hide)
      )
      (property "ki_keywords" "digital potentiometer" (at 0 0 0)
        (effects (font (size 1.27 1.27)) hide)
      )
      (property "ki_description" "Digital potentiometer, 256 position, single output, I2C interface" (at 0 0 0)
        (effects (font (size 1.27 1.27)) hide)
      )
      (property "ki_fp_filters" "TSSOP*4.4x5mm*P0.65mm*" (at 0 0 0)
        (effects (font (size 1.27 1.27)) hide)
      )
      (symbol "AD5280_0_1"
        (rectangle (start -10.16 10.16) (end 10.16 -10.16)
          (stroke (width 0.254) (type default))
          (fill (type background))
        )
        (polyline
          (pts
            (xy 6.985 5.08)
            (xy 6.35 5.08)
            (xy 5.715 5.08)
            (xy 6.35 5.715)
            (xy 6.35 4.445)
            (xy 5.715 5.08)
          )
          (stroke (width 0.254) (type default))
          (fill (type outline))
        )
        (polyline
          (pts
            (xy 6.985 7.62)
            (xy 5.715 7.62)
            (xy 5.08 6.985)
            (xy 5.715 6.35)
            (xy 5.08 5.715)
            (xy 5.715 5.08)
            (xy 5.08 4.445)
            (xy 5.715 3.81)
            (xy 5.08 3.175)
            (xy 5.715 2.54)
            (xy 6.985 2.54)
          )
          (stroke (width 0.254) (type default))
          (fill (type none))
        )
      )
      (symbol "AD5280_1_1"
        (pin passive line (at 12.7 7.62 180) (length 2.54)
          (name "A" (effects (font (size 1.27 1.27))))
          (number "1" (effects (font (size 1.27 1.27))))
        )
        (pin power_in line (at 0 -12.7 90) (length 2.54)
          (name "GND" (effects (font (size 1.27 1.27))))
          (number "10" (effects (font (size 1.27 1.27))))
        )
        (pin power_in line (at 2.54 -12.7 90) (length 2.54)
          (name "VSS" (effects (font (size 1.27 1.27))))
          (number "11" (effects (font (size 1.27 1.27))))
        )
        (pin output line (at 12.7 -7.62 180) (length 2.54)
          (name "O2" (effects (font (size 1.27 1.27))))
          (number "12" (effects (font (size 1.27 1.27))))
        )
        (pin power_in line (at 2.54 12.7 270) (length 2.54)
          (name "VLOG" (effects (font (size 1.27 1.27))))
          (number "13" (effects (font (size 1.27 1.27))))
        )
        (pin output line (at 12.7 -5.08 180) (length 2.54)
          (name "O1" (effects (font (size 1.27 1.27))))
          (number "14" (effects (font (size 1.27 1.27))))
        )
        (pin passive line (at 12.7 5.08 180) (length 2.54)
          (name "W" (effects (font (size 1.27 1.27))))
          (number "2" (effects (font (size 1.27 1.27))))
        )
        (pin passive line (at 12.7 2.54 180) (length 2.54)
          (name "B" (effects (font (size 1.27 1.27))))
          (number "3" (effects (font (size 1.27 1.27))))
        )
        (pin power_in line (at 0 12.7 270) (length 2.54)
          (name "VDD" (effects (font (size 1.27 1.27))))
          (number "4" (effects (font (size 1.27 1.27))))
        )
        (pin input line (at -12.7 0 0) (length 2.54)
          (name "~{SHDN}" (effects (font (size 1.27 1.27))))
          (number "5" (effects (font (size 1.27 1.27))))
        )
        (pin input line (at -12.7 7.62 0) (length 2.54)
          (name "SCL" (effects (font (size 1.27 1.27))))
          (number "6" (effects (font (size 1.27 1.27))))
        )
        (pin bidirectional line (at -12.7 5.08 0) (length 2.54)
          (name "SDA" (effects (font (size 1.27 1.27))))
          (number "7" (effects (font (size 1.27 1.27))))
        )
        (pin input line (at -12.7 -5.08 0) (length 2.54)
          (name "AD0" (effects (font (size 1.27 1.27))))
          (number "8" (effects (font (size 1.27 1.27))))
        )
        (pin input line (at -12.7 -7.62 0) (length 2.54)
          (name "AD1" (effects (font (size 1.27 1.27))))
          (number "9" (effects (font (size 1.27 1.27))))
        )
      )
    )
    (symbol "Reference_Current:LT3092xDD" (in_bom yes) (on_board yes)
      (property "Reference" "U" (at 0.635 6.35 0)
        (effects (font (size 1.27 1.27)) (justify left))
      )
      (property "Value" "LT3092xDD" (at 0.635 4.445 0)
        (effects (font (size 1.27 1.27)) (justify left))
      )
      (property "Footprint" "Package_DFN_QFN:DFN-8-1EP_3x3mm_P0.5mm_EP1.66x2.38mm" (at 0.635 -3.81 0)
        (effects (font (size 1.27 1.27) italic) (justify left) hide)
      )
      (property "Datasheet" "https://www.analog.com/media/en/technical-documentation/data-sheets/3092fc.pdf" (at 0 0 0)
        (effects (font (size 1.27 1.27) italic) hide)
      )
      (property "ki_keywords" "current source" (at 0 0 0)
        (effects (font (size 1.27 1.27)) hide)
      )
      (property "ki_description" "200mA 2-Terminal Programmable Current Source, DFN-8" (at 0 0 0)
        (effects (font (size 1.27 1.27)) hide)
      )
      (property "ki_fp_filters" "DFN*1EP*3x3mm*P0.5mm*" (at 0 0 0)
        (effects (font (size 1.27 1.27)) hide)
      )
      (symbol "LT3092xDD_0_1"
        (rectangle (start -2.286 3.048) (end 2.54 -2.794)
          (stroke (width 0.254) (type default))
          (fill (type background))
        )
        (circle (center 0 -0.635) (radius 1.27)
          (stroke (width 0) (type default))
          (fill (type none))
        )
        (polyline
          (pts
            (xy -1.143 -2.413)
            (xy -0.381 -2.413)
          )
          (stroke (width 0) (type default))
          (fill (type none))
        )
        (polyline
          (pts
            (xy -1.016 2.413)
            (xy -0.254 2.413)
          )
          (stroke (width 0) (type default))
          (fill (type none))
        )
        (polyline
          (pts
            (xy -0.635 2.794)
            (xy -0.635 2.032)
          )
          (stroke (width 0) (type default))
          (fill (type none))
        )
        (polyline
          (pts
            (xy 0 -1.905)
            (xy 0 -3.175)
          )
          (stroke (width 0) (type default))
          (fill (type none))
        )
        (polyline
          (pts
            (xy 0 1.397)
            (xy 0 -1.397)
          )
          (stroke (width 0.254) (type default))
          (fill (type none))
        )
        (polyline
          (pts
            (xy 0 3.81)
            (xy 0 1.905)
          )
          (stroke (width 0) (type default))
          (fill (type none))
        )
        (polyline
          (pts
            (xy 2.54 0)
            (xy 1.27 0)
          )
          (stroke (width 0) (type default))
          (fill (type none))
        )
        (polyline
          (pts
            (xy 0 -1.397)
            (xy -0.254 -0.889)
            (xy 0.254 -0.889)
            (xy 0 -1.397)
          )
          (stroke (width 0.254) (type default))
          (fill (type none))
        )
        (polyline
          (pts
            (xy 1.27 0)
            (xy 2.159 0.254)
            (xy 2.159 -0.254)
            (xy 1.27 0)
          )
          (stroke (width 0) (type default))
          (fill (type none))
        )
        (circle (center 0 0.635) (radius 1.27)
          (stroke (width 0) (type default))
          (fill (type none))
        )
      )
      (symbol "LT3092xDD_1_1"
        (pin passive line (at 0 -5.08 90) (length 2.54) hide
          (name "~" (effects (font (size 1.27 1.27))))
          (number "1" (effects (font (size 1.27 1.27))))
        )
        (pin passive line (at 0 -5.08 90) (length 2.54)
          (name "~" (effects (font (size 1.27 1.27))))
          (number "2" (effects (font (size 1.27 1.27))))
        )
        (pin no_connect line (at -1.27 2.54 0) (length 2.54) hide
          (name "NC" (effects (font (size 1.27 1.27))))
          (number "3" (effects (font (size 1.27 1.27))))
        )
        (pin passive line (at 5.08 0 180) (length 2.54)
          (name "~" (effects (font (size 1.27 1.27))))
          (number "4" (effects (font (size 1.27 1.27))))
        )
        (pin no_connect line (at -1.27 0 0) (length 2.54) hide
          (name "NC" (effects (font (size 1.27 1.27))))
          (number "5" (effects (font (size 1.27 1.27))))
        )
        (pin no_connect line (at -1.27 -2.54 0) (length 2.54) hide
          (name "NC" (effects (font (size 1.27 1.27))))
          (number "6" (effects (font (size 1.27 1.27))))
        )
        (pin passive line (at 0 5.08 270) (length 2.54)
          (name "~" (effects (font (size 1.27 1.27))))
          (number "7" (effects (font (size 1.27 1.27))))
        )
        (pin passive line (at 0 5.08 270) (length 2.54) hide
          (name "~" (effects (font (size 1.27 1.27))))
          (number "8" (effects (font (size 1.27 1.27))))
        )
        (pin passive line (at 0 -5.08 90) (length 2.54) hide
          (name "~" (effects (font (size 1.27 1.27))))
          (number "9" (effects (font (size 1.27 1.27))))
        )
      )
    )
    (symbol "power:GND" (power) (pin_names (offset 0)) (in_bom yes) (on_board yes)
      (property "Reference" "#PWR" (at 0 -6.35 0)
        (effects (font (size 1.27 1.27)) hide)
      )
      (property "Value" "GND" (at 0 -3.81 0)
        (effects (font (size 1.27 1.27)))
      )
      (property "Footprint" "" (at 0 0 0)
        (effects (font (size 1.27 1.27)) hide)
      )
      (property "Datasheet" "" (at 0 0 0)
        (effects (font (size 1.27 1.27)) hide)
      )
      (property "ki_keywords" "global power" (at 0 0 0)
        (effects (font (size 1.27 1.27)) hide)
      )
      (property "ki_description" "Power symbol creates a global label with name \"GND\" , ground" (at 0 0 0)
        (effects (font (size 1.27 1.27)) hide)
      )
      (symbol "GND_0_1"
        (polyline
          (pts
            (xy 0 0)
            (xy 0 -1.27)
            (xy 1.27 -1.27)
            (xy 0 -2.54)
            (xy -1.27 -1.27)
            (xy 0 -1.27)
          )
          (stroke (width 0) (type default))
          (fill (type none))
        )
      )
      (symbol "GND_1_1"
        (pin power_in line (at 0 0 270) (length 0) hide
          (name "GND" (effects (font (size 1.27 1.27))))
          (number "1" (effects (font (size 1.27 1.27))))
        )
      )
    )
  )

  (junction (at 151.13 93.98) (diameter 0) (color 0 0 0 0)
    (uuid 0b0c80a5-e1cd-4203-b088-6d78456a5361)
  )
  (junction (at 120.65 111.76) (diameter 0) (color 0 0 0 0)
    (uuid 1386fc75-affa-4fc5-9d00-7127b843f59c)
  )
  (junction (at 148.59 93.98) (diameter 0) (color 0 0 0 0)
    (uuid 15efe4e9-001c-4995-bb9e-ccc05d496462)
  )
  (junction (at 73.66 121.92) (diameter 0) (color 0 0 0 0)
    (uuid 23d84303-96f0-4df6-ab5f-7fcb432c28f7)
  )
  (junction (at 165.1 119.38) (diameter 0) (color 0 0 0 0)
    (uuid 747d4931-3e8f-4d12-bd4a-2ac66a310e93)
  )
  (junction (at 144.78 129.54) (diameter 0) (color 0 0 0 0)
    (uuid b4e63022-16b9-4c43-969b-674a828ef697)
  )
  (junction (at 120.65 121.92) (diameter 0) (color 0 0 0 0)
    (uuid be468565-f14b-44c7-9cf4-cd6b29a76d96)
  )

  (no_connect (at 138.43 104.14) (uuid 37899d83-5288-4e90-ab3a-c5be950b0f0f))
  (no_connect (at 138.43 119.38) (uuid da066803-8b72-47cc-b295-3671461cc9ee))

  (wire (pts (xy 115.57 121.92) (xy 120.65 121.92))
    (stroke (width 0) (type default))
    (uuid 108d2ac9-cab8-4c0d-b3b6-eba829f0561f)
  )
  (wire (pts (xy 120.65 121.92) (xy 127 121.92))
    (stroke (width 0) (type default))
    (uuid 11ce9f63-a6e6-42e1-87cc-6efbdbb08859)
  )
  (wire (pts (xy 102.87 107.95) (xy 102.87 109.22))
    (stroke (width 0) (type default))
    (uuid 17d36a4a-6b39-4275-9ac4-3d38691eb065)
  )
  (wire (pts (xy 115.57 116.84) (xy 115.57 121.92))
    (stroke (width 0) (type default))
    (uuid 28547d46-fd46-4ba2-bb63-3d1dea1bff44)
  )
  (wire (pts (xy 154.94 125.73) (xy 154.94 128.27))
    (stroke (width 0) (type default))
    (uuid 28d80512-e2a5-4524-bef5-abe9ebc4a7d9)
  )
  (wire (pts (xy 73.66 121.92) (xy 80.01 121.92))
    (stroke (width 0) (type default))
    (uuid 2a1afa83-da73-44b8-837c-eaa1d70b5162)
  )
  (wire (pts (xy 148.59 90.17) (xy 148.59 93.98))
    (stroke (width 0) (type default))
    (uuid 2b07d7e6-3161-4262-8014-2f1077f65f80)
  )
  (wire (pts (xy 163.83 116.84) (xy 165.1 116.84))
    (stroke (width 0) (type default))
    (uuid 34fd6a0b-48fe-459d-b12e-0eda56c886cd)
  )
  (wire (pts (xy 115.57 111.76) (xy 120.65 111.76))
    (stroke (width 0) (type default))
    (uuid 3ed06851-0cd7-4e64-ac57-c21a1ba9e9ff)
  )
  (wire (pts (xy 151.13 124.46) (xy 151.13 125.73))
    (stroke (width 0) (type default))
    (uuid 4600f946-1e3e-48ea-b644-2b035f896a3d)
  )
  (wire (pts (xy 144.78 129.54) (xy 144.78 125.73))
    (stroke (width 0) (type default))
    (uuid 49bf8b1d-e693-4297-ab2d-3c5eb8371aec)
  )
  (wire (pts (xy 101.6 120.65) (xy 102.87 120.65))
    (stroke (width 0) (type default))
    (uuid 4dd917b4-c504-4e48-a50e-17552396f933)
  )
  (wire (pts (xy 73.66 121.92) (xy 73.66 123.19))
    (stroke (width 0) (type default))
    (uuid 4e3c129e-daae-4c6f-bb79-cfc6e0ab5ee6)
  )
  (wire (pts (xy 140.97 129.54) (xy 144.78 129.54))
    (stroke (width 0) (type default))
    (uuid 4f435fa9-9dd9-4da4-bea5-c3d36be69c82)
  )
  (wire (pts (xy 125.73 106.68) (xy 138.43 106.68))
    (stroke (width 0) (type default))
    (uuid 50a0dbb7-af25-46be-98b4-0cc09454bd1b)
  )
  (wire (pts (xy 165.1 106.68) (xy 163.83 106.68))
    (stroke (width 0) (type default))
    (uuid 54d700fa-dfce-498a-b0b3-810a0aa8c37c)
  )
  (wire (pts (xy 101.6 116.84) (xy 115.57 116.84))
    (stroke (width 0) (type default))
    (uuid 565fa602-29d3-4286-8964-61387181a1be)
  )
  (wire (pts (xy 144.78 129.54) (xy 144.78 130.81))
    (stroke (width 0) (type default))
    (uuid 5a258f04-fa63-4b6a-8972-337757d59648)
  )
  (wire (pts (xy 82.55 118.11) (xy 80.01 118.11))
    (stroke (width 0) (type default))
    (uuid 62cf3d5b-feed-4a9f-b735-91fa583e240d)
  )
  (wire (pts (xy 151.13 93.98) (xy 151.13 99.06))
    (stroke (width 0) (type default))
    (uuid 673624a3-e547-4533-ba39-02c4fc54746a)
  )
  (wire (pts (xy 115.57 114.3) (xy 115.57 111.76))
    (stroke (width 0) (type default))
    (uuid 68af3f96-99d3-43c7-b064-9f85e5013779)
  )
  (wire (pts (xy 102.87 120.65) (xy 102.87 121.92))
    (stroke (width 0) (type default))
    (uuid 72364ee7-bd14-4ba5-a723-7eefb7b02608)
  )
  (wire (pts (xy 175.895 111.76) (xy 175.895 113.03))
    (stroke (width 0) (type default))
    (uuid 79140f91-5c32-4dfb-9484-21de01e7af0c)
  )
  (wire (pts (xy 144.78 125.73) (xy 148.59 125.73))
    (stroke (width 0) (type default))
    (uuid 7c3d6d7f-f30e-4517-aa33-5ead0967e920)
  )
  (wire (pts (xy 148.59 93.98) (xy 148.59 99.06))
    (stroke (width 0) (type default))
    (uuid 82b1cf22-c550-4ad2-bff4-d34cd67ef501)
  )
  (wire (pts (xy 151.13 125.73) (xy 154.94 125.73))
    (stroke (width 0) (type default))
    (uuid 82eac7e9-c95e-42d6-8ec3-f5bebd683022)
  )
  (wire (pts (xy 153.67 93.98) (xy 151.13 93.98))
    (stroke (width 0) (type default))
    (uuid 8c362984-d467-4c57-b630-e4fad2debb55)
  )
  (wire (pts (xy 165.1 119.38) (xy 165.1 120.65))
    (stroke (width 0) (type default))
    (uuid 911a2055-5f1a-4ade-8623-4500d814da5b)
  )
  (wire (pts (xy 165.1 104.14) (xy 163.83 104.14))
    (stroke (width 0) (type default))
    (uuid 944408ca-b746-434a-bf96-984f0c80d85e)
  )
  (wire (pts (xy 138.43 109.22) (xy 127 109.22))
    (stroke (width 0) (type default))
    (uuid 9be3c767-e0ef-4196-88aa-ac91d161ecc9)
  )
  (wire (pts (xy 73.66 113.03) (xy 82.55 113.03))
    (stroke (width 0) (type default))
    (uuid a55531a4-ff14-4278-8732-65f6d18603b1)
  )
  (wire (pts (xy 120.65 121.92) (xy 120.65 120.65))
    (stroke (width 0) (type default))
    (uuid ae7f92fc-4744-42d0-af38-69009b0c3a57)
  )
  (wire (pts (xy 102.87 109.22) (xy 101.6 109.22))
    (stroke (width 0) (type default))
    (uuid b792b916-9c14-4fc6-8ec7-bb207395e0ef)
  )
  (wire (pts (xy 80.01 118.11) (xy 80.01 121.92))
    (stroke (width 0) (type default))
    (uuid c3493077-1118-4b65-834a-c609303585e0)
  )
  (wire (pts (xy 120.65 111.76) (xy 120.65 113.03))
    (stroke (width 0) (type default))
    (uuid d220f126-7d08-446c-8d6d-a17793f88758)
  )
  (wire (pts (xy 120.65 121.92) (xy 120.65 123.19))
    (stroke (width 0) (type default))
    (uuid d6a0e04e-bad0-4558-93d9-3f2ee9a5477f)
  )
  (wire (pts (xy 151.13 90.17) (xy 151.13 93.98))
    (stroke (width 0) (type default))
    (uuid d6e066d5-fb07-4cc5-bc59-de3b3b4bb075)
  )
  (wire (pts (xy 148.59 93.98) (xy 144.78 93.98))
    (stroke (width 0) (type default))
    (uuid d756f6d6-59e0-487e-ad21-0491e746f479)
  )
  (wire (pts (xy 165.1 116.84) (xy 165.1 119.38))
    (stroke (width 0) (type default))
    (uuid da13e26a-4a43-4fff-8660-91272af18f6a)
  )
  (wire (pts (xy 148.59 125.73) (xy 148.59 124.46))
    (stroke (width 0) (type default))
    (uuid e2887cad-0722-4145-b00e-f6f9abad8380)
  )
  (wire (pts (xy 163.83 119.38) (xy 165.1 119.38))
    (stroke (width 0) (type default))
    (uuid e3b6dbb1-1df9-4034-bb43-291e30b84f98)
  )
  (wire (pts (xy 101.6 114.3) (xy 115.57 114.3))
    (stroke (width 0) (type default))
    (uuid e44c80c4-4104-460e-978b-c84c2c3b3478)
  )
  (wire (pts (xy 127 109.22) (xy 127 121.92))
    (stroke (width 0) (type default))
    (uuid eee42a33-369e-4e92-82a3-27c48653c2b4)
  )
  (wire (pts (xy 73.66 121.92) (xy 73.66 120.65))
    (stroke (width 0) (type default))
    (uuid f2cf68f6-f1df-420a-83e3-b1670c9378b9)
  )
  (wire (pts (xy 163.83 111.76) (xy 175.895 111.76))
    (stroke (width 0) (type default))
    (uuid f6a92168-cb9c-4e0b-94db-a08162ae7995)
  )

  (text "Typical Vf = 1-1.2V\nRated current = 50mA\nMaximum current = 150mA\n\nThis limit resistor puts\nVf = 2.0 under normal operation\nand needs to be specced to 1/2W\nfor the maximum limit"
    (at 80.01 97.79 0)
    (effects (font (size 1.27 1.27)) (justify left bottom))
    (uuid 245f7bd4-f2f5-40b9-bf60-a6711db90a6a)
  )
  (text "Resistance of WB is ~D\nRmin = 60 Ohms\nCurrent limit is 20mA\n\nO1 to pulldown on SHDN implies\npower down on startup instead of midscale"
    (at 180.34 116.84 0)
    (effects (font (size 1.27 1.27)) (justify left bottom))
    (uuid 25f0d27d-8f21-42ec-9e90-de1ef811b292)
  )
  (text "Gain 25" (at 87.63 132.08 0)
    (effects (font (size 1.27 1.27)) (justify left bottom))
    (uuid 91e6098e-dd46-41a0-b6d9-f41da94f3b1f)
  )
  (text "20k Pot + 4 Ohm Rout = 50mA Max" (at 102.87 134.62 0)
    (effects (font (size 1.27 1.27)) (justify left bottom))
    (uuid bfab1b7c-7b11-4512-9711-8a116667437e)
  )
  (text "0b0101100" (at 161.29 128.27 0)
    (effects (font (size 1.27 1.27)) (justify left bottom))
    (uuid d3b20f55-4945-496a-b58a-4646c67797f7)
  )

  (label "DIGIPOT_O1" (at 175.895 111.76 180) (fields_autoplaced)
    (effects (font (size 1.27 1.27)) (justify right bottom))
    (uuid 13878bc5-ec24-4a5a-b551-d570850c71b7)
  )
  (label "DIGIPOT_O1" (at 138.43 116.84 180) (fields_autoplaced)
    (effects (font (size 1.27 1.27)) (justify right bottom))
    (uuid 4a689eaa-3f54-47ee-803e-400f761fb2ee)
  )

  (hierarchical_label "SCL" (shape input) (at 165.1 104.14 0) (fields_autoplaced)
    (effects (font (size 1.27 1.27)) (justify left))
    (uuid 473b295c-6710-4241-83c9-a484c7c5bb86)
  )
  (hierarchical_label "-3V3" (shape input) (at 144.78 130.81 270) (fields_autoplaced)
    (effects (font (size 1.27 1.27)) (justify right))
    (uuid 55c6dc78-7218-4db0-87e7-5c11e1c74033)
  )
  (hierarchical_label "3V3" (shape input) (at 148.59 90.17 90) (fields_autoplaced)
    (effects (font (size 1.27 1.27)) (justify left))
    (uuid 81d5b75d-8aaa-4613-ad74-b5767db81ba4)
  )
  (hierarchical_label "-3V3" (shape input) (at 120.65 123.19 270) (fields_autoplaced)
    (effects (font (size 1.27 1.27)) (justify right))
    (uuid 9120f1e1-58e4-4854-9210-b48f4bb201a8)
  )
  (hierarchical_label "5VA" (shape input) (at 151.13 90.17 90) (fields_autoplaced)
    (effects (font (size 1.27 1.27)) (justify left))
    (uuid 92d0e4bc-2a53-4e72-b463-4b01ae91c82c)
  )
  (hierarchical_label "5VA" (shape input) (at 102.87 107.95 90) (fields_autoplaced)
    (effects (font (size 1.27 1.27)) (justify left))
    (uuid 9a419ac7-57e1-43a6-9034-a4c473517897)
  )
  (hierarchical_label "I_In" (shape input) (at 120.65 93.98 90) (fields_autoplaced)
    (effects (font (size 1.27 1.27)) (justify left))
    (uuid e6772b4f-fb97-44b0-88b4-9796ab555180)
  )
  (hierarchical_label "SDA" (shape bidirectional) (at 165.1 106.68 0) (fields_autoplaced)
    (effects (font (size 1.27 1.27)) (justify left))
    (uuid f9828334-f448-44d8-a2d4-0052c666f7ac)
  )

  (symbol (lib_id "DSA2K:MAX9920") (at 91.44 115.57 0) (mirror y) (unit 1)
    (in_bom yes) (on_board yes) (dnp no)
    (uuid 0dd59054-05a3-477f-b965-845c7413a472)
    (property "Reference" "U15" (at 91.44 124.46 0)
      (effects (font (size 1.27 1.27)))
    )
    (property "Value" "MAX9920" (at 91.44 126.365 0)
      (effects (font (size 1.27 1.27)))
    )
    (property "Footprint" "Package_SO:SOIC-8-1EP_3.9x4.9mm_P1.27mm_EP2.29x3mm" (at 91.44 107.315 0)
      (effects (font (size 1.27 1.27)) hide)
    )
    (property "Datasheet" "https://www.analog.com/media/en/technical-documentation/data-sheets/MAX9918-MAX9920.pdf" (at 91.44 107.315 0)
      (effects (font (size 1.27 1.27)) hide)
    )
    (property "MPN" "MAX9920ASA" (at 91.44 115.57 0)
      (effects (font (size 1.27 1.27)) hide)
    )
    (pin "1" (uuid bc3f74cf-8d7a-4d70-817a-53ba123124c9))
    (pin "2" (uuid 149c5974-5470-4db6-b3c0-e35002e5c5e9))
    (pin "3" (uuid 43832f81-9495-4d99-af57-ea645fe1a56e))
    (pin "4" (uuid a297b043-1840-4e8f-af23-3a8ffd965e56))
    (pin "5" (uuid 7422321b-cff7-49e2-bf56-b8ff2c71d69d))
    (pin "6" (uuid 51d7b0c8-75c4-4276-a945-9cce8d9ee1e2))
    (pin "7" (uuid 33b326d8-809c-4c9e-8a3c-77b9fe3a5172))
    (pin "8" (uuid 02094ca7-6b73-43ba-b5f0-e0a2ef1924e1))
    (pin "9" (uuid 6ee9c846-f495-47d4-b40a-f4c9e3f98fff))
    (instances
      (project "ftx"
        (path "/9da63cf1-7a13-4903-bc82-176c674403f0/eb136dee-8e82-4540-9cf5-03584b9ea699"
          (reference "U15") (unit 1)
        )
        (path "/9da63cf1-7a13-4903-bc82-176c674403f0/eb136dee-8e82-4540-9cf5-03584b9ea699/10b4f85d-adcc-418b-81ce-517d011a9573"
          (reference "U4") (unit 1)
        )
      )
      (project "FiberTransmitter"
        (path "/bb93828a-0f26-4513-bed9-3adfe581bda2/2cd3bf37-6973-4302-9606-2e838ca6b577"
          (reference "U9") (unit 1)
        )
      )
    )
  )

  (symbol (lib_id "Device:R") (at 73.66 127 0) (unit 1)
    (in_bom yes) (on_board yes) (dnp no) (fields_autoplaced)
    (uuid 23310601-a785-4051-a8f4-5d43b83dd0fb)
    (property "Reference" "R23" (at 76.2 125.73 0)
      (effects (font (size 1.27 1.27)) (justify left))
    )
    (property "Value" "R" (at 76.2 128.27 0)
      (effects (font (size 1.27 1.27)) (justify left))
    )
    (property "Footprint" "" (at 71.882 127 90)
      (effects (font (size 1.27 1.27)) hide)
    )
    (property "Datasheet" "~" (at 73.66 127 0)
      (effects (font (size 1.27 1.27)) hide)
    )
    (pin "1" (uuid 46314f2c-6ce9-4ded-b4bb-c994947ce2e7))
    (pin "2" (uuid babfeac2-d5b0-4106-b339-0ae381d3ac90))
    (instances
      (project "ftx"
        (path "/9da63cf1-7a13-4903-bc82-176c674403f0/eb136dee-8e82-4540-9cf5-03584b9ea699/10b4f85d-adcc-418b-81ce-517d011a9573"
          (reference "R23") (unit 1)
        )
      )
    )
  )

  (symbol (lib_id "power:GND") (at 154.94 128.27 0) (mirror y) (unit 1)
    (in_bom yes) (on_board yes) (dnp no) (fields_autoplaced)
    (uuid 48beb537-bc04-4d63-9c4a-54387eeaaa7b)
    (property "Reference" "#PWR060" (at 154.94 134.62 0)
      (effects (font (size 1.27 1.27)) hide)
    )
    (property "Value" "GND" (at 154.94 132.715 0)
      (effects (font (size 1.27 1.27)))
    )
    (property "Footprint" "" (at 154.94 128.27 0)
      (effects (font (size 1.27 1.27)) hide)
    )
    (property "Datasheet" "" (at 154.94 128.27 0)
      (effects (font (size 1.27 1.27)) hide)
    )
    (pin "1" (uuid 28fa5cd3-cd2d-4bc0-bbe5-72a74995c732))
    (instances
      (project "ftx"
        (path "/9da63cf1-7a13-4903-bc82-176c674403f0/eb136dee-8e82-4540-9cf5-03584b9ea699"
          (reference "#PWR060") (unit 1)
        )
        (path "/9da63cf1-7a13-4903-bc82-176c674403f0/eb136dee-8e82-4540-9cf5-03584b9ea699/10b4f85d-adcc-418b-81ce-517d011a9573"
          (reference "#PWR017") (unit 1)
        )
      )
    )
  )

  (symbol (lib_id "Reference_Current:LT3092xDD") (at 120.65 106.68 0) (unit 1)
    (in_bom yes) (on_board yes) (dnp no) (fields_autoplaced)
    (uuid 6378704f-7a54-46d4-acfa-6ee7f6e97416)
    (property "Reference" "U14" (at 117.475 105.7275 0)
      (effects (font (size 1.27 1.27)) (justify right))
    )
    (property "Value" "LT3092xDD" (at 117.475 108.2675 0)
      (effects (font (size 1.27 1.27)) (justify right))
    )
    (property "Footprint" "Package_DFN_QFN:DFN-8-1EP_3x3mm_P0.5mm_EP1.66x2.38mm" (at 121.285 110.49 0)
      (effects (font (size 1.27 1.27) italic) (justify left) hide)
    )
    (property "Datasheet" "https://www.analog.com/media/en/technical-documentation/data-sheets/3092fc.pdf" (at 120.65 106.68 0)
      (effects (font (size 1.27 1.27) italic) hide)
    )
    (property "MPN" "LT3092EDD" (at 120.65 106.68 0)
      (effects (font (size 1.27 1.27)) hide)
    )
    (pin "1" (uuid d472a6b2-1373-4f6e-995d-28e11c2c13e2))
    (pin "2" (uuid 573527c8-ada0-47e6-9d8b-9539ea6ee9ea))
    (pin "3" (uuid ccf2573a-35f2-4c79-957f-359f896b132f))
    (pin "4" (uuid fa903f96-ef58-4397-8500-a0141a442190))
    (pin "5" (uuid 541e8596-0140-44eb-83c6-020021238c38))
    (pin "6" (uuid d7313869-6b3f-4f7f-b036-3d203d09a3c4))
    (pin "7" (uuid f063cb7e-3093-427a-a1fa-ce44273eacac))
    (pin "8" (uuid a3b811e5-1254-4b80-a689-7199530c2c3c))
    (pin "9" (uuid 307bec63-b623-4e42-92ca-b8ebee8aedfa))
    (instances
      (project "ftx"
        (path "/9da63cf1-7a13-4903-bc82-176c674403f0/eb136dee-8e82-4540-9cf5-03584b9ea699"
          (reference "U14") (unit 1)
        )
        (path "/9da63cf1-7a13-4903-bc82-176c674403f0/eb136dee-8e82-4540-9cf5-03584b9ea699/10b4f85d-adcc-418b-81ce-517d011a9573"
          (reference "U11") (unit 1)
        )
      )
      (project "FiberTransmitter"
        (path "/bb93828a-0f26-4513-bed9-3adfe581bda2/2cd3bf37-6973-4302-9606-2e838ca6b577"
          (reference "U7") (unit 1)
        )
      )
    )
  )

  (symbol (lib_id "power:GND") (at 161.29 93.98 90) (mirror x) (unit 1)
    (in_bom yes) (on_board yes) (dnp no) (fields_autoplaced)
    (uuid 7501f084-156a-4e4c-97c8-29ba86c65896)
    (property "Reference" "#PWR060" (at 167.64 93.98 0)
      (effects (font (size 1.27 1.27)) hide)
    )
    (property "Value" "GND" (at 165.1 93.98 90)
      (effects (font (size 1.27 1.27)) (justify right))
    )
    (property "Footprint" "" (at 161.29 93.98 0)
      (effects (font (size 1.27 1.27)) hide)
    )
    (property "Datasheet" "" (at 161.29 93.98 0)
      (effects (font (size 1.27 1.27)) hide)
    )
    (pin "1" (uuid 5a3d02a4-9d3b-4f43-b2a1-b7a1a7de2dd9))
    (instances
      (project "ftx"
        (path "/9da63cf1-7a13-4903-bc82-176c674403f0/eb136dee-8e82-4540-9cf5-03584b9ea699"
          (reference "#PWR060") (unit 1)
        )
        (path "/9da63cf1-7a13-4903-bc82-176c674403f0/eb136dee-8e82-4540-9cf5-03584b9ea699/10b4f85d-adcc-418b-81ce-517d011a9573"
          (reference "#PWR023") (unit 1)
        )
      )
    )
  )

  (symbol (lib_id "Potentiometer_Digital:AD5280") (at 151.13 111.76 0) (mirror y) (unit 1)
    (in_bom yes) (on_board yes) (dnp no) (fields_autoplaced)
    (uuid 7add3c62-de27-482c-8754-d32602186dd7)
    (property "Reference" "U11" (at 146.3959 97.155 0)
      (effects (font (size 1.27 1.27)) (justify left))
    )
    (property "Value" "AD5280" (at 146.3959 99.695 0)
      (effects (font (size 1.27 1.27)) (justify left))
    )
    (property "Footprint" "Package_SO:TSSOP-14_4.4x5mm_P0.65mm" (at 151.13 127 0)
      (effects (font (size 1.27 1.27)) hide)
    )
    (property "Datasheet" "https://www.analog.com/media/en/technical-documentation/data-sheets/AD5280_5282.pdf" (at 148.59 116.84 0)
      (effects (font (size 1.27 1.27)) hide)
    )
    (pin "1" (uuid e3f7991f-5caa-4f20-b5bd-f5df7201c6bf))
    (pin "10" (uuid 7d9419a5-67f4-43e1-b61e-06a2477c7e40))
    (pin "11" (uuid 85c7b9db-6ed0-45a0-b2a0-314249e62953))
    (pin "12" (uuid d41c6f8c-eab3-4794-a56d-b79ee2697174))
    (pin "13" (uuid 0ea9f621-d71e-4f41-aa3f-a2aab23ec6a4))
    (pin "14" (uuid 7e10aea7-17f2-495e-b8c3-86a7a81ee8ea))
    (pin "2" (uuid 1a23ad2e-1004-41ce-bf1f-3a2cff2a089b))
    (pin "3" (uuid 863d86ba-c4cd-4449-9ec1-3e5e34036db4))
    (pin "4" (uuid 573cd674-142d-4bd5-a848-87ec8ad076ef))
    (pin "5" (uuid 263ba9f7-02e2-4927-92f9-002b171f6a99))
    (pin "6" (uuid 9576236d-1e8c-4124-925f-07fa59a6d745))
    (pin "7" (uuid 11abe4e0-5ae5-41b4-a81d-0fe23b1f0938))
    (pin "8" (uuid 8f262205-b9c5-4612-b9cd-1a66a2dcc15a))
    (pin "9" (uuid 74b538fb-c9d8-41f2-8ab1-74baa82e3045))
    (instances
      (project "ftx"
        (path "/9da63cf1-7a13-4903-bc82-176c674403f0/eb136dee-8e82-4540-9cf5-03584b9ea699"
          (reference "U11") (unit 1)
        )
        (path "/9da63cf1-7a13-4903-bc82-176c674403f0/eb136dee-8e82-4540-9cf5-03584b9ea699/10b4f85d-adcc-418b-81ce-517d011a9573"
          (reference "U14") (unit 1)
        )
      )
    )
  )

  (symbol (lib_id "Device:C") (at 157.48 93.98 90) (mirror x) (unit 1)
    (in_bom yes) (on_board yes) (dnp no) (fields_autoplaced)
    (uuid 85e22fab-0ffe-4c03-8fc7-6de060b92d76)
    (property "Reference" "C40" (at 157.48 86.36 90)
      (effects (font (size 1.27 1.27)))
    )
    (property "Value" "100n" (at 157.48 88.9 90)
      (effects (font (size 1.27 1.27)))
    )
    (property "Footprint" "" (at 161.29 94.9452 0)
      (effects (font (size 1.27 1.27)) hide)
    )
    (property "Datasheet" "~" (at 157.48 93.98 0)
      (effects (font (size 1.27 1.27)) hide)
    )
    (pin "1" (uuid a77f37bb-5a42-4f59-9eaa-a90f79e0d819))
    (pin "2" (uuid 2bd3fe36-5c87-4f25-b344-85846a44c9aa))
    (instances
      (project "ftx"
        (path "/9da63cf1-7a13-4903-bc82-176c674403f0/eb136dee-8e82-4540-9cf5-03584b9ea699"
          (reference "C40") (unit 1)
        )
        (path "/9da63cf1-7a13-4903-bc82-176c674403f0/eb136dee-8e82-4540-9cf5-03584b9ea699/10b4f85d-adcc-418b-81ce-517d011a9573"
          (reference "C35") (unit 1)
        )
      )
    )
  )

  (symbol (lib_id "power:GND") (at 137.16 93.98 270) (mirror x) (unit 1)
    (in_bom yes) (on_board yes) (dnp no) (fields_autoplaced)
    (uuid 8ffe1f76-c4ba-4025-af97-b57cf291c2f9)
    (property "Reference" "#PWR060" (at 130.81 93.98 0)
      (effects (font (size 1.27 1.27)) hide)
    )
    (property "Value" "GND" (at 133.35 93.98 90)
      (effects (font (size 1.27 1.27)) (justify right))
    )
    (property "Footprint" "" (at 137.16 93.98 0)
      (effects (font (size 1.27 1.27)) hide)
    )
    (property "Datasheet" "" (at 137.16 93.98 0)
      (effects (font (size 1.27 1.27)) hide)
    )
    (pin "1" (uuid d24f5a48-c3ac-4695-b959-bdf45971d28b))
    (instances
      (project "ftx"
        (path "/9da63cf1-7a13-4903-bc82-176c674403f0/eb136dee-8e82-4540-9cf5-03584b9ea699"
          (reference "#PWR060") (unit 1)
        )
        (path "/9da63cf1-7a13-4903-bc82-176c674403f0/eb136dee-8e82-4540-9cf5-03584b9ea699/10b4f85d-adcc-418b-81ce-517d011a9573"
          (reference "#PWR020") (unit 1)
        )
      )
    )
  )

  (symbol (lib_id "Device:R") (at 175.895 116.84 0) (mirror y) (unit 1)
    (in_bom yes) (on_board yes) (dnp no) (fields_autoplaced)
    (uuid 95a5fc18-81dc-4a24-9251-f74877109cf1)
    (property "Reference" "R23" (at 173.355 115.57 0)
      (effects (font (size 1.27 1.27)) (justify left))
    )
    (property "Value" "10k" (at 173.355 118.11 0)
      (effects (font (size 1.27 1.27)) (justify left))
    )
    (property "Footprint" "" (at 177.673 116.84 90)
      (effects (font (size 1.27 1.27)) hide)
    )
    (property "Datasheet" "~" (at 175.895 116.84 0)
      (effects (font (size 1.27 1.27)) hide)
    )
    (pin "1" (uuid 0910adbc-3df1-46ad-8af8-b7c7e675375e))
    (pin "2" (uuid e93b36c1-bd8f-48c4-b25c-c82ea2e46502))
    (instances
      (project "ftx"
        (path "/9da63cf1-7a13-4903-bc82-176c674403f0/eb136dee-8e82-4540-9cf5-03584b9ea699"
          (reference "R23") (unit 1)
        )
        (path "/9da63cf1-7a13-4903-bc82-176c674403f0/eb136dee-8e82-4540-9cf5-03584b9ea699/10b4f85d-adcc-418b-81ce-517d011a9573"
          (reference "R26") (unit 1)
        )
      )
    )
  )

  (symbol (lib_id "power:GND") (at 175.895 120.65 0) (mirror y) (unit 1)
    (in_bom yes) (on_board yes) (dnp no) (fields_autoplaced)
    (uuid a48144f4-0638-4d6a-ac1e-ace1d34eab91)
    (property "Reference" "#PWR068" (at 175.895 127 0)
      (effects (font (size 1.27 1.27)) hide)
    )
    (property "Value" "GND" (at 175.895 125.095 0)
      (effects (font (size 1.27 1.27)))
    )
    (property "Footprint" "" (at 175.895 120.65 0)
      (effects (font (size 1.27 1.27)) hide)
    )
    (property "Datasheet" "" (at 175.895 120.65 0)
      (effects (font (size 1.27 1.27)) hide)
    )
    (pin "1" (uuid a5016693-1998-4516-9d4c-513775fedceb))
    (instances
      (project "ftx"
        (path "/9da63cf1-7a13-4903-bc82-176c674403f0/eb136dee-8e82-4540-9cf5-03584b9ea699"
          (reference "#PWR068") (unit 1)
        )
        (path "/9da63cf1-7a13-4903-bc82-176c674403f0/eb136dee-8e82-4540-9cf5-03584b9ea699/10b4f85d-adcc-418b-81ce-517d011a9573"
          (reference "#PWR069") (unit 1)
        )
      )
    )
  )

  (symbol (lib_id "Device:R") (at 120.65 116.84 0) (unit 1)
    (in_bom yes) (on_board yes) (dnp no) (fields_autoplaced)
    (uuid a85f3f7e-28b9-4209-89b0-9521087c6fd2)
    (property "Reference" "R26" (at 123.19 115.57 0)
      (effects (font (size 1.27 1.27)) (justify left))
    )
    (property "Value" "4" (at 123.19 118.11 0)
      (effects (font (size 1.27 1.27)) (justify left))
    )
    (property "Footprint" "" (at 118.872 116.84 90)
      (effects (font (size 1.27 1.27)) hide)
    )
    (property "Datasheet" "~" (at 120.65 116.84 0)
      (effects (font (size 1.27 1.27)) hide)
    )
    (pin "1" (uuid c9fc38f1-d838-4a7e-b17a-d2a823be057e))
    (pin "2" (uuid 434bdcdb-62a7-416b-ac97-5e1f635cc769))
    (instances
      (project "ftx"
        (path "/9da63cf1-7a13-4903-bc82-176c674403f0/eb136dee-8e82-4540-9cf5-03584b9ea699"
          (reference "R26") (unit 1)
        )
        (path "/9da63cf1-7a13-4903-bc82-176c674403f0/eb136dee-8e82-4540-9cf5-03584b9ea699/10b4f85d-adcc-418b-81ce-517d011a9573"
          (reference "R5") (unit 1)
        )
      )
    )
  )

  (symbol (lib_id "power:GND") (at 133.35 129.54 270) (mirror x) (unit 1)
    (in_bom yes) (on_board yes) (dnp no) (fields_autoplaced)
    (uuid b07acdcf-d895-4cac-9915-bf04e544c0bf)
    (property "Reference" "#PWR060" (at 127 129.54 0)
      (effects (font (size 1.27 1.27)) hide)
    )
    (property "Value" "GND" (at 129.54 129.54 90)
      (effects (font (size 1.27 1.27)) (justify right))
    )
    (property "Footprint" "" (at 133.35 129.54 0)
      (effects (font (size 1.27 1.27)) hide)
    )
    (property "Datasheet" "" (at 133.35 129.54 0)
      (effects (font (size 1.27 1.27)) hide)
    )
    (pin "1" (uuid 0ccdf460-91b8-4cfb-9792-e46b553186e5))
    (instances
      (project "ftx"
        (path "/9da63cf1-7a13-4903-bc82-176c674403f0/eb136dee-8e82-4540-9cf5-03584b9ea699"
          (reference "#PWR060") (unit 1)
        )
        (path "/9da63cf1-7a13-4903-bc82-176c674403f0/eb136dee-8e82-4540-9cf5-03584b9ea699/10b4f85d-adcc-418b-81ce-517d011a9573"
          (reference "#PWR018") (unit 1)
        )
      )
    )
  )

  (symbol (lib_id "Device:C") (at 140.97 93.98 90) (mirror x) (unit 1)
    (in_bom yes) (on_board yes) (dnp no) (fields_autoplaced)
    (uuid b265072f-be1b-43a3-be65-56e4d5dcdf4c)
    (property "Reference" "C40" (at 140.97 86.36 90)
      (effects (font (size 1.27 1.27)))
    )
    (property "Value" "100n" (at 140.97 88.9 90)
      (effects (font (size 1.27 1.27)))
    )
    (property "Footprint" "" (at 144.78 94.9452 0)
      (effects (font (size 1.27 1.27)) hide)
    )
    (property "Datasheet" "~" (at 140.97 93.98 0)
      (effects (font (size 1.27 1.27)) hide)
    )
    (pin "1" (uuid 28113415-5fb4-41a3-bccf-ba555a20353f))
    (pin "2" (uuid b4211ba0-e32c-4d54-9dd1-c17f63140e56))
    (instances
      (project "ftx"
        (path "/9da63cf1-7a13-4903-bc82-176c674403f0/eb136dee-8e82-4540-9cf5-03584b9ea699"
          (reference "C40") (unit 1)
        )
        (path "/9da63cf1-7a13-4903-bc82-176c674403f0/eb136dee-8e82-4540-9cf5-03584b9ea699/10b4f85d-adcc-418b-81ce-517d011a9573"
          (reference "C13") (unit 1)
        )
      )
    )
  )

  (symbol (lib_id "Device:R") (at 73.66 116.84 0) (unit 1)
    (in_bom yes) (on_board yes) (dnp no) (fields_autoplaced)
    (uuid b3346e29-31bf-48e9-b7f0-0f27bbf16f19)
    (property "Reference" "R6" (at 76.2 115.57 0)
      (effects (font (size 1.27 1.27)) (justify left))
    )
    (property "Value" "R" (at 76.2 118.11 0)
      (effects (font (size 1.27 1.27)) (justify left))
    )
    (property "Footprint" "" (at 71.882 116.84 90)
      (effects (font (size 1.27 1.27)) hide)
    )
    (property "Datasheet" "~" (at 73.66 116.84 0)
      (effects (font (size 1.27 1.27)) hide)
    )
    (pin "1" (uuid f7f9b190-f687-4a4c-b843-0b3f32fcb076))
    (pin "2" (uuid 4f822790-2295-4f23-b5a3-5c1b63c6193d))
    (instances
      (project "ftx"
        (path "/9da63cf1-7a13-4903-bc82-176c674403f0/eb136dee-8e82-4540-9cf5-03584b9ea699/10b4f85d-adcc-418b-81ce-517d011a9573"
          (reference "R6") (unit 1)
        )
      )
    )
  )

  (symbol (lib_id "Device:C") (at 137.16 129.54 90) (mirror x) (unit 1)
    (in_bom yes) (on_board yes) (dnp no) (fields_autoplaced)
    (uuid b9988afd-202a-4a77-87a9-0f91afbe9e07)
    (property "Reference" "C40" (at 137.16 121.92 90)
      (effects (font (size 1.27 1.27)))
    )
    (property "Value" "100n" (at 137.16 124.46 90)
      (effects (font (size 1.27 1.27)))
    )
    (property "Footprint" "" (at 140.97 130.5052 0)
      (effects (font (size 1.27 1.27)) hide)
    )
    (property "Datasheet" "~" (at 137.16 129.54 0)
      (effects (font (size 1.27 1.27)) hide)
    )
    (pin "1" (uuid 9e7d5125-d8b7-4c0c-9f35-5ebd9e3b07c1))
    (pin "2" (uuid ff8fc282-ae85-45d3-932b-49c6e548d8bb))
    (instances
      (project "ftx"
        (path "/9da63cf1-7a13-4903-bc82-176c674403f0/eb136dee-8e82-4540-9cf5-03584b9ea699"
          (reference "C40") (unit 1)
        )
        (path "/9da63cf1-7a13-4903-bc82-176c674403f0/eb136dee-8e82-4540-9cf5-03584b9ea699/10b4f85d-adcc-418b-81ce-517d011a9573"
          (reference "C11") (unit 1)
        )
      )
    )
  )

  (symbol (lib_id "power:GND") (at 102.87 121.92 0) (mirror y) (unit 1)
    (in_bom yes) (on_board yes) (dnp no) (fields_autoplaced)
    (uuid cf54f123-f27e-484b-a729-3aab7904f209)
    (property "Reference" "#PWR060" (at 102.87 128.27 0)
      (effects (font (size 1.27 1.27)) hide)
    )
    (property "Value" "GND" (at 102.87 126.365 0)
      (effects (font (size 1.27 1.27)))
    )
    (property "Footprint" "" (at 102.87 121.92 0)
      (effects (font (size 1.27 1.27)) hide)
    )
    (property "Datasheet" "" (at 102.87 121.92 0)
      (effects (font (size 1.27 1.27)) hide)
    )
    (pin "1" (uuid 9ab0c4da-1243-4f74-b813-2c6116e9b950))
    (instances
      (project "ftx"
        (path "/9da63cf1-7a13-4903-bc82-176c674403f0/eb136dee-8e82-4540-9cf5-03584b9ea699"
          (reference "#PWR060") (unit 1)
        )
        (path "/9da63cf1-7a13-4903-bc82-176c674403f0/eb136dee-8e82-4540-9cf5-03584b9ea699/10b4f85d-adcc-418b-81ce-517d011a9573"
          (reference "#PWR016") (unit 1)
        )
      )
    )
  )

  (symbol (lib_id "Device:R") (at 120.65 97.79 0) (mirror y) (unit 1)
    (in_bom yes) (on_board yes) (dnp no)
    (uuid e2589453-bdef-4848-b201-2f31eb0e4015)
    (property "Reference" "R24" (at 118.11 96.52 0)
      (effects (font (size 1.27 1.27)) (justify left))
    )
    (property "Value" "22" (at 118.11 99.06 0)
      (effects (font (size 1.27 1.27)) (justify left))
    )
    (property "Footprint" "" (at 122.428 97.79 90)
      (effects (font (size 1.27 1.27)) hide)
    )
    (property "Datasheet" "~" (at 120.65 97.79 0)
      (effects (font (size 1.27 1.27)) hide)
    )
    (pin "1" (uuid 20bdf503-bb76-4ef8-babf-f27e4a124d8f))
    (pin "2" (uuid e1443621-6599-4886-90d9-6c9a3e0a0110))
    (instances
      (project "ftx"
        (path "/9da63cf1-7a13-4903-bc82-176c674403f0/eb136dee-8e82-4540-9cf5-03584b9ea699"
          (reference "R24") (unit 1)
        )
        (path "/9da63cf1-7a13-4903-bc82-176c674403f0/eb136dee-8e82-4540-9cf5-03584b9ea699/10b4f85d-adcc-418b-81ce-517d011a9573"
          (reference "R4") (unit 1)
        )
      )
    )
  )

  (symbol (lib_id "power:GND") (at 165.1 120.65 0) (mirror y) (unit 1)
    (in_bom yes) (on_board yes) (dnp no) (fields_autoplaced)
    (uuid fb74c990-b624-487c-8e6f-c31a339a565c)
    (property "Reference" "#PWR068" (at 165.1 127 0)
      (effects (font (size 1.27 1.27)) hide)
    )
    (property "Value" "GND" (at 165.1 125.095 0)
      (effects (font (size 1.27 1.27)))
    )
    (property "Footprint" "" (at 165.1 120.65 0)
      (effects (font (size 1.27 1.27)) hide)
    )
    (property "Datasheet" "" (at 165.1 120.65 0)
      (effects (font (size 1.27 1.27)) hide)
    )
    (pin "1" (uuid 8c2a8100-73ea-4df4-80f4-35d69ada5ffe))
    (instances
      (project "ftx"
        (path "/9da63cf1-7a13-4903-bc82-176c674403f0/eb136dee-8e82-4540-9cf5-03584b9ea699"
          (reference "#PWR068") (unit 1)
        )
        (path "/9da63cf1-7a13-4903-bc82-176c674403f0/eb136dee-8e82-4540-9cf5-03584b9ea699/10b4f85d-adcc-418b-81ce-517d011a9573"
          (reference "#PWR074") (unit 1)
        )
      )
    )
  )
)
