(kicad_sch
	(version 20231120)
	(generator "eeschema")
	(generator_version "8.0")
	(uuid "9da63cf1-7a13-4903-bc82-176c674403f0")
	(paper "A4")
	(title_block
		(title "FTX schematic")
		(date "2024-07-01")
		(rev "4")
		(company "Caltech")
		(comment 1 "Kiran Shila")
		(comment 2 "Drawing ASP-310")
		(comment 3 "DSA2000")
	)
	(lib_symbols
		(symbol "Connector:Screw_Terminal_01x04"
			(pin_names
				(offset 1.016) hide)
			(exclude_from_sim no)
			(in_bom yes)
			(on_board yes)
			(property "Reference" "J"
				(at 0 5.08 0)
				(effects
					(font
						(size 1.27 1.27)
					)
				)
			)
			(property "Value" "Screw_Terminal_01x04"
				(at 0 -7.62 0)
				(effects
					(font
						(size 1.27 1.27)
					)
				)
			)
			(property "Footprint" ""
				(at 0 0 0)
				(effects
					(font
						(size 1.27 1.27)
					)
					(hide yes)
				)
			)
			(property "Datasheet" "~"
				(at 0 0 0)
				(effects
					(font
						(size 1.27 1.27)
					)
					(hide yes)
				)
			)
			(property "Description" "Generic screw terminal, single row, 01x04, script generated (kicad-library-utils/schlib/autogen/connector/)"
				(at 0 0 0)
				(effects
					(font
						(size 1.27 1.27)
					)
					(hide yes)
				)
			)
			(property "ki_keywords" "screw terminal"
				(at 0 0 0)
				(effects
					(font
						(size 1.27 1.27)
					)
					(hide yes)
				)
			)
			(property "ki_fp_filters" "TerminalBlock*:*"
				(at 0 0 0)
				(effects
					(font
						(size 1.27 1.27)
					)
					(hide yes)
				)
			)
			(symbol "Screw_Terminal_01x04_1_1"
				(rectangle
					(start -1.27 3.81)
					(end 1.27 -6.35)
					(stroke
						(width 0.254)
						(type default)
					)
					(fill
						(type background)
					)
				)
				(circle
					(center 0 -5.08)
					(radius 0.635)
					(stroke
						(width 0.1524)
						(type default)
					)
					(fill
						(type none)
					)
				)
				(circle
					(center 0 -2.54)
					(radius 0.635)
					(stroke
						(width 0.1524)
						(type default)
					)
					(fill
						(type none)
					)
				)
				(polyline
					(pts
						(xy -0.5334 -4.7498) (xy 0.3302 -5.588)
					)
					(stroke
						(width 0.1524)
						(type default)
					)
					(fill
						(type none)
					)
				)
				(polyline
					(pts
						(xy -0.5334 -2.2098) (xy 0.3302 -3.048)
					)
					(stroke
						(width 0.1524)
						(type default)
					)
					(fill
						(type none)
					)
				)
				(polyline
					(pts
						(xy -0.5334 0.3302) (xy 0.3302 -0.508)
					)
					(stroke
						(width 0.1524)
						(type default)
					)
					(fill
						(type none)
					)
				)
				(polyline
					(pts
						(xy -0.5334 2.8702) (xy 0.3302 2.032)
					)
					(stroke
						(width 0.1524)
						(type default)
					)
					(fill
						(type none)
					)
				)
				(polyline
					(pts
						(xy -0.3556 -4.572) (xy 0.508 -5.4102)
					)
					(stroke
						(width 0.1524)
						(type default)
					)
					(fill
						(type none)
					)
				)
				(polyline
					(pts
						(xy -0.3556 -2.032) (xy 0.508 -2.8702)
					)
					(stroke
						(width 0.1524)
						(type default)
					)
					(fill
						(type none)
					)
				)
				(polyline
					(pts
						(xy -0.3556 0.508) (xy 0.508 -0.3302)
					)
					(stroke
						(width 0.1524)
						(type default)
					)
					(fill
						(type none)
					)
				)
				(polyline
					(pts
						(xy -0.3556 3.048) (xy 0.508 2.2098)
					)
					(stroke
						(width 0.1524)
						(type default)
					)
					(fill
						(type none)
					)
				)
				(circle
					(center 0 0)
					(radius 0.635)
					(stroke
						(width 0.1524)
						(type default)
					)
					(fill
						(type none)
					)
				)
				(circle
					(center 0 2.54)
					(radius 0.635)
					(stroke
						(width 0.1524)
						(type default)
					)
					(fill
						(type none)
					)
				)
				(pin passive line
					(at -5.08 2.54 0)
					(length 3.81)
					(name "Pin_1"
						(effects
							(font
								(size 1.27 1.27)
							)
						)
					)
					(number "1"
						(effects
							(font
								(size 1.27 1.27)
							)
						)
					)
				)
				(pin passive line
					(at -5.08 0 0)
					(length 3.81)
					(name "Pin_2"
						(effects
							(font
								(size 1.27 1.27)
							)
						)
					)
					(number "2"
						(effects
							(font
								(size 1.27 1.27)
							)
						)
					)
				)
				(pin passive line
					(at -5.08 -2.54 0)
					(length 3.81)
					(name "Pin_3"
						(effects
							(font
								(size 1.27 1.27)
							)
						)
					)
					(number "3"
						(effects
							(font
								(size 1.27 1.27)
							)
						)
					)
				)
				(pin passive line
					(at -5.08 -5.08 0)
					(length 3.81)
					(name "Pin_4"
						(effects
							(font
								(size 1.27 1.27)
							)
						)
					)
					(number "4"
						(effects
							(font
								(size 1.27 1.27)
							)
						)
					)
				)
			)
		)
		(symbol "Device:C_Polarized"
			(pin_numbers hide)
			(pin_names
				(offset 0.254)
			)
			(exclude_from_sim no)
			(in_bom yes)
			(on_board yes)
			(property "Reference" "C"
				(at 0.635 2.54 0)
				(effects
					(font
						(size 1.27 1.27)
					)
					(justify left)
				)
			)
			(property "Value" "C_Polarized"
				(at 0.635 -2.54 0)
				(effects
					(font
						(size 1.27 1.27)
					)
					(justify left)
				)
			)
			(property "Footprint" ""
				(at 0.9652 -3.81 0)
				(effects
					(font
						(size 1.27 1.27)
					)
					(hide yes)
				)
			)
			(property "Datasheet" "~"
				(at 0 0 0)
				(effects
					(font
						(size 1.27 1.27)
					)
					(hide yes)
				)
			)
			(property "Description" "Polarized capacitor"
				(at 0 0 0)
				(effects
					(font
						(size 1.27 1.27)
					)
					(hide yes)
				)
			)
			(property "ki_keywords" "cap capacitor"
				(at 0 0 0)
				(effects
					(font
						(size 1.27 1.27)
					)
					(hide yes)
				)
			)
			(property "ki_fp_filters" "CP_*"
				(at 0 0 0)
				(effects
					(font
						(size 1.27 1.27)
					)
					(hide yes)
				)
			)
			(symbol "C_Polarized_0_1"
				(rectangle
					(start -2.286 0.508)
					(end 2.286 1.016)
					(stroke
						(width 0)
						(type default)
					)
					(fill
						(type none)
					)
				)
				(polyline
					(pts
						(xy -1.778 2.286) (xy -0.762 2.286)
					)
					(stroke
						(width 0)
						(type default)
					)
					(fill
						(type none)
					)
				)
				(polyline
					(pts
						(xy -1.27 2.794) (xy -1.27 1.778)
					)
					(stroke
						(width 0)
						(type default)
					)
					(fill
						(type none)
					)
				)
				(rectangle
					(start 2.286 -0.508)
					(end -2.286 -1.016)
					(stroke
						(width 0)
						(type default)
					)
					(fill
						(type outline)
					)
				)
			)
			(symbol "C_Polarized_1_1"
				(pin passive line
					(at 0 3.81 270)
					(length 2.794)
					(name "~"
						(effects
							(font
								(size 1.27 1.27)
							)
						)
					)
					(number "1"
						(effects
							(font
								(size 1.27 1.27)
							)
						)
					)
				)
				(pin passive line
					(at 0 -3.81 90)
					(length 2.794)
					(name "~"
						(effects
							(font
								(size 1.27 1.27)
							)
						)
					)
					(number "2"
						(effects
							(font
								(size 1.27 1.27)
							)
						)
					)
				)
			)
		)
		(symbol "Device:D_Zener"
			(pin_numbers hide)
			(pin_names
				(offset 1.016) hide)
			(exclude_from_sim no)
			(in_bom yes)
			(on_board yes)
			(property "Reference" "D"
				(at 0 2.54 0)
				(effects
					(font
						(size 1.27 1.27)
					)
				)
			)
			(property "Value" "D_Zener"
				(at 0 -2.54 0)
				(effects
					(font
						(size 1.27 1.27)
					)
				)
			)
			(property "Footprint" ""
				(at 0 0 0)
				(effects
					(font
						(size 1.27 1.27)
					)
					(hide yes)
				)
			)
			(property "Datasheet" "~"
				(at 0 0 0)
				(effects
					(font
						(size 1.27 1.27)
					)
					(hide yes)
				)
			)
			(property "Description" "Zener diode"
				(at 0 0 0)
				(effects
					(font
						(size 1.27 1.27)
					)
					(hide yes)
				)
			)
			(property "ki_keywords" "diode"
				(at 0 0 0)
				(effects
					(font
						(size 1.27 1.27)
					)
					(hide yes)
				)
			)
			(property "ki_fp_filters" "TO-???* *_Diode_* *SingleDiode* D_*"
				(at 0 0 0)
				(effects
					(font
						(size 1.27 1.27)
					)
					(hide yes)
				)
			)
			(symbol "D_Zener_0_1"
				(polyline
					(pts
						(xy 1.27 0) (xy -1.27 0)
					)
					(stroke
						(width 0)
						(type default)
					)
					(fill
						(type none)
					)
				)
				(polyline
					(pts
						(xy -1.27 -1.27) (xy -1.27 1.27) (xy -0.762 1.27)
					)
					(stroke
						(width 0.254)
						(type default)
					)
					(fill
						(type none)
					)
				)
				(polyline
					(pts
						(xy 1.27 -1.27) (xy 1.27 1.27) (xy -1.27 0) (xy 1.27 -1.27)
					)
					(stroke
						(width 0.254)
						(type default)
					)
					(fill
						(type none)
					)
				)
			)
			(symbol "D_Zener_1_1"
				(pin passive line
					(at -3.81 0 0)
					(length 2.54)
					(name "K"
						(effects
							(font
								(size 1.27 1.27)
							)
						)
					)
					(number "1"
						(effects
							(font
								(size 1.27 1.27)
							)
						)
					)
				)
				(pin passive line
					(at 3.81 0 180)
					(length 2.54)
					(name "A"
						(effects
							(font
								(size 1.27 1.27)
							)
						)
					)
					(number "2"
						(effects
							(font
								(size 1.27 1.27)
							)
						)
					)
				)
			)
		)
		(symbol "Device:Polyfuse"
			(pin_numbers hide)
			(pin_names
				(offset 0)
			)
			(exclude_from_sim no)
			(in_bom yes)
			(on_board yes)
			(property "Reference" "F"
				(at -2.54 0 90)
				(effects
					(font
						(size 1.27 1.27)
					)
				)
			)
			(property "Value" "Polyfuse"
				(at 2.54 0 90)
				(effects
					(font
						(size 1.27 1.27)
					)
				)
			)
			(property "Footprint" ""
				(at 1.27 -5.08 0)
				(effects
					(font
						(size 1.27 1.27)
					)
					(justify left)
					(hide yes)
				)
			)
			(property "Datasheet" "~"
				(at 0 0 0)
				(effects
					(font
						(size 1.27 1.27)
					)
					(hide yes)
				)
			)
			(property "Description" "Resettable fuse, polymeric positive temperature coefficient"
				(at 0 0 0)
				(effects
					(font
						(size 1.27 1.27)
					)
					(hide yes)
				)
			)
			(property "ki_keywords" "resettable fuse PTC PPTC polyfuse polyswitch"
				(at 0 0 0)
				(effects
					(font
						(size 1.27 1.27)
					)
					(hide yes)
				)
			)
			(property "ki_fp_filters" "*polyfuse* *PTC*"
				(at 0 0 0)
				(effects
					(font
						(size 1.27 1.27)
					)
					(hide yes)
				)
			)
			(symbol "Polyfuse_0_1"
				(rectangle
					(start -0.762 2.54)
					(end 0.762 -2.54)
					(stroke
						(width 0.254)
						(type default)
					)
					(fill
						(type none)
					)
				)
				(polyline
					(pts
						(xy 0 2.54) (xy 0 -2.54)
					)
					(stroke
						(width 0)
						(type default)
					)
					(fill
						(type none)
					)
				)
				(polyline
					(pts
						(xy -1.524 2.54) (xy -1.524 1.524) (xy 1.524 -1.524) (xy 1.524 -2.54)
					)
					(stroke
						(width 0)
						(type default)
					)
					(fill
						(type none)
					)
				)
			)
			(symbol "Polyfuse_1_1"
				(pin passive line
					(at 0 3.81 270)
					(length 1.27)
					(name "~"
						(effects
							(font
								(size 1.27 1.27)
							)
						)
					)
					(number "1"
						(effects
							(font
								(size 1.27 1.27)
							)
						)
					)
				)
				(pin passive line
					(at 0 -3.81 90)
					(length 1.27)
					(name "~"
						(effects
							(font
								(size 1.27 1.27)
							)
						)
					)
					(number "2"
						(effects
							(font
								(size 1.27 1.27)
							)
						)
					)
				)
			)
		)
		(symbol "Graphic:Logo_Open_Hardware_Small"
			(exclude_from_sim no)
			(in_bom no)
			(on_board no)
			(property "Reference" "#SYM"
				(at 0 6.985 0)
				(effects
					(font
						(size 1.27 1.27)
					)
					(hide yes)
				)
			)
			(property "Value" "Logo_Open_Hardware_Small"
				(at 0 -5.715 0)
				(effects
					(font
						(size 1.27 1.27)
					)
					(hide yes)
				)
			)
			(property "Footprint" ""
				(at 0 0 0)
				(effects
					(font
						(size 1.27 1.27)
					)
					(hide yes)
				)
			)
			(property "Datasheet" "~"
				(at 0 0 0)
				(effects
					(font
						(size 1.27 1.27)
					)
					(hide yes)
				)
			)
			(property "Description" "Open Hardware logo, small"
				(at 0 0 0)
				(effects
					(font
						(size 1.27 1.27)
					)
					(hide yes)
				)
			)
			(property "Sim.Enable" "0"
				(at 0 0 0)
				(effects
					(font
						(size 1.27 1.27)
					)
					(hide yes)
				)
			)
			(property "ki_keywords" "Logo"
				(at 0 0 0)
				(effects
					(font
						(size 1.27 1.27)
					)
					(hide yes)
				)
			)
			(symbol "Logo_Open_Hardware_Small_0_1"
				(polyline
					(pts
						(xy 3.3528 -4.3434) (xy 3.302 -4.318) (xy 3.175 -4.2418) (xy 2.9972 -4.1148) (xy 2.7686 -3.9624)
						(xy 2.54 -3.81) (xy 2.3622 -3.7084) (xy 2.2352 -3.6068) (xy 2.1844 -3.5814) (xy 2.159 -3.6068)
						(xy 2.0574 -3.6576) (xy 1.905 -3.7338) (xy 1.8034 -3.7846) (xy 1.6764 -3.8354) (xy 1.6002 -3.8354)
						(xy 1.6002 -3.8354) (xy 1.5494 -3.7338) (xy 1.4732 -3.5306) (xy 1.3462 -3.302) (xy 1.2446 -3.0226)
						(xy 1.1176 -2.7178) (xy 0.9652 -2.413) (xy 0.8636 -2.1082) (xy 0.7366 -1.8288) (xy 0.6604 -1.6256)
						(xy 0.6096 -1.4732) (xy 0.5842 -1.397) (xy 0.5842 -1.397) (xy 0.6604 -1.3208) (xy 0.7874 -1.2446)
						(xy 1.0414 -1.016) (xy 1.2954 -0.6858) (xy 1.4478 -0.3302) (xy 1.524 0.0762) (xy 1.4732 0.4572)
						(xy 1.3208 0.8128) (xy 1.0668 1.143) (xy 0.762 1.3716) (xy 0.4064 1.524) (xy 0 1.5748) (xy -0.381 1.5494)
						(xy -0.7366 1.397) (xy -1.0668 1.143) (xy -1.2192 0.9906) (xy -1.397 0.6604) (xy -1.524 0.3048)
						(xy -1.524 0.2286) (xy -1.4986 -0.1778) (xy -1.397 -0.5334) (xy -1.1938 -0.8636) (xy -0.9144 -1.143)
						(xy -0.8636 -1.1684) (xy -0.7366 -1.27) (xy -0.635 -1.3462) (xy -0.5842 -1.397) (xy -1.0668 -2.5908)
						(xy -1.143 -2.794) (xy -1.2954 -3.1242) (xy -1.397 -3.4036) (xy -1.4986 -3.6322) (xy -1.5748 -3.7846)
						(xy -1.6002 -3.8354) (xy -1.6002 -3.8354) (xy -1.651 -3.8354) (xy -1.7272 -3.81) (xy -1.905 -3.7338)
						(xy -2.0066 -3.683) (xy -2.1336 -3.6068) (xy -2.2098 -3.5814) (xy -2.2606 -3.6068) (xy -2.3622 -3.683)
						(xy -2.54 -3.81) (xy -2.7686 -3.9624) (xy -2.9718 -4.0894) (xy -3.1496 -4.2164) (xy -3.302 -4.318)
						(xy -3.3528 -4.3434) (xy -3.3782 -4.3434) (xy -3.429 -4.318) (xy -3.5306 -4.2164) (xy -3.7084 -4.064)
						(xy -3.937 -3.8354) (xy -3.9624 -3.81) (xy -4.1656 -3.6068) (xy -4.318 -3.4544) (xy -4.4196 -3.3274)
						(xy -4.445 -3.2766) (xy -4.445 -3.2766) (xy -4.4196 -3.2258) (xy -4.318 -3.0734) (xy -4.2164 -2.8956)
						(xy -4.064 -2.667) (xy -3.6576 -2.0828) (xy -3.8862 -1.5494) (xy -3.937 -1.3716) (xy -4.0386 -1.1684)
						(xy -4.0894 -1.0414) (xy -4.1148 -0.9652) (xy -4.191 -0.9398) (xy -4.318 -0.9144) (xy -4.5466 -0.8636)
						(xy -4.8006 -0.8128) (xy -5.0546 -0.7874) (xy -5.2578 -0.7366) (xy -5.4356 -0.7112) (xy -5.5118 -0.6858)
						(xy -5.5118 -0.6858) (xy -5.5372 -0.635) (xy -5.5372 -0.5588) (xy -5.5372 -0.4318) (xy -5.5626 -0.2286)
						(xy -5.5626 0.0762) (xy -5.5626 0.127) (xy -5.5372 0.4064) (xy -5.5372 0.635) (xy -5.5372 0.762)
						(xy -5.5372 0.8382) (xy -5.5372 0.8382) (xy -5.461 0.8382) (xy -5.3086 0.889) (xy -5.08 0.9144)
						(xy -4.826 0.9652) (xy -4.8006 0.9906) (xy -4.5466 1.0414) (xy -4.318 1.0668) (xy -4.1656 1.1176)
						(xy -4.0894 1.143) (xy -4.0894 1.143) (xy -4.0386 1.2446) (xy -3.9624 1.4224) (xy -3.8608 1.6256)
						(xy -3.7846 1.8288) (xy -3.7084 2.0066) (xy -3.6576 2.159) (xy -3.6322 2.2098) (xy -3.6322 2.2098)
						(xy -3.683 2.286) (xy -3.7592 2.413) (xy -3.8862 2.5908) (xy -4.064 2.8194) (xy -4.064 2.8448)
						(xy -4.2164 3.0734) (xy -4.3434 3.2512) (xy -4.4196 3.3782) (xy -4.445 3.4544) (xy -4.445 3.4544)
						(xy -4.3942 3.5052) (xy -4.2926 3.6322) (xy -4.1148 3.81) (xy -3.937 4.0132) (xy -3.8608 4.064)
						(xy -3.6576 4.2926) (xy -3.5052 4.4196) (xy -3.4036 4.4958) (xy -3.3528 4.5212) (xy -3.3528 4.5212)
						(xy -3.302 4.4704) (xy -3.1496 4.3688) (xy -2.9718 4.2418) (xy -2.7432 4.0894) (xy -2.7178 4.0894)
						(xy -2.4892 3.937) (xy -2.3114 3.81) (xy -2.1844 3.7084) (xy -2.1336 3.683) (xy -2.1082 3.683)
						(xy -2.032 3.7084) (xy -1.8542 3.7592) (xy -1.6764 3.8354) (xy -1.4732 3.937) (xy -1.27 4.0132)
						(xy -1.143 4.064) (xy -1.0668 4.1148) (xy -1.0668 4.1148) (xy -1.0414 4.191) (xy -1.016 4.3434)
						(xy -0.9652 4.572) (xy -0.9144 4.8514) (xy -0.889 4.9022) (xy -0.8382 5.1562) (xy -0.8128 5.3848)
						(xy -0.7874 5.5372) (xy -0.762 5.588) (xy -0.7112 5.6134) (xy -0.5842 5.6134) (xy -0.4064 5.6134)
						(xy -0.1524 5.6134) (xy 0.0762 5.6134) (xy 0.3302 5.6134) (xy 0.5334 5.6134) (xy 0.6858 5.588)
						(xy 0.7366 5.588) (xy 0.7366 5.588) (xy 0.762 5.5118) (xy 0.8128 5.334) (xy 0.8382 5.1054) (xy 0.9144 4.826)
						(xy 0.9144 4.7752) (xy 0.9652 4.5212) (xy 1.016 4.2926) (xy 1.0414 4.1402) (xy 1.0668 4.0894)
						(xy 1.0668 4.0894) (xy 1.1938 4.0386) (xy 1.3716 3.9624) (xy 1.5748 3.8608) (xy 2.0828 3.6576)
						(xy 2.7178 4.0894) (xy 2.7686 4.1402) (xy 2.9972 4.2926) (xy 3.175 4.4196) (xy 3.302 4.4958) (xy 3.3782 4.5212)
						(xy 3.3782 4.5212) (xy 3.429 4.4704) (xy 3.556 4.3434) (xy 3.7338 4.191) (xy 3.9116 3.9878) (xy 4.064 3.8354)
						(xy 4.2418 3.6576) (xy 4.3434 3.556) (xy 4.4196 3.4798) (xy 4.4196 3.429) (xy 4.4196 3.4036) (xy 4.3942 3.3274)
						(xy 4.2926 3.2004) (xy 4.1656 2.9972) (xy 4.0132 2.794) (xy 3.8862 2.5908) (xy 3.7592 2.3876)
						(xy 3.6576 2.2352) (xy 3.6322 2.159) (xy 3.6322 2.1336) (xy 3.683 2.0066) (xy 3.7592 1.8288) (xy 3.8608 1.6002)
						(xy 4.064 1.1176) (xy 4.3942 1.0414) (xy 4.5974 1.016) (xy 4.8768 0.9652) (xy 5.1308 0.9144) (xy 5.5372 0.8382)
						(xy 5.5626 -0.6604) (xy 5.4864 -0.6858) (xy 5.4356 -0.6858) (xy 5.2832 -0.7366) (xy 5.0546 -0.762)
						(xy 4.8006 -0.8128) (xy 4.5974 -0.8636) (xy 4.3688 -0.9144) (xy 4.2164 -0.9398) (xy 4.1402 -0.9398)
						(xy 4.1148 -0.9652) (xy 4.064 -1.0668) (xy 3.9878 -1.2446) (xy 3.9116 -1.4478) (xy 3.81 -1.651)
						(xy 3.7338 -1.8542) (xy 3.683 -2.0066) (xy 3.6576 -2.0828) (xy 3.683 -2.1336) (xy 3.7846 -2.2606)
						(xy 3.8862 -2.4638) (xy 4.0386 -2.667) (xy 4.191 -2.8956) (xy 4.318 -3.0734) (xy 4.3942 -3.2004)
						(xy 4.445 -3.2766) (xy 4.4196 -3.3274) (xy 4.3434 -3.429) (xy 4.1656 -3.5814) (xy 3.937 -3.8354)
						(xy 3.8862 -3.8608) (xy 3.683 -4.064) (xy 3.5306 -4.2164) (xy 3.4036 -4.318) (xy 3.3528 -4.3434)
					)
					(stroke
						(width 0)
						(type default)
					)
					(fill
						(type outline)
					)
				)
			)
		)
		(symbol "Mechanical:MountingHole_Pad"
			(pin_numbers hide)
			(pin_names
				(offset 1.016) hide)
			(exclude_from_sim yes)
			(in_bom no)
			(on_board yes)
			(property "Reference" "H"
				(at 0 6.35 0)
				(effects
					(font
						(size 1.27 1.27)
					)
				)
			)
			(property "Value" "MountingHole_Pad"
				(at 0 4.445 0)
				(effects
					(font
						(size 1.27 1.27)
					)
				)
			)
			(property "Footprint" ""
				(at 0 0 0)
				(effects
					(font
						(size 1.27 1.27)
					)
					(hide yes)
				)
			)
			(property "Datasheet" "~"
				(at 0 0 0)
				(effects
					(font
						(size 1.27 1.27)
					)
					(hide yes)
				)
			)
			(property "Description" "Mounting Hole with connection"
				(at 0 0 0)
				(effects
					(font
						(size 1.27 1.27)
					)
					(hide yes)
				)
			)
			(property "ki_keywords" "mounting hole"
				(at 0 0 0)
				(effects
					(font
						(size 1.27 1.27)
					)
					(hide yes)
				)
			)
			(property "ki_fp_filters" "MountingHole*Pad*"
				(at 0 0 0)
				(effects
					(font
						(size 1.27 1.27)
					)
					(hide yes)
				)
			)
			(symbol "MountingHole_Pad_0_1"
				(circle
					(center 0 1.27)
					(radius 1.27)
					(stroke
						(width 1.27)
						(type default)
					)
					(fill
						(type none)
					)
				)
			)
			(symbol "MountingHole_Pad_1_1"
				(pin input line
					(at 0 -2.54 90)
					(length 2.54)
					(name "1"
						(effects
							(font
								(size 1.27 1.27)
							)
						)
					)
					(number "1"
						(effects
							(font
								(size 1.27 1.27)
							)
						)
					)
				)
			)
		)
		(symbol "power:GND"
			(power)
			(pin_numbers hide)
			(pin_names
				(offset 0) hide)
			(exclude_from_sim no)
			(in_bom yes)
			(on_board yes)
			(property "Reference" "#PWR"
				(at 0 -6.35 0)
				(effects
					(font
						(size 1.27 1.27)
					)
					(hide yes)
				)
			)
			(property "Value" "GND"
				(at 0 -3.81 0)
				(effects
					(font
						(size 1.27 1.27)
					)
				)
			)
			(property "Footprint" ""
				(at 0 0 0)
				(effects
					(font
						(size 1.27 1.27)
					)
					(hide yes)
				)
			)
			(property "Datasheet" ""
				(at 0 0 0)
				(effects
					(font
						(size 1.27 1.27)
					)
					(hide yes)
				)
			)
			(property "Description" "Power symbol creates a global label with name \"GND\" , ground"
				(at 0 0 0)
				(effects
					(font
						(size 1.27 1.27)
					)
					(hide yes)
				)
			)
			(property "ki_keywords" "global power"
				(at 0 0 0)
				(effects
					(font
						(size 1.27 1.27)
					)
					(hide yes)
				)
			)
			(symbol "GND_0_1"
				(polyline
					(pts
						(xy 0 0) (xy 0 -1.27) (xy 1.27 -1.27) (xy 0 -2.54) (xy -1.27 -1.27) (xy 0 -1.27)
					)
					(stroke
						(width 0)
						(type default)
					)
					(fill
						(type none)
					)
				)
			)
			(symbol "GND_1_1"
				(pin power_in line
					(at 0 0 270)
					(length 0)
					(name "~"
						(effects
							(font
								(size 1.27 1.27)
							)
						)
					)
					(number "1"
						(effects
							(font
								(size 1.27 1.27)
							)
						)
					)
				)
			)
		)
		(symbol "power:PWR_FLAG"
			(power)
			(pin_numbers hide)
			(pin_names
				(offset 0) hide)
			(exclude_from_sim no)
			(in_bom yes)
			(on_board yes)
			(property "Reference" "#FLG"
				(at 0 1.905 0)
				(effects
					(font
						(size 1.27 1.27)
					)
					(hide yes)
				)
			)
			(property "Value" "PWR_FLAG"
				(at 0 3.81 0)
				(effects
					(font
						(size 1.27 1.27)
					)
				)
			)
			(property "Footprint" ""
				(at 0 0 0)
				(effects
					(font
						(size 1.27 1.27)
					)
					(hide yes)
				)
			)
			(property "Datasheet" "~"
				(at 0 0 0)
				(effects
					(font
						(size 1.27 1.27)
					)
					(hide yes)
				)
			)
			(property "Description" "Special symbol for telling ERC where power comes from"
				(at 0 0 0)
				(effects
					(font
						(size 1.27 1.27)
					)
					(hide yes)
				)
			)
			(property "ki_keywords" "flag power"
				(at 0 0 0)
				(effects
					(font
						(size 1.27 1.27)
					)
					(hide yes)
				)
			)
			(symbol "PWR_FLAG_0_0"
				(pin power_out line
					(at 0 0 90)
					(length 0)
					(name "~"
						(effects
							(font
								(size 1.27 1.27)
							)
						)
					)
					(number "1"
						(effects
							(font
								(size 1.27 1.27)
							)
						)
					)
				)
			)
			(symbol "PWR_FLAG_0_1"
				(polyline
					(pts
						(xy 0 0) (xy 0 1.27) (xy -1.016 1.905) (xy 0 2.54) (xy 1.016 1.905) (xy 0 1.27)
					)
					(stroke
						(width 0)
						(type default)
					)
					(fill
						(type none)
					)
				)
			)
		)
	)
	(junction
		(at 144.78 93.98)
		(diameter 0)
		(color 0 0 0 0)
		(uuid "16f2f078-5957-4703-8c36-f14370cead20")
	)
	(junction
		(at 161.29 119.38)
		(diameter 0)
		(color 0 0 0 0)
		(uuid "187040fc-3ee4-40da-977d-b6f8663821e6")
	)
	(junction
		(at 158.75 119.38)
		(diameter 0)
		(color 0 0 0 0)
		(uuid "23394d3f-50c7-44a7-bd8f-92acd61b037d")
	)
	(junction
		(at 143.51 106.68)
		(diameter 0)
		(color 0 0 0 0)
		(uuid "6a005721-3ae8-43a0-a0e3-d940a9298a22")
	)
	(junction
		(at 180.34 72.39)
		(diameter 0)
		(color 0 0 0 0)
		(uuid "7a52bf71-2826-43e7-889b-e8e23b22a466")
	)
	(junction
		(at 173.99 119.38)
		(diameter 0)
		(color 0 0 0 0)
		(uuid "8f090772-e6a8-4da0-8681-928d127760ba")
	)
	(junction
		(at 144.78 81.28)
		(diameter 0)
		(color 0 0 0 0)
		(uuid "aca81e33-45ec-4a39-b9d6-e8a0a154df70")
	)
	(junction
		(at 128.27 127)
		(diameter 0)
		(color 0 0 0 0)
		(uuid "b88381e9-bc61-4e1b-8c27-2c97ac4d4930")
	)
	(junction
		(at 139.7 88.9)
		(diameter 0)
		(color 0 0 0 0)
		(uuid "d1cc973c-5ca8-4d1c-a49a-8f5458fb5788")
	)
	(junction
		(at 140.97 104.14)
		(diameter 0)
		(color 0 0 0 0)
		(uuid "d2eb611c-0a8c-42b6-a3a9-0d2a1b6aebf3")
	)
	(junction
		(at 142.24 91.44)
		(diameter 0)
		(color 0 0 0 0)
		(uuid "e36d84e8-9244-4ba9-897a-1a9d5f5b8ec2")
	)
	(wire
		(pts
			(xy 127 121.92) (xy 143.51 121.92)
		)
		(stroke
			(width 0)
			(type default)
		)
		(uuid "009dbfb4-9480-4ce4-ac5b-e2a651f42dd6")
	)
	(wire
		(pts
			(xy 162.56 82.55) (xy 162.56 86.36)
		)
		(stroke
			(width 0)
			(type default)
		)
		(uuid "02898155-fb23-4b35-99ef-6e550ba9fd96")
	)
	(wire
		(pts
			(xy 143.51 106.68) (xy 143.51 121.92)
		)
		(stroke
			(width 0)
			(type default)
		)
		(uuid "0790cadd-307b-4e6f-8a71-7452e80df714")
	)
	(wire
		(pts
			(xy 138.43 96.52) (xy 146.05 96.52)
		)
		(stroke
			(width 0)
			(type default)
		)
		(uuid "1067bf7d-8572-4744-8223-aabc6e4eac16")
	)
	(wire
		(pts
			(xy 138.43 99.06) (xy 146.05 99.06)
		)
		(stroke
			(width 0)
			(type default)
		)
		(uuid "158639fc-91bd-4045-a33c-7e57ad0befe2")
	)
	(wire
		(pts
			(xy 144.78 62.23) (xy 144.78 81.28)
		)
		(stroke
			(width 0)
			(type default)
		)
		(uuid "1db03871-6316-42f8-ac35-e4e18bd64684")
	)
	(wire
		(pts
			(xy 144.78 62.23) (xy 138.43 62.23)
		)
		(stroke
			(width 0)
			(type default)
		)
		(uuid "21a20966-22c9-4df3-aad0-5bfbafa0fa25")
	)
	(wire
		(pts
			(xy 128.27 127) (xy 128.27 128.27)
		)
		(stroke
			(width 0)
			(type default)
		)
		(uuid "32a32c1d-5dfe-430e-8bd1-4f728cda8c72")
	)
	(wire
		(pts
			(xy 154.94 119.38) (xy 158.75 119.38)
		)
		(stroke
			(width 0)
			(type default)
		)
		(uuid "3344b7c4-b825-4a2c-8272-f493277fa991")
	)
	(wire
		(pts
			(xy 146.05 81.28) (xy 144.78 81.28)
		)
		(stroke
			(width 0)
			(type default)
		)
		(uuid "3489d7c0-a114-415b-96bf-a735b248baef")
	)
	(wire
		(pts
			(xy 161.29 118.11) (xy 161.29 119.38)
		)
		(stroke
			(width 0)
			(type default)
		)
		(uuid "37545e5f-505c-43a3-9bcd-53c76eeb27c5")
	)
	(wire
		(pts
			(xy 180.34 88.9) (xy 177.8 88.9)
		)
		(stroke
			(width 0)
			(type default)
		)
		(uuid "471362a0-fbed-4ee6-b84e-17fcf2431709")
	)
	(wire
		(pts
			(xy 173.99 119.38) (xy 182.88 119.38)
		)
		(stroke
			(width 0)
			(type default)
		)
		(uuid "4dcc66cd-05e2-4bb1-bbdb-38a8fbf10507")
	)
	(wire
		(pts
			(xy 138.43 101.6) (xy 146.05 101.6)
		)
		(stroke
			(width 0)
			(type default)
		)
		(uuid "53a9a9fc-f6db-47f5-9c5e-9a1ed159800b")
	)
	(wire
		(pts
			(xy 127 124.46) (xy 140.97 124.46)
		)
		(stroke
			(width 0)
			(type default)
		)
		(uuid "6114cc74-0bcf-4e4e-8b00-cc87464ddaa2")
	)
	(wire
		(pts
			(xy 180.34 59.69) (xy 180.34 72.39)
		)
		(stroke
			(width 0)
			(type default)
		)
		(uuid "66a7e340-78f5-46b4-9d8c-9724ce18938c")
	)
	(wire
		(pts
			(xy 180.34 59.69) (xy 138.43 59.69)
		)
		(stroke
			(width 0)
			(type default)
		)
		(uuid "6ea53279-a71d-4175-9963-9ed5fd0cb9ce")
	)
	(wire
		(pts
			(xy 142.24 91.44) (xy 146.05 91.44)
		)
		(stroke
			(width 0)
			(type default)
		)
		(uuid "6eae56a8-2b65-467c-9728-9ad8d55baca1")
	)
	(wire
		(pts
			(xy 139.7 88.9) (xy 138.43 88.9)
		)
		(stroke
			(width 0)
			(type default)
		)
		(uuid "73775f69-235d-477a-9b1d-f9170d776e06")
	)
	(wire
		(pts
			(xy 144.78 81.28) (xy 144.78 93.98)
		)
		(stroke
			(width 0)
			(type default)
		)
		(uuid "773c316a-62a4-4b99-933f-36277440ced9")
	)
	(wire
		(pts
			(xy 138.43 106.68) (xy 143.51 106.68)
		)
		(stroke
			(width 0)
			(type default)
		)
		(uuid "7e29431e-0437-4c08-81a3-380a54d445bf")
	)
	(wire
		(pts
			(xy 138.43 73.66) (xy 146.05 73.66)
		)
		(stroke
			(width 0)
			(type default)
		)
		(uuid "7f175f05-5254-4cde-8ab0-e832cbcd5305")
	)
	(wire
		(pts
			(xy 182.88 76.2) (xy 182.88 119.38)
		)
		(stroke
			(width 0)
			(type default)
		)
		(uuid "7fb0d93d-e53c-499d-972f-7aa831ae5537")
	)
	(wire
		(pts
			(xy 146.05 78.74) (xy 142.24 78.74)
		)
		(stroke
			(width 0)
			(type default)
		)
		(uuid "817590a0-77f0-4a07-b81e-15a271ab230f")
	)
	(wire
		(pts
			(xy 138.43 91.44) (xy 142.24 91.44)
		)
		(stroke
			(width 0)
			(type default)
		)
		(uuid "8b3dc917-585e-47df-b789-431ac0d57374")
	)
	(wire
		(pts
			(xy 166.37 82.55) (xy 166.37 86.36)
		)
		(stroke
			(width 0)
			(type default)
		)
		(uuid "8b9390fc-251f-4561-8bb0-5248d50e610f")
	)
	(wire
		(pts
			(xy 177.8 76.2) (xy 182.88 76.2)
		)
		(stroke
			(width 0)
			(type default)
		)
		(uuid "931af312-87f6-420c-920c-6d2c2c78f239")
	)
	(wire
		(pts
			(xy 158.75 119.38) (xy 161.29 119.38)
		)
		(stroke
			(width 0)
			(type default)
		)
		(uuid "97651f4b-255a-49da-8993-4c946b71e062")
	)
	(wire
		(pts
			(xy 146.05 76.2) (xy 139.7 76.2)
		)
		(stroke
			(width 0)
			(type default)
		)
		(uuid "99972521-bac3-4015-a162-a8e4d4136574")
	)
	(wire
		(pts
			(xy 140.97 104.14) (xy 146.05 104.14)
		)
		(stroke
			(width 0)
			(type default)
		)
		(uuid "9c1572d7-cea4-4456-9ab2-6a97efc7da3c")
	)
	(wire
		(pts
			(xy 173.99 120.65) (xy 173.99 119.38)
		)
		(stroke
			(width 0)
			(type default)
		)
		(uuid "9e0389df-69d3-4ec8-9021-5240a9020f7b")
	)
	(wire
		(pts
			(xy 127 119.38) (xy 147.32 119.38)
		)
		(stroke
			(width 0)
			(type default)
		)
		(uuid "a1a77947-4dff-45a0-b006-cba91c59fdca")
	)
	(wire
		(pts
			(xy 173.99 129.54) (xy 173.99 128.27)
		)
		(stroke
			(width 0)
			(type default)
		)
		(uuid "a3036800-1c66-4e0e-99e9-60416322d5d6")
	)
	(wire
		(pts
			(xy 135.89 128.27) (xy 135.89 127)
		)
		(stroke
			(width 0)
			(type default)
		)
		(uuid "af669330-f2f5-446d-ada5-1d72e4e011bd")
	)
	(wire
		(pts
			(xy 177.8 72.39) (xy 180.34 72.39)
		)
		(stroke
			(width 0)
			(type default)
		)
		(uuid "b2595b97-fdb1-4ba6-a69a-5eff3ede7c5e")
	)
	(wire
		(pts
			(xy 138.43 93.98) (xy 144.78 93.98)
		)
		(stroke
			(width 0)
			(type default)
		)
		(uuid "b3337a2c-8f3d-4b42-a506-d809f7859eda")
	)
	(wire
		(pts
			(xy 127 127) (xy 128.27 127)
		)
		(stroke
			(width 0)
			(type default)
		)
		(uuid "b5dfaf7b-3c52-436f-920c-1516069017af")
	)
	(wire
		(pts
			(xy 158.75 128.27) (xy 158.75 129.54)
		)
		(stroke
			(width 0)
			(type default)
		)
		(uuid "b77ec803-861a-40af-803d-f028070c81b0")
	)
	(wire
		(pts
			(xy 140.97 104.14) (xy 140.97 124.46)
		)
		(stroke
			(width 0)
			(type default)
		)
		(uuid "b814f147-5618-4c26-9ab4-4707cfb183a8")
	)
	(wire
		(pts
			(xy 139.7 88.9) (xy 146.05 88.9)
		)
		(stroke
			(width 0)
			(type default)
		)
		(uuid "b887978a-7b8e-48f0-ac59-8136306cde75")
	)
	(wire
		(pts
			(xy 144.78 93.98) (xy 146.05 93.98)
		)
		(stroke
			(width 0)
			(type default)
		)
		(uuid "b8afa66d-711c-499e-b164-77710f6f4662")
	)
	(wire
		(pts
			(xy 138.43 104.14) (xy 140.97 104.14)
		)
		(stroke
			(width 0)
			(type default)
		)
		(uuid "c8899a46-9f78-4877-baf6-e35c8f4f280f")
	)
	(wire
		(pts
			(xy 158.75 119.38) (xy 158.75 120.65)
		)
		(stroke
			(width 0)
			(type default)
		)
		(uuid "cf71eea3-1599-42b5-a4d2-3356dcfd194d")
	)
	(wire
		(pts
			(xy 180.34 72.39) (xy 180.34 88.9)
		)
		(stroke
			(width 0)
			(type default)
		)
		(uuid "d76363bc-f950-4ac5-80df-cec0800164f1")
	)
	(wire
		(pts
			(xy 139.7 76.2) (xy 139.7 88.9)
		)
		(stroke
			(width 0)
			(type default)
		)
		(uuid "d9eea29a-559d-4be5-ba70-1235ea7d7b38")
	)
	(wire
		(pts
			(xy 143.51 106.68) (xy 146.05 106.68)
		)
		(stroke
			(width 0)
			(type default)
		)
		(uuid "e04db199-f8ea-4c0b-a541-375b1cf6bb8b")
	)
	(wire
		(pts
			(xy 142.24 78.74) (xy 142.24 91.44)
		)
		(stroke
			(width 0)
			(type default)
		)
		(uuid "e731f13a-dfe6-469a-82f4-76fe28b5db1f")
	)
	(wire
		(pts
			(xy 161.29 119.38) (xy 173.99 119.38)
		)
		(stroke
			(width 0)
			(type default)
		)
		(uuid "f015307a-2036-4599-b3ca-b8ead617442a")
	)
	(wire
		(pts
			(xy 135.89 127) (xy 128.27 127)
		)
		(stroke
			(width 0)
			(type default)
		)
		(uuid "f2dc05df-5ed9-46e1-a87b-da862a8bf3ab")
	)
	(text_box "I2C Addresses:\n\nDigipot    - 0x2C\nAttenuator - 0x20\nADC        - 0x10\nTEMP & ID  - 0x48"
		(exclude_from_sim no)
		(at 64.77 69.85 0)
		(size 54.61 33.02)
		(stroke
			(width 0)
			(type default)
		)
		(fill
			(type none)
		)
		(effects
			(font
				(size 3 3)
			)
			(justify left top)
		)
		(uuid "2d5feedc-98c0-4a2c-b71e-2e0f9386a599")
	)
	(text "VDD\nSDA\nSCL\nGND"
		(exclude_from_sim no)
		(at 115.57 127 0)
		(effects
			(font
				(size 1.27 1.27)
			)
			(justify left bottom)
		)
		(uuid "06a408b1-5395-4b54-affb-e880172a4e9e")
	)
	(text "Licensed under CERN-OHL-S"
		(exclude_from_sim no)
		(at 227.33 180.594 0)
		(effects
			(font
				(size 2 2)
				(thickness 0.4)
				(bold yes)
			)
			(justify left bottom)
		)
		(uuid "18fb74c8-d23c-4385-8a90-47af1119cc7d")
	)
	(text "0.5A hold\n24V"
		(exclude_from_sim no)
		(at 151.384 124.206 0)
		(effects
			(font
				(size 1.27 1.27)
			)
		)
		(uuid "65d4733a-8a5c-422a-bc51-432337369423")
	)
	(text "2.3mm dia hole"
		(exclude_from_sim no)
		(at 169.418 142.24 0)
		(effects
			(font
				(size 1.27 1.27)
			)
		)
		(uuid "aff2f590-9ecf-4585-901b-69179e6e773d")
	)
	(symbol
		(lib_id "Mechanical:MountingHole_Pad")
		(at 158.75 140.97 0)
		(unit 1)
		(exclude_from_sim no)
		(in_bom no)
		(on_board yes)
		(dnp no)
		(fields_autoplaced yes)
		(uuid "037d48c6-ed0d-417d-9d3a-51791ea1299c")
		(property "Reference" "H4"
			(at 161.925 139.065 0)
			(effects
				(font
					(size 1.27 1.27)
				)
				(justify left)
			)
		)
		(property "Value" "MountingHole_Pad"
			(at 161.925 141.605 0)
			(effects
				(font
					(size 1.27 1.27)
				)
				(justify left)
				(hide yes)
			)
		)
		(property "Footprint" "DSA2K:MountingHole_2_Pad_Via"
			(at 158.75 140.97 0)
			(effects
				(font
					(size 1.27 1.27)
				)
				(hide yes)
			)
		)
		(property "Datasheet" "~"
			(at 158.75 140.97 0)
			(effects
				(font
					(size 1.27 1.27)
				)
				(hide yes)
			)
		)
		(property "Description" "Mounting Hole with connection"
			(at 158.75 140.97 0)
			(effects
				(font
					(size 1.27 1.27)
				)
				(hide yes)
			)
		)
		(pin "1"
			(uuid "c8ae969e-7519-48ec-b3b6-93ad790c8c18")
		)
		(instances
			(project "ftx"
				(path "/9da63cf1-7a13-4903-bc82-176c674403f0"
					(reference "H4")
					(unit 1)
				)
			)
			(project "FiberTransmitter"
				(path "/bb93828a-0f26-4513-bed9-3adfe581bda2"
					(reference "H?")
					(unit 1)
				)
			)
		)
	)
	(symbol
		(lib_id "power:GND")
		(at 173.99 129.54 0)
		(unit 1)
		(exclude_from_sim no)
		(in_bom yes)
		(on_board yes)
		(dnp no)
		(fields_autoplaced yes)
		(uuid "0c096246-527c-487b-a6ff-e35544d10e74")
		(property "Reference" "#PWR08"
			(at 173.99 135.89 0)
			(effects
				(font
					(size 1.27 1.27)
				)
				(hide yes)
			)
		)
		(property "Value" "GND"
			(at 173.99 134.62 0)
			(effects
				(font
					(size 1.27 1.27)
				)
			)
		)
		(property "Footprint" ""
			(at 173.99 129.54 0)
			(effects
				(font
					(size 1.27 1.27)
				)
				(hide yes)
			)
		)
		(property "Datasheet" ""
			(at 173.99 129.54 0)
			(effects
				(font
					(size 1.27 1.27)
				)
				(hide yes)
			)
		)
		(property "Description" "Power symbol creates a global label with name \"GND\" , ground"
			(at 173.99 129.54 0)
			(effects
				(font
					(size 1.27 1.27)
				)
				(hide yes)
			)
		)
		(pin "1"
			(uuid "4b0b6c63-dcaf-4016-a126-7b42e509d13f")
		)
		(instances
			(project "ftx"
				(path "/9da63cf1-7a13-4903-bc82-176c674403f0"
					(reference "#PWR08")
					(unit 1)
				)
			)
			(project "FiberTransmitter"
				(path "/bb93828a-0f26-4513-bed9-3adfe581bda2"
					(reference "#PWR?")
					(unit 1)
				)
				(path "/bb93828a-0f26-4513-bed9-3adfe581bda2/b18ee014-8f5b-427f-bd4a-ff05b0d11437"
					(reference "#PWR?")
					(unit 1)
				)
			)
			(project "GreX Frontend"
				(path "/e63e39d7-6ac0-4ffd-8aa3-1841a4541b55/af925654-dfb9-45aa-816e-cb4703dcab2f"
					(reference "#PWR?")
					(unit 1)
				)
			)
		)
	)
	(symbol
		(lib_id "power:PWR_FLAG")
		(at 161.29 118.11 0)
		(unit 1)
		(exclude_from_sim no)
		(in_bom yes)
		(on_board yes)
		(dnp no)
		(uuid "0d5cd19e-84cf-47ff-8f2f-698288f9d0f7")
		(property "Reference" "#FLG02"
			(at 161.29 116.205 0)
			(effects
				(font
					(size 1.27 1.27)
				)
				(hide yes)
			)
		)
		(property "Value" "PWR_FLAG"
			(at 161.29 113.538 0)
			(effects
				(font
					(size 1.27 1.27)
				)
			)
		)
		(property "Footprint" ""
			(at 161.29 118.11 0)
			(effects
				(font
					(size 1.27 1.27)
				)
				(hide yes)
			)
		)
		(property "Datasheet" "~"
			(at 161.29 118.11 0)
			(effects
				(font
					(size 1.27 1.27)
				)
				(hide yes)
			)
		)
		(property "Description" "Special symbol for telling ERC where power comes from"
			(at 161.29 118.11 0)
			(effects
				(font
					(size 1.27 1.27)
				)
				(hide yes)
			)
		)
		(pin "1"
			(uuid "17cc17fd-5bce-40af-90f0-1725dc4127d0")
		)
		(instances
			(project "ftx"
				(path "/9da63cf1-7a13-4903-bc82-176c674403f0"
					(reference "#FLG02")
					(unit 1)
				)
			)
		)
	)
	(symbol
		(lib_id "Device:D_Zener")
		(at 158.75 124.46 270)
		(unit 1)
		(exclude_from_sim no)
		(in_bom yes)
		(on_board yes)
		(dnp no)
		(fields_autoplaced yes)
		(uuid "14b4201f-ee04-43cb-96df-a51babc86e65")
		(property "Reference" "D2"
			(at 161.925 123.825 90)
			(effects
				(font
					(size 1.27 1.27)
				)
				(justify left)
			)
		)
		(property "Value" "18.2V"
			(at 161.925 126.365 90)
			(effects
				(font
					(size 1.27 1.27)
				)
				(justify left)
			)
		)
		(property "Footprint" "Diode_SMD:D_SMA"
			(at 158.75 124.46 0)
			(effects
				(font
					(size 1.27 1.27)
				)
				(hide yes)
			)
		)
		(property "Datasheet" "~"
			(at 158.75 124.46 0)
			(effects
				(font
					(size 1.27 1.27)
				)
				(hide yes)
			)
		)
		(property "Description" "Zener diode"
			(at 158.75 124.46 0)
			(effects
				(font
					(size 1.27 1.27)
				)
				(hide yes)
			)
		)
		(property "MPN" "SMAJ11A"
			(at 158.75 124.46 0)
			(effects
				(font
					(size 1.27 1.27)
				)
				(hide yes)
			)
		)
		(pin "1"
			(uuid "94745bef-8949-4409-b7d1-7285f8bc988b")
		)
		(pin "2"
			(uuid "4a1fd5ba-3b1a-432c-9596-583bcd471122")
		)
		(instances
			(project "ftx"
				(path "/9da63cf1-7a13-4903-bc82-176c674403f0"
					(reference "D2")
					(unit 1)
				)
			)
			(project "FiberTransmitter"
				(path "/bb93828a-0f26-4513-bed9-3adfe581bda2"
					(reference "D?")
					(unit 1)
				)
			)
		)
	)
	(symbol
		(lib_id "power:GND")
		(at 128.27 128.27 0)
		(unit 1)
		(exclude_from_sim no)
		(in_bom yes)
		(on_board yes)
		(dnp no)
		(fields_autoplaced yes)
		(uuid "21825881-ab69-4eb2-a9ed-3d69cde35e3b")
		(property "Reference" "#PWR03"
			(at 128.27 134.62 0)
			(effects
				(font
					(size 1.27 1.27)
				)
				(hide yes)
			)
		)
		(property "Value" "GND"
			(at 128.27 133.35 0)
			(effects
				(font
					(size 1.27 1.27)
				)
			)
		)
		(property "Footprint" ""
			(at 128.27 128.27 0)
			(effects
				(font
					(size 1.27 1.27)
				)
				(hide yes)
			)
		)
		(property "Datasheet" ""
			(at 128.27 128.27 0)
			(effects
				(font
					(size 1.27 1.27)
				)
				(hide yes)
			)
		)
		(property "Description" "Power symbol creates a global label with name \"GND\" , ground"
			(at 128.27 128.27 0)
			(effects
				(font
					(size 1.27 1.27)
				)
				(hide yes)
			)
		)
		(pin "1"
			(uuid "070397c3-00b9-4b62-b41d-1f2c8397cc0d")
		)
		(instances
			(project "ftx"
				(path "/9da63cf1-7a13-4903-bc82-176c674403f0"
					(reference "#PWR03")
					(unit 1)
				)
			)
			(project "FiberTransmitter"
				(path "/bb93828a-0f26-4513-bed9-3adfe581bda2"
					(reference "#PWR?")
					(unit 1)
				)
				(path "/bb93828a-0f26-4513-bed9-3adfe581bda2/b18ee014-8f5b-427f-bd4a-ff05b0d11437"
					(reference "#PWR?")
					(unit 1)
				)
			)
			(project "GreX Frontend"
				(path "/e63e39d7-6ac0-4ffd-8aa3-1841a4541b55/af925654-dfb9-45aa-816e-cb4703dcab2f"
					(reference "#PWR?")
					(unit 1)
				)
			)
		)
	)
	(symbol
		(lib_id "power:GND")
		(at 132.08 143.51 0)
		(unit 1)
		(exclude_from_sim no)
		(in_bom yes)
		(on_board yes)
		(dnp no)
		(uuid "2bfdcfb1-5d6f-4d87-84e9-1a0409274e68")
		(property "Reference" "#PWR01"
			(at 132.08 149.86 0)
			(effects
				(font
					(size 1.27 1.27)
				)
				(hide yes)
			)
		)
		(property "Value" "GND"
			(at 131.572 148.59 0)
			(effects
				(font
					(size 1.27 1.27)
				)
			)
		)
		(property "Footprint" ""
			(at 132.08 143.51 0)
			(effects
				(font
					(size 1.27 1.27)
				)
				(hide yes)
			)
		)
		(property "Datasheet" ""
			(at 132.08 143.51 0)
			(effects
				(font
					(size 1.27 1.27)
				)
				(hide yes)
			)
		)
		(property "Description" "Power symbol creates a global label with name \"GND\" , ground"
			(at 132.08 143.51 0)
			(effects
				(font
					(size 1.27 1.27)
				)
				(hide yes)
			)
		)
		(pin "1"
			(uuid "d5d217c1-d1c1-4745-8039-d0ec2dc8d833")
		)
		(instances
			(project "ftx"
				(path "/9da63cf1-7a13-4903-bc82-176c674403f0"
					(reference "#PWR01")
					(unit 1)
				)
			)
			(project "FiberTransmitter"
				(path "/bb93828a-0f26-4513-bed9-3adfe581bda2"
					(reference "#PWR?")
					(unit 1)
				)
			)
			(project "GreX Frontend"
				(path "/e63e39d7-6ac0-4ffd-8aa3-1841a4541b55/af925654-dfb9-45aa-816e-cb4703dcab2f"
					(reference "#PWR?")
					(unit 1)
				)
			)
		)
	)
	(symbol
		(lib_id "Graphic:Logo_Open_Hardware_Small")
		(at 246.38 172.72 0)
		(unit 1)
		(exclude_from_sim yes)
		(in_bom no)
		(on_board yes)
		(dnp no)
		(fields_autoplaced yes)
		(uuid "41afad39-c792-4dc6-a6ef-92d61b67f473")
		(property "Reference" "#SYM1"
			(at 246.38 165.735 0)
			(effects
				(font
					(size 1.27 1.27)
				)
				(hide yes)
			)
		)
		(property "Value" "Logo_Open_Hardware_Small"
			(at 246.38 178.435 0)
			(effects
				(font
					(size 1.27 1.27)
				)
				(hide yes)
			)
		)
		(property "Footprint" "Symbol:OSHW-Logo2_7.3x6mm_SilkScreen"
			(at 246.38 172.72 0)
			(effects
				(font
					(size 1.27 1.27)
				)
				(hide yes)
			)
		)
		(property "Datasheet" "~"
			(at 246.38 172.72 0)
			(effects
				(font
					(size 1.27 1.27)
				)
				(hide yes)
			)
		)
		(property "Description" "Open Hardware logo, small"
			(at 246.38 172.72 0)
			(effects
				(font
					(size 1.27 1.27)
				)
				(hide yes)
			)
		)
		(instances
			(project "ftx"
				(path "/9da63cf1-7a13-4903-bc82-176c674403f0"
					(reference "#SYM1")
					(unit 1)
				)
			)
		)
	)
	(symbol
		(lib_id "power:GND")
		(at 158.75 143.51 0)
		(unit 1)
		(exclude_from_sim no)
		(in_bom yes)
		(on_board yes)
		(dnp no)
		(uuid "466de624-1635-4eba-8fdf-cfbe4d2e3d97")
		(property "Reference" "#PWR05"
			(at 158.75 149.86 0)
			(effects
				(font
					(size 1.27 1.27)
				)
				(hide yes)
			)
		)
		(property "Value" "GND"
			(at 158.242 148.59 0)
			(effects
				(font
					(size 1.27 1.27)
				)
			)
		)
		(property "Footprint" ""
			(at 158.75 143.51 0)
			(effects
				(font
					(size 1.27 1.27)
				)
				(hide yes)
			)
		)
		(property "Datasheet" ""
			(at 158.75 143.51 0)
			(effects
				(font
					(size 1.27 1.27)
				)
				(hide yes)
			)
		)
		(property "Description" "Power symbol creates a global label with name \"GND\" , ground"
			(at 158.75 143.51 0)
			(effects
				(font
					(size 1.27 1.27)
				)
				(hide yes)
			)
		)
		(pin "1"
			(uuid "654ede6f-8f23-4857-bc8a-12bb460e6f26")
		)
		(instances
			(project "ftx"
				(path "/9da63cf1-7a13-4903-bc82-176c674403f0"
					(reference "#PWR05")
					(unit 1)
				)
			)
			(project "FiberTransmitter"
				(path "/bb93828a-0f26-4513-bed9-3adfe581bda2"
					(reference "#PWR?")
					(unit 1)
				)
			)
			(project "GreX Frontend"
				(path "/e63e39d7-6ac0-4ffd-8aa3-1841a4541b55/af925654-dfb9-45aa-816e-cb4703dcab2f"
					(reference "#PWR?")
					(unit 1)
				)
			)
		)
	)
	(symbol
		(lib_id "power:GND")
		(at 149.86 143.51 0)
		(unit 1)
		(exclude_from_sim no)
		(in_bom yes)
		(on_board yes)
		(dnp no)
		(uuid "48245708-67de-4b4c-b9a2-0ba934cc9919")
		(property "Reference" "#PWR04"
			(at 149.86 149.86 0)
			(effects
				(font
					(size 1.27 1.27)
				)
				(hide yes)
			)
		)
		(property "Value" "GND"
			(at 149.352 148.59 0)
			(effects
				(font
					(size 1.27 1.27)
				)
			)
		)
		(property "Footprint" ""
			(at 149.86 143.51 0)
			(effects
				(font
					(size 1.27 1.27)
				)
				(hide yes)
			)
		)
		(property "Datasheet" ""
			(at 149.86 143.51 0)
			(effects
				(font
					(size 1.27 1.27)
				)
				(hide yes)
			)
		)
		(property "Description" "Power symbol creates a global label with name \"GND\" , ground"
			(at 149.86 143.51 0)
			(effects
				(font
					(size 1.27 1.27)
				)
				(hide yes)
			)
		)
		(pin "1"
			(uuid "d275c445-827e-4726-9850-46e16c580176")
		)
		(instances
			(project "ftx"
				(path "/9da63cf1-7a13-4903-bc82-176c674403f0"
					(reference "#PWR04")
					(unit 1)
				)
			)
			(project "FiberTransmitter"
				(path "/bb93828a-0f26-4513-bed9-3adfe581bda2"
					(reference "#PWR?")
					(unit 1)
				)
			)
			(project "GreX Frontend"
				(path "/e63e39d7-6ac0-4ffd-8aa3-1841a4541b55/af925654-dfb9-45aa-816e-cb4703dcab2f"
					(reference "#PWR?")
					(unit 1)
				)
			)
		)
	)
	(symbol
		(lib_id "Device:C_Polarized")
		(at 173.99 124.46 0)
		(unit 1)
		(exclude_from_sim no)
		(in_bom yes)
		(on_board yes)
		(dnp no)
		(fields_autoplaced yes)
		(uuid "4f4e7935-5429-4376-8ea5-a5950f09b2d3")
		(property "Reference" "C1"
			(at 177.8 122.936 0)
			(effects
				(font
					(size 1.27 1.27)
				)
				(justify left)
			)
		)
		(property "Value" "22u"
			(at 177.8 125.476 0)
			(effects
				(font
					(size 1.27 1.27)
				)
				(justify left)
			)
		)
		(property "Footprint" "Capacitor_Tantalum_SMD:CP_EIA-6032-28_Kemet-C"
			(at 174.9552 128.27 0)
			(effects
				(font
					(size 1.27 1.27)
				)
				(hide yes)
			)
		)
		(property "Datasheet" "https://www.vishay.com/docs/40002/293d.pdf"
			(at 173.99 124.46 0)
			(effects
				(font
					(size 1.27 1.27)
				)
				(hide yes)
			)
		)
		(property "Description" "Polarized capacitor"
			(at 173.99 124.46 0)
			(effects
				(font
					(size 1.27 1.27)
				)
				(hide yes)
			)
		)
		(property "MPN" "293D226X9025C2TE3"
			(at 173.99 124.46 0)
			(effects
				(font
					(size 1.27 1.27)
				)
				(hide yes)
			)
		)
		(pin "1"
			(uuid "082315e5-996d-4da1-b6c2-00409e3f5ed6")
		)
		(pin "2"
			(uuid "2ed8a80e-8150-403b-9d61-3755988bd94f")
		)
		(instances
			(project "ftx"
				(path "/9da63cf1-7a13-4903-bc82-176c674403f0"
					(reference "C1")
					(unit 1)
				)
			)
			(project "FiberTransmitter"
				(path "/bb93828a-0f26-4513-bed9-3adfe581bda2"
					(reference "C?")
					(unit 1)
				)
				(path "/bb93828a-0f26-4513-bed9-3adfe581bda2/b18ee014-8f5b-427f-bd4a-ff05b0d11437"
					(reference "C?")
					(unit 1)
				)
			)
		)
	)
	(symbol
		(lib_id "power:PWR_FLAG")
		(at 135.89 128.27 180)
		(unit 1)
		(exclude_from_sim no)
		(in_bom yes)
		(on_board yes)
		(dnp no)
		(fields_autoplaced yes)
		(uuid "59ed0b55-8b7f-4eae-ae69-74134a6024b6")
		(property "Reference" "#FLG01"
			(at 135.89 130.175 0)
			(effects
				(font
					(size 1.27 1.27)
				)
				(hide yes)
			)
		)
		(property "Value" "PWR_FLAG"
			(at 135.89 133.35 0)
			(effects
				(font
					(size 1.27 1.27)
				)
			)
		)
		(property "Footprint" ""
			(at 135.89 128.27 0)
			(effects
				(font
					(size 1.27 1.27)
				)
				(hide yes)
			)
		)
		(property "Datasheet" "~"
			(at 135.89 128.27 0)
			(effects
				(font
					(size 1.27 1.27)
				)
				(hide yes)
			)
		)
		(property "Description" "Special symbol for telling ERC where power comes from"
			(at 135.89 128.27 0)
			(effects
				(font
					(size 1.27 1.27)
				)
				(hide yes)
			)
		)
		(pin "1"
			(uuid "9e206637-fc0f-40d2-9077-e3d3bdd594ff")
		)
		(instances
			(project "ftx"
				(path "/9da63cf1-7a13-4903-bc82-176c674403f0"
					(reference "#FLG01")
					(unit 1)
				)
			)
		)
	)
	(symbol
		(lib_id "Device:Polyfuse")
		(at 151.13 119.38 90)
		(unit 1)
		(exclude_from_sim no)
		(in_bom yes)
		(on_board yes)
		(dnp no)
		(uuid "5d8264fb-f8ce-48d1-a5a1-da97775a4763")
		(property "Reference" "F1"
			(at 151.13 114.3 90)
			(effects
				(font
					(size 1.27 1.27)
				)
			)
		)
		(property "Value" "1A trip"
			(at 151.13 116.205 90)
			(effects
				(font
					(size 1.27 1.27)
				)
			)
		)
		(property "Footprint" "Fuse:Fuse_1206_3216Metric"
			(at 156.21 118.11 0)
			(effects
				(font
					(size 1.27 1.27)
				)
				(justify left)
				(hide yes)
			)
		)
		(property "Datasheet" "~"
			(at 151.13 119.38 0)
			(effects
				(font
					(size 1.27 1.27)
				)
				(hide yes)
			)
		)
		(property "Description" "Resettable fuse, polymeric positive temperature coefficient"
			(at 151.13 119.38 0)
			(effects
				(font
					(size 1.27 1.27)
				)
				(hide yes)
			)
		)
		(property "MPN" "1206L050/24WR"
			(at 151.13 119.38 0)
			(effects
				(font
					(size 1.27 1.27)
				)
				(hide yes)
			)
		)
		(pin "1"
			(uuid "cea10e9f-8813-459d-b011-604c3429e272")
		)
		(pin "2"
			(uuid "121130e7-6465-4f4a-9ff0-2d5e88003f68")
		)
		(instances
			(project "ftx"
				(path "/9da63cf1-7a13-4903-bc82-176c674403f0"
					(reference "F1")
					(unit 1)
				)
			)
			(project "FiberTransmitter"
				(path "/bb93828a-0f26-4513-bed9-3adfe581bda2"
					(reference "F?")
					(unit 1)
				)
				(path "/bb93828a-0f26-4513-bed9-3adfe581bda2/b18ee014-8f5b-427f-bd4a-ff05b0d11437"
					(reference "F?")
					(unit 1)
				)
			)
			(project "GreX Frontend"
				(path "/e63e39d7-6ac0-4ffd-8aa3-1841a4541b55/af925654-dfb9-45aa-816e-cb4703dcab2f"
					(reference "F?")
					(unit 1)
				)
			)
		)
	)
	(symbol
		(lib_id "Mechanical:MountingHole_Pad")
		(at 132.08 140.97 0)
		(unit 1)
		(exclude_from_sim no)
		(in_bom no)
		(on_board yes)
		(dnp no)
		(fields_autoplaced yes)
		(uuid "7daf3fd0-831d-4a28-8c8b-a7141249ef3a")
		(property "Reference" "H1"
			(at 135.255 139.065 0)
			(effects
				(font
					(size 1.27 1.27)
				)
				(justify left)
			)
		)
		(property "Value" "MountingHole_Pad"
			(at 135.255 141.605 0)
			(effects
				(font
					(size 1.27 1.27)
				)
				(justify left)
				(hide yes)
			)
		)
		(property "Footprint" "DSA2K:MountingHole_2_Pad_Via"
			(at 132.08 140.97 0)
			(effects
				(font
					(size 1.27 1.27)
				)
				(hide yes)
			)
		)
		(property "Datasheet" "~"
			(at 132.08 140.97 0)
			(effects
				(font
					(size 1.27 1.27)
				)
				(hide yes)
			)
		)
		(property "Description" "Mounting Hole with connection"
			(at 132.08 140.97 0)
			(effects
				(font
					(size 1.27 1.27)
				)
				(hide yes)
			)
		)
		(pin "1"
			(uuid "9df83ad6-e4da-481f-afe7-ab928ff1db30")
		)
		(instances
			(project "ftx"
				(path "/9da63cf1-7a13-4903-bc82-176c674403f0"
					(reference "H1")
					(unit 1)
				)
			)
			(project "FiberTransmitter"
				(path "/bb93828a-0f26-4513-bed9-3adfe581bda2"
					(reference "H?")
					(unit 1)
				)
			)
		)
	)
	(symbol
		(lib_id "power:GND")
		(at 158.75 129.54 0)
		(unit 1)
		(exclude_from_sim no)
		(in_bom yes)
		(on_board yes)
		(dnp no)
		(fields_autoplaced yes)
		(uuid "a6cd75a1-dfb6-4b0e-8502-47502ebd4e92")
		(property "Reference" "#PWR07"
			(at 158.75 135.89 0)
			(effects
				(font
					(size 1.27 1.27)
				)
				(hide yes)
			)
		)
		(property "Value" "GND"
			(at 158.75 134.62 0)
			(effects
				(font
					(size 1.27 1.27)
				)
			)
		)
		(property "Footprint" ""
			(at 158.75 129.54 0)
			(effects
				(font
					(size 1.27 1.27)
				)
				(hide yes)
			)
		)
		(property "Datasheet" ""
			(at 158.75 129.54 0)
			(effects
				(font
					(size 1.27 1.27)
				)
				(hide yes)
			)
		)
		(property "Description" "Power symbol creates a global label with name \"GND\" , ground"
			(at 158.75 129.54 0)
			(effects
				(font
					(size 1.27 1.27)
				)
				(hide yes)
			)
		)
		(pin "1"
			(uuid "d7f62bd3-812d-4940-a7b0-b0b70c5fbe34")
		)
		(instances
			(project "ftx"
				(path "/9da63cf1-7a13-4903-bc82-176c674403f0"
					(reference "#PWR07")
					(unit 1)
				)
			)
			(project "FiberTransmitter"
				(path "/bb93828a-0f26-4513-bed9-3adfe581bda2"
					(reference "#PWR?")
					(unit 1)
				)
				(path "/bb93828a-0f26-4513-bed9-3adfe581bda2/b18ee014-8f5b-427f-bd4a-ff05b0d11437"
					(reference "#PWR?")
					(unit 1)
				)
			)
			(project "GreX Frontend"
				(path "/e63e39d7-6ac0-4ffd-8aa3-1841a4541b55/af925654-dfb9-45aa-816e-cb4703dcab2f"
					(reference "#PWR?")
					(unit 1)
				)
			)
		)
	)
	(symbol
		(lib_id "Mechanical:MountingHole_Pad")
		(at 149.86 140.97 0)
		(unit 1)
		(exclude_from_sim no)
		(in_bom no)
		(on_board yes)
		(dnp no)
		(fields_autoplaced yes)
		(uuid "b0f06e0d-64d6-4c65-97bc-62ffc9c76197")
		(property "Reference" "H3"
			(at 153.035 139.065 0)
			(effects
				(font
					(size 1.27 1.27)
				)
				(justify left)
			)
		)
		(property "Value" "MountingHole_Pad"
			(at 153.035 141.605 0)
			(effects
				(font
					(size 1.27 1.27)
				)
				(justify left)
				(hide yes)
			)
		)
		(property "Footprint" "DSA2K:MountingHole_2_Pad_Via"
			(at 149.86 140.97 0)
			(effects
				(font
					(size 1.27 1.27)
				)
				(hide yes)
			)
		)
		(property "Datasheet" "~"
			(at 149.86 140.97 0)
			(effects
				(font
					(size 1.27 1.27)
				)
				(hide yes)
			)
		)
		(property "Description" "Mounting Hole with connection"
			(at 149.86 140.97 0)
			(effects
				(font
					(size 1.27 1.27)
				)
				(hide yes)
			)
		)
		(pin "1"
			(uuid "b5b300e4-00c7-40e7-a889-339c7b991b24")
		)
		(instances
			(project "ftx"
				(path "/9da63cf1-7a13-4903-bc82-176c674403f0"
					(reference "H3")
					(unit 1)
				)
			)
			(project "FiberTransmitter"
				(path "/bb93828a-0f26-4513-bed9-3adfe581bda2"
					(reference "H?")
					(unit 1)
				)
			)
		)
	)
	(symbol
		(lib_id "Mechanical:MountingHole_Pad")
		(at 140.97 140.97 0)
		(unit 1)
		(exclude_from_sim no)
		(in_bom no)
		(on_board yes)
		(dnp no)
		(fields_autoplaced yes)
		(uuid "c09ca466-1bd4-4b22-bfc0-242f300b792e")
		(property "Reference" "H2"
			(at 144.145 139.065 0)
			(effects
				(font
					(size 1.27 1.27)
				)
				(justify left)
			)
		)
		(property "Value" "MountingHole_Pad"
			(at 144.145 141.605 0)
			(effects
				(font
					(size 1.27 1.27)
				)
				(justify left)
				(hide yes)
			)
		)
		(property "Footprint" "DSA2K:MountingHole_2_Pad_Via"
			(at 140.97 140.97 0)
			(effects
				(font
					(size 1.27 1.27)
				)
				(hide yes)
			)
		)
		(property "Datasheet" "~"
			(at 140.97 140.97 0)
			(effects
				(font
					(size 1.27 1.27)
				)
				(hide yes)
			)
		)
		(property "Description" "Mounting Hole with connection"
			(at 140.97 140.97 0)
			(effects
				(font
					(size 1.27 1.27)
				)
				(hide yes)
			)
		)
		(pin "1"
			(uuid "1ae01b1f-528b-4e1b-a45b-47175c1b305d")
		)
		(instances
			(project "ftx"
				(path "/9da63cf1-7a13-4903-bc82-176c674403f0"
					(reference "H2")
					(unit 1)
				)
			)
			(project "FiberTransmitter"
				(path "/bb93828a-0f26-4513-bed9-3adfe581bda2"
					(reference "H?")
					(unit 1)
				)
			)
		)
	)
	(symbol
		(lib_id "power:GND")
		(at 140.97 143.51 0)
		(unit 1)
		(exclude_from_sim no)
		(in_bom yes)
		(on_board yes)
		(dnp no)
		(uuid "e9e1f319-53b4-4fd0-a488-729a216b7c1a")
		(property "Reference" "#PWR02"
			(at 140.97 149.86 0)
			(effects
				(font
					(size 1.27 1.27)
				)
				(hide yes)
			)
		)
		(property "Value" "GND"
			(at 140.462 148.59 0)
			(effects
				(font
					(size 1.27 1.27)
				)
			)
		)
		(property "Footprint" ""
			(at 140.97 143.51 0)
			(effects
				(font
					(size 1.27 1.27)
				)
				(hide yes)
			)
		)
		(property "Datasheet" ""
			(at 140.97 143.51 0)
			(effects
				(font
					(size 1.27 1.27)
				)
				(hide yes)
			)
		)
		(property "Description" "Power symbol creates a global label with name \"GND\" , ground"
			(at 140.97 143.51 0)
			(effects
				(font
					(size 1.27 1.27)
				)
				(hide yes)
			)
		)
		(pin "1"
			(uuid "daf38fa6-08a6-4897-897d-b06dece855ac")
		)
		(instances
			(project "ftx"
				(path "/9da63cf1-7a13-4903-bc82-176c674403f0"
					(reference "#PWR02")
					(unit 1)
				)
			)
			(project "FiberTransmitter"
				(path "/bb93828a-0f26-4513-bed9-3adfe581bda2"
					(reference "#PWR?")
					(unit 1)
				)
			)
			(project "GreX Frontend"
				(path "/e63e39d7-6ac0-4ffd-8aa3-1841a4541b55/af925654-dfb9-45aa-816e-cb4703dcab2f"
					(reference "#PWR?")
					(unit 1)
				)
			)
		)
	)
	(symbol
		(lib_id "Connector:Screw_Terminal_01x04")
		(at 121.92 121.92 0)
		(mirror y)
		(unit 1)
		(exclude_from_sim no)
		(in_bom yes)
		(on_board yes)
		(dnp no)
		(uuid "eaec954d-b56d-43df-9dc1-39f9505ad683")
		(property "Reference" "J1"
			(at 121.412 113.03 0)
			(effects
				(font
					(size 1.27 1.27)
				)
			)
		)
		(property "Value" "4-pin header"
			(at 121.92 115.57 0)
			(effects
				(font
					(size 1.27 1.27)
				)
			)
		)
		(property "Footprint" "DSA2K:JST_PH_S4B-PH-SM4-TB_1x04-1MP_P2.00mm_Horizontal"
			(at 121.92 121.92 0)
			(effects
				(font
					(size 1.27 1.27)
				)
				(hide yes)
			)
		)
		(property "Datasheet" "https://www.jst-mfg.com/product/pdf/eng/ePH.pdf"
			(at 121.92 121.92 0)
			(effects
				(font
					(size 1.27 1.27)
				)
				(hide yes)
			)
		)
		(property "Description" "PH header, 4-pin, SMT"
			(at 121.92 121.92 0)
			(effects
				(font
					(size 1.27 1.27)
				)
				(hide yes)
			)
		)
		(property "MPN" "S4B-PH-SM4-TB"
			(at 121.92 121.92 0)
			(effects
				(font
					(size 1.27 1.27)
				)
				(hide yes)
			)
		)
		(pin "1"
			(uuid "3e5e576c-3ad8-4cea-8bd1-9ee1ec7b8379")
		)
		(pin "2"
			(uuid "03c2bbd3-fe2c-452e-80e8-2ff3764e74bc")
		)
		(pin "3"
			(uuid "88b28aa8-fbd8-4a44-881b-29cbb78ee14a")
		)
		(pin "4"
			(uuid "3824e118-5dfd-4c35-a96c-d9677671b1a1")
		)
		(instances
			(project "ftx"
				(path "/9da63cf1-7a13-4903-bc82-176c674403f0"
					(reference "J1")
					(unit 1)
				)
			)
			(project "FiberTransmitter"
				(path "/bb93828a-0f26-4513-bed9-3adfe581bda2"
					(reference "J?")
					(unit 1)
				)
				(path "/bb93828a-0f26-4513-bed9-3adfe581bda2/b18ee014-8f5b-427f-bd4a-ff05b0d11437"
					(reference "J?")
					(unit 1)
				)
			)
			(project "GreX Frontend"
				(path "/e63e39d7-6ac0-4ffd-8aa3-1841a4541b55/af925654-dfb9-45aa-816e-cb4703dcab2f"
					(reference "J?")
					(unit 1)
				)
			)
		)
	)
	(sheet
		(at 146.05 86.36)
		(size 31.75 22.86)
		(fields_autoplaced yes)
		(stroke
			(width 0.1524)
			(type solid)
		)
		(fill
			(color 0 0 0 0.0000)
		)
		(uuid "0149645a-b066-4f32-a406-591f997f9861")
		(property "Sheetname" "Digital"
			(at 146.05 85.6484 0)
			(effects
				(font
					(size 1.27 1.27)
				)
				(justify left bottom)
			)
		)
		(property "Sheetfile" "digital.kicad_sch"
			(at 146.05 109.8046 0)
			(effects
				(font
					(size 1.27 1.27)
				)
				(justify left top)
				(hide yes)
			)
		)
		(pin "SCL" input
			(at 146.05 104.14 180)
			(effects
				(font
					(size 1.27 1.27)
				)
				(justify left)
			)
			(uuid "83d91ecc-c756-422e-8819-4672b67aaec2")
		)
		(pin "LNA_IMON" input
			(at 162.56 86.36 90)
			(effects
				(font
					(size 1.27 1.27)
				)
				(justify right)
			)
			(uuid "8092c0c2-1339-4c53-9888-db4fb85f7d48")
		)
		(pin "LNA_EN" output
			(at 166.37 86.36 90)
			(effects
				(font
					(size 1.27 1.27)
				)
				(justify right)
			)
			(uuid "6ddad7f8-544d-4688-bee5-e24d2f6b30bb")
		)
		(pin "LD_IMON" input
			(at 146.05 99.06 180)
			(effects
				(font
					(size 1.27 1.27)
				)
				(justify left)
			)
			(uuid "b18cf50e-8f4f-47f9-90aa-90c3e0e22334")
		)
		(pin "PD_IMON" input
			(at 146.05 96.52 180)
			(effects
				(font
					(size 1.27 1.27)
				)
				(justify left)
			)
			(uuid "b54e3a81-142b-4fbb-99d5-939771f30aab")
		)
		(pin "SDA" bidirectional
			(at 146.05 106.68 180)
			(effects
				(font
					(size 1.27 1.27)
				)
				(justify left)
			)
			(uuid "3fbfbcb3-c6ce-4646-8759-d3c4df908949")
		)
		(pin "3V3" input
			(at 146.05 88.9 180)
			(effects
				(font
					(size 1.27 1.27)
				)
				(justify left)
			)
			(uuid "d40ee366-767e-4438-afee-32489475d3d5")
		)
		(pin "+5_VREF" input
			(at 146.05 91.44 180)
			(effects
				(font
					(size 1.27 1.27)
				)
				(justify left)
			)
			(uuid "b3043150-2b54-41b6-99f8-54c165861478")
		)
		(pin "+5V5" input
			(at 146.05 93.98 180)
			(effects
				(font
					(size 1.27 1.27)
				)
				(justify left)
			)
			(uuid "8104aff2-a0fc-4fc3-8174-671ac42d158e")
		)
		(pin "RF_MON" input
			(at 146.05 101.6 180)
			(effects
				(font
					(size 1.27 1.27)
				)
				(justify left)
			)
			(uuid "8778d905-bee3-44d3-8524-b801b3e683a3")
		)
		(pin "VLNA" input
			(at 177.8 88.9 0)
			(effects
				(font
					(size 1.27 1.27)
				)
				(justify right)
			)
			(uuid "a1d90f25-e717-40d1-b2cf-8d0cd497e247")
		)
		(instances
			(project "ftx"
				(path "/9da63cf1-7a13-4903-bc82-176c674403f0"
					(page "4")
				)
			)
		)
	)
	(sheet
		(at 125.73 57.15)
		(size 12.7 8.89)
		(fields_autoplaced yes)
		(stroke
			(width 0.1524)
			(type solid)
		)
		(fill
			(color 0 0 0 0.0000)
		)
		(uuid "14dd2a8e-9ee8-41a2-9b0b-8c3b22a0980a")
		(property "Sheetname" "RF1"
			(at 125.73 56.4384 0)
			(effects
				(font
					(size 1.27 1.27)
				)
				(justify left bottom)
			)
		)
		(property "Sheetfile" "rf1.kicad_sch"
			(at 125.73 66.6246 0)
			(effects
				(font
					(size 1.27 1.27)
				)
				(justify left top)
				(hide yes)
			)
		)
		(pin "+5V5" input
			(at 138.43 62.23 0)
			(effects
				(font
					(size 1.27 1.27)
				)
				(justify right)
			)
			(uuid "f23e4108-d70d-4b9d-b0f9-2162b69d1291")
		)
		(pin "VLNA" input
			(at 138.43 59.69 0)
			(effects
				(font
					(size 1.27 1.27)
				)
				(justify right)
			)
			(uuid "de4a638b-c48d-4079-a243-01d614c82241")
		)
		(instances
			(project "ftx"
				(path "/9da63cf1-7a13-4903-bc82-176c674403f0"
					(page "2")
				)
			)
		)
	)
	(sheet
		(at 125.73 69.85)
		(size 12.7 39.37)
		(fields_autoplaced yes)
		(stroke
			(width 0.1524)
			(type solid)
		)
		(fill
			(color 0 0 0 0.0000)
		)
		(uuid "6e108a48-3ff8-45de-8199-6ab2f51d2a8b")
		(property "Sheetname" "RF2"
			(at 125.73 69.1384 0)
			(effects
				(font
					(size 1.27 1.27)
				)
				(justify left bottom)
			)
		)
		(property "Sheetfile" "rf2.kicad_sch"
			(at 125.73 109.8046 0)
			(effects
				(font
					(size 1.27 1.27)
				)
				(justify left top)
				(hide yes)
			)
		)
		(pin "+5V5" input
			(at 138.43 93.98 0)
			(effects
				(font
					(size 1.27 1.27)
				)
				(justify right)
			)
			(uuid "71f388e5-5da9-4fb3-864f-7535e0214e49")
		)
		(pin "RF_MON" input
			(at 138.43 101.6 0)
			(effects
				(font
					(size 1.27 1.27)
				)
				(justify right)
			)
			(uuid "e4a1b4bb-50c1-4bed-a0f8-4a1a1fe847ac")
		)
		(pin "SDA" bidirectional
			(at 138.43 106.68 0)
			(effects
				(font
					(size 1.27 1.27)
				)
				(justify right)
			)
			(uuid "97c84e2b-9909-42e1-b46f-b787e52a7ad7")
		)
		(pin "SCL" input
			(at 138.43 104.14 0)
			(effects
				(font
					(size 1.27 1.27)
				)
				(justify right)
			)
			(uuid "7e0b6e6a-09d9-4bc6-a319-d33058da0123")
		)
		(pin "3V3" input
			(at 138.43 88.9 0)
			(effects
				(font
					(size 1.27 1.27)
				)
				(justify right)
			)
			(uuid "a38c31e8-6bb6-4120-9d37-445f70fd0361")
		)
		(pin "PD_IMON" output
			(at 138.43 96.52 0)
			(effects
				(font
					(size 1.27 1.27)
				)
				(justify right)
			)
			(uuid "4d806aa4-7f42-4141-a3f4-e3cbb015350c")
		)
		(pin "+5V_REF" input
			(at 138.43 91.44 0)
			(effects
				(font
					(size 1.27 1.27)
				)
				(justify right)
			)
			(uuid "450c7302-f65e-40ac-8070-a5883236b62f")
		)
		(pin "LD_IMON" output
			(at 138.43 99.06 0)
			(effects
				(font
					(size 1.27 1.27)
				)
				(justify right)
			)
			(uuid "1a071467-5465-4824-9e87-66f28cc93763")
		)
		(pin "-5V" input
			(at 138.43 73.66 0)
			(effects
				(font
					(size 1.27 1.27)
				)
				(justify right)
			)
			(uuid "dccec353-d58f-4b5b-827f-f6e0498c46fa")
		)
		(instances
			(project "ftx"
				(path "/9da63cf1-7a13-4903-bc82-176c674403f0"
					(page "3")
				)
			)
		)
	)
	(sheet
		(at 146.05 69.85)
		(size 31.75 12.7)
		(stroke
			(width 0.1524)
			(type solid)
		)
		(fill
			(color 0 0 0 0.0000)
		)
		(uuid "d3cfbb1e-00bc-44fc-9016-5cffa10300a7")
		(property "Sheetname" "Power"
			(at 146.05 69.1384 0)
			(effects
				(font
					(size 1.27 1.27)
				)
				(justify left bottom)
			)
		)
		(property "Sheetfile" "power.kicad_sch"
			(at 153.67 67.31 0)
			(effects
				(font
					(size 1.27 1.27)
				)
				(justify left top)
				(hide yes)
			)
		)
		(pin "VLNA" output
			(at 177.8 72.39 0)
			(effects
				(font
					(size 1.27 1.27)
				)
				(justify right)
			)
			(uuid "b0dcd6a0-a09e-4cb6-ac32-ccf5744a588e")
		)
		(pin "VDD" input
			(at 177.8 76.2 0)
			(effects
				(font
					(size 1.27 1.27)
				)
				(justify right)
			)
			(uuid "76d5ace1-e5d5-4ec6-a3eb-09d416f3cc3e")
		)
		(pin "LNA_EN" input
			(at 166.37 82.55 270)
			(effects
				(font
					(size 1.27 1.27)
				)
				(justify left)
			)
			(uuid "faae8f3e-b0eb-489e-adb7-e63bc5188dbb")
		)
		(pin "LNA_IMON" output
			(at 162.56 82.55 270)
			(effects
				(font
					(size 1.27 1.27)
				)
				(justify left)
			)
			(uuid "f07f9288-a856-42d6-8f99-184a3ff5f839")
		)
		(pin "+3V3" output
			(at 146.05 76.2 180)
			(effects
				(font
					(size 1.27 1.27)
				)
				(justify left)
			)
			(uuid "6fc45b5b-d3c7-47b6-9f09-9b82c38b9917")
		)
		(pin "+5V5" output
			(at 146.05 81.28 180)
			(effects
				(font
					(size 1.27 1.27)
				)
				(justify left)
			)
			(uuid "a2df4c6a-25c9-4beb-942d-be2eae42f3cb")
		)
		(pin "-5V" output
			(at 146.05 73.66 180)
			(effects
				(font
					(size 1.27 1.27)
				)
				(justify left)
			)
			(uuid "e97ec7b7-24ab-4911-a41c-94c568d601dc")
		)
		(pin "+5V_REF" output
			(at 146.05 78.74 180)
			(effects
				(font
					(size 1.27 1.27)
				)
				(justify left)
			)
			(uuid "f8141961-09e6-4dd8-8961-7adb5c79262e")
		)
		(instances
			(project "ftx"
				(path "/9da63cf1-7a13-4903-bc82-176c674403f0"
					(page "5")
				)
			)
		)
	)
	(sheet_instances
		(path "/"
			(page "1")
		)
	)
)
