<?xml version="1.0" encoding="UTF-8" standalone="no"?>
<!-- Created with Inkscape (http://www.inkscape.org/) -->

<svg
   version="1.1"
   id="svg2"
   width="300"
   height="300"
   viewBox="0 0 300 300"
   sodipodi:docname="logo.svg"
   inkscape:version="1.4 (e7c3feb100, 2024-10-09)"
   inkscape:export-filename="/home/ergonlogic/Downloads/rugged-icon.png"
   inkscape:export-xdpi="92.698944"
   inkscape:export-ydpi="92.698944"
   xmlns:inkscape="http://www.inkscape.org/namespaces/inkscape"
   xmlns:sodipodi="http://sodipodi.sourceforge.net/DTD/sodipodi-0.dtd"
   xmlns="http://www.w3.org/2000/svg"
   xmlns:svg="http://www.w3.org/2000/svg"
   xmlns:rdf="http://www.w3.org/1999/02/22-rdf-syntax-ns#"
   xmlns:cc="http://creativecommons.org/ns#"
   xmlns:dc="http://purl.org/dc/elements/1.1/">
  <metadata
     id="metadata8">
    <rdf:RDF>
      <cc:Work
         rdf:about="">
        <dc:format>image/svg+xml</dc:format>
        <dc:type
           rdf:resource="http://purl.org/dc/dcmitype/StillImage" />
        <dc:title />
      </cc:Work>
    </rdf:RDF>
  </metadata>
  <defs
     id="defs6" />
  <sodipodi:namedview
     pagecolor="#ffffff"
     bordercolor="#666666"
     borderopacity="1"
     objecttolerance="10"
     gridtolerance="10"
     guidetolerance="10"
     inkscape:pageopacity="0"
     inkscape:pageshadow="2"
     inkscape:window-width="1920"
     inkscape:window-height="1018"
     id="namedview4"
     showgrid="false"
     inkscape:zoom="1.4142136"
     inkscape:cx="198.697"
     inkscape:cy="213.8998"
     inkscape:window-x="0"
     inkscape:window-y="0"
     inkscape:window-maximized="0"
     inkscape:current-layer="svg2"
     inkscape:showpageshadow="2"
     inkscape:pagecheckerboard="0"
     inkscape:deskcolor="#d1d1d1" />
  <g
     id="g1">
    <path
       style="fill:#ffffff;stroke:#0678be;stroke-width:21.1;stroke-linecap:butt;stroke-linejoin:round;stroke-miterlimit:4;stroke-dasharray:none;stroke-opacity:1"
       d="M 29.659185,236.83516 151.82087,23.039471 273.67192,236.65202 Z"
       id="path888"
       inkscape:connector-curvature="0"
       sodipodi:nodetypes="cccc" />
    <g
       id="g1523"
       transform="translate(-247.87682,98.287843)"
       style="fill:#064771;fill-opacity:1">
      <path
         sodipodi:nodetypes="cccscccsscccccccsscccsccccccsccccccscscscsccsscccsssscsssscccsss"
         style="fill:#064771;fill-opacity:1"
         d="m 397.92877,119.88249 -3.04721,-3.04721 -6.73165,1.56118 c -8.84875,2.05216 -9.21354,1.99619 -5.9133,-0.90723 l 2.80576,-2.4684 -8,-0.1276 -8,-0.12759 5,-1.28521 c 4.44613,-1.14284 1.92603,-1.29837 -22.75,-1.40401 l -27.75,-0.11879 v -2.5 -2.5 h 76 76 v 2.5 2.5 l -26.75,0.11879 c -23.86015,0.10596 -26.20984,0.25764 -21.75,1.40401 l 5,1.28521 -8,0.13196 -8,0.13196 3,2.45907 c 3.47001,2.84433 2.51644,2.9985 -5.9883,0.96818 l -5.98831,-1.42957 -3.04489,2.95123 -3.04489,2.95123 z M 338.19958,95.70763 c 1.04689,-9.52956 -0.98372,-9.23893 19.58263,-2.80271 10.04309,3.14297 18.93516,5.98007 19.76016,6.30465 0.825,0.32459 -7.79468,0.62569 -19.15484,0.66911 l -20.65485,0.0789 z m 89.34279,3.59177 c 2.37972,-0.6762 35.48784,-8.06541 35.61084,-7.94778 0.061,0.0583 0.40378,2.01851 0.76182,4.35601 l 0.65098,4.25 -19.26182,-0.116 c -10.594,-0.0638 -18.58682,-0.30781 -17.76182,-0.54223 z M 353.0204,84.06671 c -9.91209,-3.14606 -18.80975,-6.0224 -19.77259,-6.39187 -1.56873,-0.60198 -1.32735,-1.51359 2.32329,-8.77435 3.65542,-7.27027 4.24839,-7.966 5.77258,-6.77297 6.18034,4.8375 31.4673,28.26353 29.94869,27.7447 -0.1375,-0.047 -8.35989,-2.65946 -18.27197,-5.80551 z m 66.89295,3.39092 c 0.31526,-1.1 1.87894,-7.53068 3.47484,-14.2904 1.59591,-6.75972 3.15414,-12.5429 3.46275,-12.8515 0.54,-0.54001 12.36532,6.30523 13.18578,7.63275 0.22062,0.35698 -4.34585,5.34257 -10.14772,11.0791 -5.80187,5.73653 -10.29091,9.53005 -9.97565,8.43005 z m 14.62902,0.0124 c 0,-0.74359 25.05045,-20.51237 25.9927,-20.51237 1.41043,0 6.35473,10.65224 5.7164,12.31568 -0.26078,0.6796 -3.11452,1.8024 -6.34163,2.49511 -3.22711,0.69271 -10.25497,2.31578 -15.61747,3.60682 -5.3625,1.29104 -9.75,2.23368 -9.75,2.09476 z m -67.84401,-14.85606 -13.31623,-13.34369 3.14345,-2.64504 3.14345,-2.64504 7.98489,12.08499 c 9.59598,14.52335 13.00683,19.89247 12.6371,19.89247 -0.15204,0 -6.26874,-6.00466 -13.59266,-13.34369 z"
         id="path819"
         inkscape:connector-curvature="0" />
      <path
         sodipodi:nodetypes="cccccccccccccccccccccccccccccccccccccc"
         style="fill:#064771;fill-opacity:1;stroke-width:0.29316443"
         id="path941"
         d="m 409.89322,92.515429 c 0.33714,-0.397243 0.52362,-0.915577 0.51514,-1.448293 l 0.2825,-51.303027 c 9.10265,-5.900778 12.41944,-11.942461 12.54755,-21.0568 0.25413,-13.8514295 -11.73826,-22.7177095 -22.52834,-22.9171925 -12.6188,0.06526 -23.50893,9.904846 -23.43487,23.0391495 0.58216,11.405241 7.27343,18.51984 14.18626,21.416271 l 0.0707,19.674884 c 0.007,0.632023 0.26273,1.21678 0.73217,1.652249 l 4.33188,3.997892 -4.29174,4.061562 c -0.45119,0.429954 -0.71797,1.018957 -0.70919,1.651816 -0.003,0.621076 0.26213,1.222378 0.7207,1.640909 l 4.344,4.01648 -4.30137,4.042964 c -0.45183,0.430139 -0.709,1.030318 -0.71189,1.65161 0.007,0.631395 0.21231,1.169358 0.73154,1.652888 l 4.33254,4.007192 -4.29157,4.053912 c -0.48498,0.440634 -0.73195,1.081843 -0.71378,1.728527 0.0305,0.582581 0.26448,1.111678 0.66781,1.510993 0.0579,0.05742 0.11947,0.113926 0.18408,0.167008 l 7.13394,5.649527 c 0.96239,0.76509 2.36217,0.61629 3.14934,-0.32797 z m -9.21019,-75.367772 c -3.92663,0.01763 -7.11829,-3.142284 -7.13585,-7.064745 -0.0199,-3.9259755 3.1394,-7.1170315 7.06352,-7.1345985 3.9212,-0.02041 7.11369,3.13651 7.13646,7.0641255 0.0192,3.921213 -3.14335,7.113115 -7.06413,7.135218 z m 3.19363,70.471375 c -0.46682,0.0021 -0.89711,-0.191823 -1.20253,-0.494191 -0.30542,-0.302378 -0.50388,-0.731125 -0.50621,-1.197532 l 0.323,-43.852299 c 1.14531,-0.04886 2.01383,-0.307728 3.12578,-0.515839 l -0.0537,44.356117 c 0.005,0.933649 -0.75312,1.699074 -1.68637,1.703744 z"
         inkscape:connector-curvature="0" />
    </g>
  </g>
  <path
     style="font-weight:900;font-size:42.6667px;line-height:1.25;font-family:'Roboto Slab';-inkscape-font-specification:'Roboto Slab Heavy';letter-spacing:0px;word-spacing:0px;fill:#064771"
     d="m 63.905134,283.383 v -4.27084 l 3.145833,-0.66666 v -20.43751 l -3.145833,-0.66666 v -4.3125 h 14.916667 q 3.604166,0 6.25,1.14583 2.645833,1.14583 4.083333,3.27083 1.4375,2.10417 1.4375,5 0,2.47917 -1.270833,4.64584 -1.25,2.16667 -3.416667,3.5625 l 3.166667,7.75 2.875,0.72917 v 4.25 h -8.833334 l -3.770833,-10.9375 -4.979167,-0.0625 v 6.0625 l 3.145834,0.66666 v 4.27084 z m 10.458333,-16.60417 h 4.541667 q 2.125,0 3.270833,-0.97917 1.145834,-1 1.145834,-2.875 0,-1.9375 -1.166667,-3.10417 -1.166667,-1.1875 -3.333333,-1.1875 H 74.363467 Z M 109.1343,283.8205 q -3.91667,0 -6.83333,-1.25 -2.895836,-1.27084 -4.47917,-3.70834 -1.583333,-2.4375 -1.583333,-5.95833 v -14.89584 l -3.125,-0.66666 v -4.29167 H 106.6968 v 4.29167 l -3.14583,0.66666 v 14.89584 q 0,2.75 1.4375,4.08333 1.4375,1.3125 4.10416,1.3125 5.58334,0 5.58334,-5.39583 v -14.89584 l -3.125,-0.66666 v -4.29167 h 13.58333 v 4.29167 l -3.14583,0.66666 v 14.89584 q 0,3.45833 -1.625,5.91667 -1.625,2.4375 -4.52084,3.72916 -2.875,1.27084 -6.70833,1.27084 z m 31.58333,0 q -4.70833,0 -7.97916,-1.83334 -3.25,-1.83333 -4.95834,-5.08333 -1.70833,-3.27083 -1.70833,-7.5625 v -1.375 q 0,-4.52083 1.6875,-7.97917 1.6875,-3.45833 4.89583,-5.41667 3.20834,-1.95833 7.75,-1.95833 3.10417,0 6.22917,0.95833 3.125,0.9375 5.5,2.97917 v 7.10417 h -5.20833 l -1.10417,-3.85417 q -0.70833,-0.72917 -2.02083,-1.20833 -1.29167,-0.47917 -2.91667,-0.47917 -3.77083,0 -5.66667,2.72917 -1.89583,2.70833 -1.89583,7.08333 v 1.41667 q 0,4.125 1.95833,6.5625 1.97917,2.4375 5.72917,2.4375 1.3125,0 2.60417,-0.27083 1.29166,-0.27084 2.02083,-0.60417 v -3.91667 l -3.41667,-0.41666 v -5.04167 h 10.75 v 12.58333 q -2.45833,1.58334 -5.5625,2.375 -3.08333,0.77084 -6.6875,0.77084 z m 28.625,0 q -4.70833,0 -7.97916,-1.83334 -3.25,-1.83333 -4.95834,-5.08333 -1.70833,-3.27083 -1.70833,-7.5625 v -1.375 q 0,-4.52083 1.6875,-7.97917 1.6875,-3.45833 4.89583,-5.41667 3.20834,-1.95833 7.75,-1.95833 3.10417,0 6.22917,0.95833 3.125,0.9375 5.5,2.97917 v 7.10417 h -5.20833 l -1.10417,-3.85417 q -0.70833,-0.72917 -2.02083,-1.20833 -1.29167,-0.47917 -2.91667,-0.47917 -3.77083,0 -5.66667,2.72917 -1.89583,2.70833 -1.89583,7.08333 v 1.41667 q 0,4.125 1.95833,6.5625 1.97917,2.4375 5.72917,2.4375 1.3125,0 2.60417,-0.27083 1.29166,-0.27084 2.02083,-0.60417 v -3.91667 l -3.41667,-0.41666 v -5.04167 h 10.75 v 12.58333 q -2.45833,1.58334 -5.5625,2.375 -3.08333,0.77084 -6.6875,0.77084 z m 14.58334,-0.4375 v -4.27084 l 3.14583,-0.66666 v -20.43751 l -3.14583,-0.66666 v -4.29167 h 24.22917 v 8.75 h -5.52084 l -0.16666,-3.125 h -8.08334 v 6.22917 h 9.6875 v 5.60417 h -9.6875 v 7.22916 h 8.47917 l 0.16667,-3.27083 h 5.45833 v 8.91667 z m 27.27084,0 v -4.27084 l 3.1875,-0.77083 v -20.20834 l -3.1875,-0.79166 v -4.29167 h 14.20833 q 4.10417,0 7.27083,1.91667 3.16667,1.89583 4.95834,5.27083 1.79166,3.35417 1.79166,7.75 v 0.47917 q 0,4.39583 -1.79166,7.77083 -1.79167,3.35417 -4.95834,5.25 -3.16666,1.89584 -7.27083,1.89584 z m 10.5,-5.54167 h 3.33333 q 3.45833,0 5.25,-2.5625 1.79167,-2.58333 1.79167,-6.8125 v -0.5 q 0,-4.20833 -1.79167,-6.77084 -1.79167,-2.58333 -5.25,-2.58333 h -3.33333 z"
     id="text1527"
     aria-label="RUGGED" />
</svg>
