<svg id="Livello_1" data-name="Livello 1" xmlns="http://www.w3.org/2000/svg" width="1902.7" height="923.3" viewBox="0 0 1902.7 923.3">
  <title>triangle-center-colored</title>
  <g opacity="0.25">
    <polygon points="146.5 207.6 146.5 291.8 219.7 249.6 146.5 207.6" fill="#d7d8d8"/>
    <polygon points="146.5 291.8 146.5 375.9 219.7 333.8 146.5 291.8" fill="#dcdbdb"/>
    <polygon points="146.5 375.9 146.5 460.1 219.7 417.9 146.5 375.9" fill="#e4e4e4"/>
    <polygon points="146.5 460.1 146.5 375.9 73.3 418.1 146.5 460.1" fill="#d7d8d8"/>
    <polygon points="146.5 460.1 146.5 544.2 219.7 502 146.5 460.1" fill="#dcdbdb"/>
    <polygon points="146.5 544.2 146.5 460.1 73.3 502.2 146.5 544.2" fill="#cccbca"/>
    <polygon points="146.5 544.2 146.5 628.3 219.7 586.2 146.5 544.2" fill="#d7d8d8"/>
    <polygon points="146.5 628.3 146.5 544.2 73.3 586.4 146.5 628.3" fill="#e9e9e9"/>
    <polygon points="146.5 628.4 146.5 712.5 219.7 670.3 146.5 628.4" fill="#ededed"/>
    <polygon points="146.5 712.5 146.5 628.4 73.3 670.5 146.5 712.5" fill="#e4e4e4"/>
    <polygon points="292.9 207.5 292.9 291.6 366.1 249.4 292.9 207.5" fill="#cccbca"/>
    <polygon points="292.9 291.6 292.9 207.5 219.7 249.6 292.9 291.6" fill="#e9e9e9"/>
    <polygon points="292.9 375.7 292.9 291.6 219.7 333.8 292.9 375.7" fill="#f9f9fa"/>
    <polygon points="292.9 375.7 292.9 459.9 366.1 417.7 292.9 375.7" fill="#fff"/>
    <polygon points="292.9 459.9 292.9 375.7 219.7 417.9 292.9 459.9" fill="#e9e9e9"/>
    <polygon points="292.9 459.9 292.9 544 366.1 501.9 292.9 459.9" fill="#e9e9e9"/>
    <polygon points="292.9 544 292.9 459.9 219.7 502.1 292.9 544" fill="#fff"/>
    <polygon points="292.9 544 292.9 628.2 366.1 586 292.9 544" fill="#efeeee"/>
    <polygon points="292.9 628.2 292.9 544 219.7 586.2 292.9 628.2" fill="#d7d8d8"/>
    <polygon points="292.9 628.2 292.9 712.3 366.1 670.2 292.9 628.2" fill="#d4d3d2"/>
    <polygon points="292.9 712.3 292.9 628.2 219.7 670.3 292.9 712.3" fill="#f9f9fa"/>
    <polygon points="292.9 712.3 292.9 796.5 366.1 754.3 292.9 712.3" fill="#e9e9e9"/>
    <polygon points="292.9 796.5 292.9 712.3 219.7 754.5 292.9 796.5" fill="#dcdbdb"/>
    <polygon points="0.3 291.9 0.3 376.1 73.5 333.9 0.3 291.9" fill="#fff"/>
    <polygon points="0.3 376.1 0.3 460.2 73.5 418.1 0.3 376.1" fill="#dcdbdb"/>
    <polygon points="0.3 460.2 0.3 544.4 73.5 502.2 0.3 460.2" fill="#d7d8d8"/>
    <polygon points="0.3 544.4 0.3 628.5 73.5 586.3 0.3 544.4" fill="#d7d8d8"/>
    <polygon points="731.7 291.3 731.7 207.1 658.6 249.3 731.7 291.3" fill="#dcdbdb"/>
    <polygon points="731.7 375.4 731.7 291.3 658.6 333.4 731.7 375.4" fill="#fff"/>
    <polygon points="731.7 459.6 731.7 375.4 658.6 417.6 731.7 459.6" fill="#dcdbdb"/>
    <polygon points="731.7 543.7 731.7 459.6 658.6 501.7 731.7 543.7" fill="#e9e9e9"/>
    <polygon points="731.9 627.8 731.9 543.7 658.7 585.9 731.9 627.8" fill="#e9e9e9"/>
    <polygon points="439.1 291.6 439.1 207.4 366 249.6 439.1 291.6" fill="#e9e9e9"/>
    <polygon points="439.1 291.6 439.1 375.7 512.3 333.6 439.1 291.6" fill="#dcdbdb"/>
    <polygon points="439.1 375.7 439.1 459.9 512.3 417.7 439.1 375.7" fill="#d7d8d8"/>
    <polygon points="439.1 459.6 439.1 375.7 366 417.9 439.1 459.6" fill="#fff"/>
    <polygon points="439.1 459.9 439.1 544 512.3 501.9 439.1 459.9" fill="#e9e9e9"/>
    <polygon points="439.1 544 439.1 459.9 366 502 439.1 544" fill="#cecccb"/>
    <polygon points="439.1 544 439.1 628.2 512.3 586 439.1 544" fill="#ededed"/>
    <polygon points="439.1 628.2 439.1 544 366 586.2 439.1 628.2" fill="#cecccb"/>
    <polygon points="439.1 628.2 439.1 712.3 512.3 670.1 439.1 628.2" fill="#e0e0df"/>
    <polygon points="439.1 712.3 439.1 628.2 366 670.3 439.1 712.3" fill="#e8e7e8"/>
    <polygon points="439.1 712.3 439.1 796.4 512.3 754.3 439.1 712.3" fill="#d7d8d8"/>
    <polygon points="439.1 796.4 439.1 712.3 366 754.5 439.1 796.4" fill="#efeeee"/>
    <polygon points="585.5 207.3 585.5 291.4 658.7 249.3 585.5 207.3" fill="#fff"/>
    <polygon points="585.5 291.4 585.5 207.3 512.4 249.4 585.5 291.4" fill="#e9e9e9"/>
    <polygon points="585.5 291.4 585.5 375.6 658.7 333.4 585.5 291.4" fill="#e9e9e9"/>
    <polygon points="585.5 375.6 585.5 291.4 512.4 333.6 585.5 375.6" fill="#e9e9e9"/>
    <polygon points="585.5 375.6 585.5 459.7 658.7 417.5 585.5 375.6" fill="#dcdbdb"/>
    <polygon points="585.5 459.7 585.5 375.6 512.4 417.7 585.5 459.7" fill="#dcdbdb"/>
    <polygon points="585.5 459.7 585.5 543.9 658.7 501.7 585.5 459.7" fill="none"/>
    <polygon points="585.5 543.9 585.5 459.7 512.4 501.9 585.5 543.9" fill="#e0e0df"/>
    <polygon points="585.5 543.8 585.5 628 658.7 585.8 585.5 543.8" fill="#ededed"/>
    <polygon points="585.5 628 585.5 543.8 512.4 586 585.5 628" fill="#e9e9e9"/>
    <polygon points="585.5 628 585.5 712.1 658.7 670 585.5 628" fill="#e9e9e9"/>
    <polygon points="585.5 712.1 585.5 628 512.4 670.2 585.5 712.1" fill="#e1e2e1"/>
    <polygon points="219.7 249.6 219.7 333.8 292.9 291.6 219.7 249.6" fill="#dcdbdb"/>
    <polygon points="219.7 333.8 219.7 417.9 292.9 375.7 219.7 333.8" fill="#d7d8d8"/>
    <polygon points="219.7 417.9 219.7 333.8 146.5 375.9 219.7 417.9" fill="#f9f9fa"/>
    <polygon points="219.7 417.9 219.7 502 292.9 459.9 219.7 417.9" fill="#dcdbdb"/>
    <polygon points="219.7 502 219.7 417.9 146.5 460.1 219.7 502" fill="#e9e9e9"/>
    <polygon points="219.7 502.1 219.7 586.2 292.9 544 219.7 502.1" fill="#dcdbdb"/>
    <polygon points="219.7 586.2 219.7 502.1 146.5 544.2 219.7 586.2" fill="#ededed"/>
    <polygon points="219.7 586.2 219.7 670.3 292.9 628.2 219.7 586.2" fill="#fff"/>
    <polygon points="219.7 670.3 219.7 586.2 146.5 628.4 219.7 670.3" fill="#cccbca"/>
    <polygon points="219.7 670.3 219.7 754.5 292.9 712.3 219.7 670.3" fill="#cccbca"/>
    <polygon points="219.7 754.5 219.7 670.3 146.5 712.5 219.7 754.5" fill="#ededed"/>
    <polygon points="366.1 333.6 366.1 417.7 439.3 375.6 366.1 333.6" fill="#efeeee"/>
    <polygon points="366.1 417.7 366.1 333.6 293 375.8 366.1 417.7" fill="#cccbca"/>
    <polygon points="366.1 417.7 366.1 501.9 439.3 459.7 366.1 417.7" fill="#e0e0df"/>
    <polygon points="366.1 501.9 366.1 417.7 293 459.9 366.1 501.9" fill="#e9e9e9"/>
    <polygon points="366.1 501.9 366.1 586 439.3 543.9 366.1 501.9" fill="#e9e9e9"/>
    <polygon points="366.1 586 366.1 501.9 293 544 366.1 586" fill="#e0e0df"/>
    <polygon points="366.1 586 366.1 670.2 439.3 628 366.1 586" fill="#d7d8d8"/>
    <polygon points="366.1 670.2 366.1 586 293 628.2 366.1 670.2" fill="#e9e9e9"/>
    <polygon points="366.1 670.2 366.1 754.3 439.3 712.1 366.1 670.2" fill="#d7d8d8"/>
    <polygon points="366.1 754.3 366.1 670.2 293 712.3 366.1 754.3" fill="#dcdbdb"/>
    <polygon points="366 754.5 366 838.6 439.1 796.5 366 754.5" fill="#e9e9e9"/>
    <polygon points="366 838.6 366 754.5 292.8 796.7 366 838.6" fill="#dcdbdb"/>
    <polygon points="73.5 333.9 73.5 418.1 146.7 375.9 73.5 333.9" fill="#e4e4e4"/>
    <polygon points="73.5 418.1 73.5 333.9 0.4 376.1 73.5 418.1" fill="#e9e9e9"/>
    <polygon points="73.5 418.1 73.5 502.2 146.7 460 73.5 418.1" fill="#cccbca"/>
    <polygon points="73.5 502.2 73.5 418.1 0.4 460.2 73.5 502.2" fill="#cccbca"/>
    <polygon points="73.5 502.2 73.5 586.3 146.7 544.2 73.5 502.2" fill="#e4e4e4"/>
    <polygon points="73.5 586.3 73.5 502.2 0.4 544.4 73.5 586.3" fill="#e9e9e9"/>
    <polygon points="73.5 586.3 73.5 670.5 146.7 628.3 73.5 586.3" fill="#cccbca"/>
    <polygon points="73.5 670.5 73.5 586.3 0.4 628.5 73.5 670.5" fill="#e4e4e4"/>
    <polygon points="512.4 249.4 512.4 333.6 585.5 291.4 512.4 249.4" fill="#e1e2e1"/>
    <polygon points="512.4 333.6 512.4 249.4 439.2 291.6 512.4 333.6" fill="#dcdbdb"/>
    <polygon points="512.4 333.6 512.4 417.7 585.5 375.6 512.4 333.6" fill="#efeeee"/>
    <polygon points="512.4 417.7 512.4 333.6 439.2 375.7 512.4 417.7" fill="#e9e9e9"/>
    <polygon points="512.4 417.7 512.4 501.9 585.5 459.7 512.4 417.7" fill="#efeeee"/>
    <polygon points="512.4 501.9 512.4 417.7 439.2 459.9 512.4 501.9" fill="#e9e9e9"/>
    <polygon points="512.4 501.9 512.4 586 585.5 543.8 512.4 501.9" fill="#d7d8d8"/>
    <polygon points="512.4 586 512.4 501.9 439.2 544 512.4 586" fill="#e1e2e1"/>
    <polygon points="512.4 586 512.4 670.1 585.5 628 512.4 586" fill="#e1e2e1"/>
    <polygon points="512.4 670.1 512.4 586 439.2 628.2 512.4 670.1" fill="#dcdbdb"/>
    <polygon points="512.4 670.1 512.4 754.3 585.5 712.1 512.4 670.1" fill="#e9e9e9"/>
    <polygon points="512.4 754.3 512.4 670.1 439.2 712.3 512.4 754.3" fill="none"/>
    <polygon points="658.8 165.1 658.8 249.2 731.9 207.1 658.8 165.1" fill="#e9e9e9"/>
    <polygon points="658.8 249.3 658.8 333.4 731.9 291.2 658.8 249.3" fill="#e9e9e9"/>
    <polygon points="658.8 333.4 658.8 249.3 585.6 291.4 658.8 333.4" fill="#dcdbdb"/>
    <polygon points="658.8 333.4 658.8 417.6 731.9 375.4 658.8 333.4" fill="#d7d8d8"/>
    <polygon points="658.8 417.6 658.8 333.4 585.6 375.6 658.8 417.6" fill="#efeeee"/>
    <polygon points="658.8 417.6 658.8 501.7 731.9 459.5 658.8 417.6" fill="#e1e2e1"/>
    <polygon points="658.8 501.7 658.8 417.6 585.6 459.7 658.8 501.7" fill="#d7d8d8"/>
    <polygon points="658.8 501.7 658.8 585.8 731.9 543.7 658.8 501.7" fill="#e4e4e4"/>
    <polygon points="658.8 585.8 658.8 501.7 585.6 543.9 658.8 585.8" fill="#dcdbdb"/>
    <polygon points="658.7 585.9 658.7 670 731.9 627.8 658.7 585.9" fill="#dcdbdb"/>
    <polygon points="658.8 670 658.8 585.8 585.6 628 658.8 670" fill="#e9e9e9"/>
    <polygon points="878.1 207 878.1 291.1 951.2 249 878.1 207" fill="#e0e0df"/>
    <polygon points="878.1 291.1 878.1 207 804.9 249.1 878.1 291.1" fill="#e9e9e9"/>
    <polygon points="878.1 291.1 878.1 375.3 951.2 333.1 878.1 291.1" fill="#e8e7e8"/>
    <polygon points="878.1 375.3 878.1 291.1 804.9 333.3 878.1 375.3" fill="#e4e4e4"/>
    <polygon points="878.1 375.3 878.1 459.4 951.2 417.2 878.1 375.3" fill="#e8e7e8"/>
    <polygon points="878.1 459.4 878.1 375.3 804.9 417.4 878.1 459.4" fill="#e8e7e8"/>
    <polygon points="878.1 459.4 878.1 543.6 951.2 501.4 878.1 459.4" fill="#e9e9e9"/>
    <polygon points="878.1 543.6 878.1 459.4 804.9 501.6 878.1 543.6" fill="#e4e4e4"/>
    <polygon points="878.1 543.6 878.1 627.7 951.2 585.5 878.1 543.6" fill="#dcdbdb"/>
    <polygon points="878.1 627.7 878.1 543.6 804.9 585.7 878.1 627.7" fill="#e9e9e9"/>
    <polygon points="878.1 627.7 878.1 711.8 951.2 669.7 878.1 627.7" fill="#e1e2e1"/>
    <polygon points="878.1 711.8 878.1 627.7 804.9 669.9 878.1 711.8" fill="#e9e9e9"/>
    <polygon points="731.9 207.1 731.9 291.3 805.1 249.1 731.9 207.1" fill="#e0e0df"/>
    <polygon points="731.9 375.4 731.9 459.6 805.1 417.4 731.9 375.4" fill="#e0e0df"/>
    <polygon points="731.9 291.5 731.9 375.6 805.1 333.4 731.9 291.5" fill="#cccbca"/>
    <polygon points="731.9 459.6 731.9 543.7 805.1 501.5 731.9 459.6" fill="#e4e4e4"/>
    <polygon points="731.9 543.7 731.9 627.8 805.1 585.7 731.9 543.7" fill="#dcdbdb"/>
    <polygon points="1317.3 290.6 1317.3 206.5 1244.1 248.6 1317.3 290.6" fill="#e9e9e9"/>
    <polygon points="1317.3 374.8 1317.3 290.6 1244.1 332.8 1317.3 374.8" fill="#e9e9e9"/>
    <polygon points="1317.3 458.9 1317.3 374.8 1244.1 416.9 1317.3 458.9" fill="#e0e0df"/>
    <polygon points="1317.3 543 1317.3 458.9 1244.1 501.1 1317.3 543" fill="#e1e2e1"/>
    <polygon points="1317.3 627.2 1317.3 543 1244.1 585.2 1317.3 627.2" fill="#e1e2e1"/>
    <polygon points="1024.7 206.8 1024.7 290.9 1097.9 248.8 1024.7 206.8" fill="#efeeee"/>
    <polygon points="1024.7 290.9 1024.7 206.8 951.5 249 1024.7 290.9" fill="#e9e9e9"/>
    <polygon points="1024.7 290.9 1024.7 375.1 1097.9 332.9 1024.7 290.9" fill="#e0e0df"/>
    <polygon points="1024.7 375.1 1024.7 290.9 951.5 333.1 1024.7 375.1" fill="#e9e9e9"/>
    <polygon points="1024.7 375.1 1024.7 459.2 1097.9 417.1 1024.7 375.1" fill="#cccbca"/>
    <polygon points="1024.7 459.2 1024.7 375.1 951.5 417.2 1024.7 459.2" fill="#e1e2e1"/>
    <polygon points="1024.7 459.2 1024.7 543.4 1097.9 501.2 1024.7 459.2" fill="#e9e9e9"/>
    <polygon points="1024.7 543.4 1024.7 459.2 951.5 501.4 1024.7 543.4" fill="#d4d3d2"/>
    <polygon points="1024.7 543.4 1024.7 627.5 1097.9 585.3 1024.7 543.4" fill="#e9e9e9"/>
    <polygon points="1024.7 627.5 1024.7 543.4 951.5 585.5 1024.7 627.5" fill="#e4e4e4"/>
    <polygon points="1024.7 627.5 1024.7 711.7 1097.9 669.5 1024.7 627.5" fill="#e8e7e8"/>
    <polygon points="1024.7 711.7 1024.7 627.5 951.5 669.7 1024.7 711.7" fill="#e9e9e9"/>
    <polygon points="1024.7 711.7 1024.7 795.8 1097.9 753.6 1024.7 711.7" fill="#e9e9e9"/>
    <polygon points="1024.7 795.8 1024.7 711.7 951.5 753.8 1024.7 795.8" fill="#e4e4e4"/>
    <polygon points="1171.1 206.6 1171.1 122.5 1097.9 164.6 1171.1 206.6" fill="#efeeee"/>
    <polygon points="1171.1 290.8 1171.1 374.9 1244.3 332.8 1171.1 290.8" fill="#e4e4e4"/>
    <polygon points="1171.1 374.9 1171.1 290.8 1097.9 332.9 1171.1 374.9" fill="#d7d8d8"/>
    <polygon points="1171.1 374.9 1171.1 459.1 1244.3 416.9 1171.1 374.9" fill="#e4e4e4"/>
    <polygon points="1171.1 459.1 1171.1 374.9 1097.9 417.1 1171.1 459.1" fill="#e1e2e1"/>
    <polygon points="1171.1 459.1 1171.1 543.2 1244.3 501 1171.1 459.1" fill="#e1e2e1"/>
    <polygon points="1171.1 543.2 1171.1 459.1 1097.9 501.2 1171.1 543.2" fill="#e9e9e9"/>
    <polygon points="1171.1 543.2 1171.1 627.3 1244.3 585.2 1171.1 543.2" fill="#d4d3d2"/>
    <polygon points="1171.1 627.3 1171.1 543.2 1097.9 585.4 1171.1 627.3" fill="#fff"/>
    <polygon points="1171.1 627.3 1171.1 711.5 1244.3 669.3 1171.1 627.3" fill="#e1e2e1"/>
    <polygon points="1171.1 711.5 1171.1 627.3 1097.9 669.5 1171.1 711.5" fill="#e0e0df"/>
    <polygon points="951.3 333.1 951.3 249 878.1 291.1 951.3 333.1" fill="#e1e2e1"/>
    <polygon points="951.3 417.3 951.3 333.1 878.1 375.3 951.3 417.3" fill="#e9e9e9"/>
    <polygon points="951.3 501.4 951.3 417.3 878.1 459.4 951.3 501.4" fill="#e4e4e4"/>
    <polygon points="951.3 585.5 951.3 501.4 878.1 543.6 951.3 585.5" fill="#e8e7e8"/>
    <polygon points="951.3 669.7 951.3 585.5 878.1 627.7 951.3 669.7" fill="#cccbca"/>
    <polygon points="951.3 753.8 951.3 669.7 878.1 711.8 951.3 753.8" fill="#e0e0df"/>
    <polygon points="951.7 164.6 951.7 248.8 1024.9 206.6 951.7 164.6" fill="#e9e9e9"/>
    <polygon points="951.7 248.8 951.7 332.9 1024.9 290.8 951.7 248.8" fill="#e4e4e4"/>
    <polygon points="951.7 332.9 951.7 417.1 1024.9 374.9 951.7 332.9" fill="#e4e4e4"/>
    <polygon points="951.7 417.1 951.7 501.2 1024.9 459.1 951.7 417.1" fill="#d4d3d2"/>
    <polygon points="951.7 501.2 951.7 585.4 1024.9 543.2 951.7 501.2" fill="#e9e9e9"/>
    <polygon points="951.7 585.4 951.7 669.5 1024.9 627.4 951.7 585.4" fill="#e0e0df"/>
    <polygon points="951.7 669.5 951.7 753.7 1024.9 711.5 951.7 669.5" fill="#e9e9e9"/>
    <polygon points="951.7 753.7 951.7 837.8 1024.9 795.6 951.7 753.7" fill="#d4d3d2"/>
    <polygon points="805.1 249.1 805.1 165 731.9 207.1 805.1 249.1" fill="#e9e9e9"/>
    <polygon points="805.1 249.1 805.1 333.3 878.3 291.1 805.1 249.1" fill="#e8e7e8"/>
    <polygon points="805.1 333.3 805.1 249.1 731.9 291.3 805.1 333.3" fill="#e1e2e1"/>
    <polygon points="805.1 333.3 805.1 417.4 878.3 375.2 805.1 333.3" fill="#cccbca"/>
    <polygon points="805.1 417.4 805.1 333.3 731.9 375.4 805.1 417.4" fill="#e0e0df"/>
    <polygon points="805.1 417.4 805.1 501.6 878.3 459.4 805.1 417.4" fill="#cccbca"/>
    <polygon points="805.1 501.6 805.1 417.4 731.9 459.6 805.1 501.6" fill="#e8e7e8"/>
    <polygon points="805.1 501.6 805.1 585.7 878.3 543.5 805.1 501.6" fill="#e4e4e4"/>
    <polygon points="805.1 585.7 805.1 501.6 731.9 543.7 805.1 585.7" fill="#cccbca"/>
    <polygon points="805.1 585.7 805.1 669.8 878.3 627.7 805.1 585.7" fill="#d0d1d1"/>
    <polygon points="805.1 669.8 805.1 585.7 731.9 627.8 805.1 669.8" fill="#e4e4e4"/>
    <polygon points="1097.9 248.8 1097.9 332.9 1171.1 290.8 1097.9 248.8" fill="#efeeee"/>
    <polygon points="1097.9 332.9 1097.9 248.8 1024.8 290.9 1097.9 332.9" fill="#e1e2e1"/>
    <polygon points="1097.9 332.9 1097.9 417.1 1171.1 374.9 1097.9 332.9" fill="#e4e4e4"/>
    <polygon points="1097.9 417.1 1097.9 332.9 1024.8 375.1 1097.9 417.1" fill="#e9e9e9"/>
    <polygon points="1097.9 417.1 1097.9 501.2 1171.1 459 1097.9 417.1" fill="#e0e0df"/>
    <polygon points="1097.9 501.2 1097.9 417.1 1024.8 459.2 1097.9 501.2" fill="#e9e9e9"/>
    <polygon points="1097.9 501.2 1097.9 585.4 1171.1 543.2 1097.9 501.2" fill="#dcdbdb"/>
    <polygon points="1097.9 585.4 1097.9 501.2 1024.8 543.4 1097.9 585.4" fill="#d4d3d2"/>
    <polygon points="1097.9 585.4 1097.9 669.5 1171.1 627.3 1097.9 585.4" fill="#efeeee"/>
    <polygon points="1097.9 669.5 1097.9 585.4 1024.8 627.5 1097.9 669.5" fill="#e8e7e8"/>
    <polygon points="1097.9 669.5 1097.9 753.6 1171.1 711.5 1097.9 669.5" fill="#e1e2e1"/>
    <polygon points="1097.9 753.6 1097.9 669.5 1024.8 711.7 1097.9 753.6" fill="#cccbca"/>
    <polygon points="1244.3 248.6 1244.3 164.4 1171.2 206.6 1244.3 248.6" fill="#efeeee"/>
    <polygon points="1244.3 248.6 1244.3 332.8 1317.5 290.6 1244.3 248.6" fill="#d7d8d8"/>
    <polygon points="1244.3 332.8 1244.3 248.6 1171.2 290.8 1244.3 332.8" fill="#e9e9e9"/>
    <polygon points="1244.3 332.8 1244.3 416.9 1317.5 374.7 1244.3 332.8" fill="#e9e9e9"/>
    <polygon points="1244.3 416.9 1244.3 332.8 1171.2 374.9 1244.3 416.9" fill="#d7d8d8"/>
    <polygon points="1244.3 416.9 1244.3 501 1317.5 458.9 1244.3 416.9" fill="#e9e9e9"/>
    <polygon points="1244.3 501 1244.3 416.9 1171.2 459.1 1244.3 501" fill="#e1e2e1"/>
    <polygon points="1244.3 501 1244.3 585.2 1317.5 543 1244.3 501" fill="#efeeee"/>
    <polygon points="1244.3 585.2 1244.3 501 1171.2 543.2 1244.3 585.2" fill="#e9e9e9"/>
    <polygon points="1244.1 585.2 1244.1 669.4 1317.3 627.2 1244.1 585.2" fill="#e0e0df"/>
    <polygon points="1244.3 669.3 1244.3 585.2 1171.2 627.3 1244.3 669.3" fill="#dcdbdb"/>
    <polygon points="512.3 754.3 512.3 838.4 585.4 796.3 512.3 754.3" fill="#efeeee"/>
    <polygon points="512.3 838.4 512.3 754.3 439.1 796.5 512.3 838.4" fill="#e9e9e9"/>
    <polygon points="658.7 670 658.7 754.1 731.8 712 658.7 670" fill="#e9e9e9"/>
    <polygon points="658.7 754.1 658.7 670 585.5 712.2 658.7 754.1" fill="#efeeee"/>
    <polygon points="658.7 754.1 658.7 838.3 731.8 796.1 658.7 754.1" fill="#e9e9e9"/>
    <polygon points="658.7 838.3 658.7 922.4 731.8 880.3 658.7 838.3" fill="#e9e9e9"/>
    <polygon points="366 838.6 366 922.8 439.1 880.6 366 838.6" fill="#e9e9e9"/>
    <polygon points="804.9 670 804.9 754.1 878.1 712 804.9 670" fill="#e8e7e8"/>
    <polygon points="804.9 754.1 804.9 670 731.7 712.1 804.9 754.1" fill="#e9e9e9"/>
    <polygon points="804.9 754.1 804.9 838.3 878.1 796.1 804.9 754.1" fill="#e0e0df"/>
    <polygon points="804.9 838.3 804.9 754.1 731.7 796.3 804.9 838.3" fill="#e9e9e9"/>
    <polygon points="951.3 838.1 951.3 754 878.1 796.1 951.3 838.1" fill="#e9e9e9"/>
    <polygon points="585.5 712.1 585.5 796.3 658.7 754.1 585.5 712.1" fill="#e0e0df"/>
    <polygon points="585.5 796.3 585.5 712.1 512.3 754.3 585.5 796.3" fill="#e1e2e1"/>
    <polygon points="585.5 796.3 585.5 880.4 658.7 838.3 585.5 796.3" fill="#e9e9e9"/>
    <polygon points="585.5 880.4 585.5 796.3 512.3 838.5 585.5 880.4" fill="#dcdbdb"/>
    <polygon points="731.9 627.8 731.9 712 805.1 669.8 731.9 627.8" fill="#e9e9e9"/>
    <polygon points="731.9 712 731.9 627.8 658.7 670 731.9 712" fill="#e9e9e9"/>
    <polygon points="731.9 712 731.9 796.1 805.1 754 731.9 712" fill="#dcdbdb"/>
    <polygon points="731.9 796.1 731.9 712 658.7 754.1 731.9 796.1" fill="#e1e2e1"/>
    <polygon points="731.9 796.1 731.9 880.3 805.1 838.1 731.9 796.1" fill="#e1e2e1"/>
    <polygon points="731.9 880.3 731.9 796.1 658.7 838.3 731.9 880.3" fill="#efeeee"/>
    <polygon points="439.1 880.6 439.1 796.5 366 838.6 439.1 880.6" fill="#e1e2e1"/>
    <polygon points="878.1 712 878.1 796.1 951.3 753.9 878.1 712" fill="#e4e4e4"/>
    <polygon points="878.1 796.1 878.1 712 805 754.1 878.1 796.1" fill="#f7f8f7"/>
    <polygon points="878.1 880.2 878.1 796.1 805 838.3 878.1 880.2" fill="#e9e9e9"/>
    <polygon points="73.2 670.8 73.2 754.9 146.3 712.8 73.2 670.8" fill="#d7d8d8"/>
    <polygon points="73.2 754.9 73.2 670.8 0 713 73.2 754.9" fill="#cccbca"/>
    <polygon points="73.2 754.9 73.2 839.1 146.3 796.9 73.2 754.9" fill="#e4e4e4"/>
    <polygon points="73.2 839.1 73.2 754.9 0 797.1 73.2 839.1" fill="#cccbca"/>
    <polygon points="73.2 839.1 73.2 923.3 146.3 881.1 73.2 839.1" fill="#d7d8d8"/>
    <polygon points="219.6 754.8 219.6 838.9 292.8 796.8 219.6 754.8" fill="#e9e9e9"/>
    <polygon points="219.6 838.9 219.6 754.8 146.4 796.9 219.6 838.9" fill="#d7d8d8"/>
    <polygon points="219.6 923.1 219.6 838.9 146.4 881.1 219.6 923.1" fill="#d7d8d8"/>
    <polygon points="0.2 628.7 0.2 712.8 73.3 670.6 0.2 628.7" fill="#e9e9e9"/>
    <polygon points="0.2 712.8 0.2 797 73.3 754.8 0.2 712.8" fill="#dcdbdb"/>
    <polygon points="0.2 797 0.2 881.1 73.3 838.9 0.2 797" fill="#d7d8d8"/>
    <polygon points="146.4 712.8 146.4 796.9 219.6 754.8 146.4 712.8" fill="#dcdbdb"/>
    <polygon points="146.4 796.9 146.4 712.8 73.2 755 146.4 796.9" fill="#fff"/>
    <polygon points="292.8 796.7 292.8 880.8 366 838.6 292.8 796.7" fill="#e0e0df"/>
    <polygon points="1098 753.5 1098 837.6 1171.2 795.5 1098 753.5" fill="#d4d3d2"/>
    <polygon points="1098 837.6 1098 753.5 1024.8 795.6 1098 837.6" fill="#d7d8d8"/>
    <polygon points="1098 837.6 1098 921.8 1171.2 879.6 1098 837.6" fill="#efeeee"/>
    <polygon points="1244.4 669.2 1244.4 753.3 1317.6 711.1 1244.4 669.2" fill="#efeeee"/>
    <polygon points="1244.4 753.3 1244.4 669.2 1171.2 711.3 1244.4 753.3" fill="#efeeee"/>
    <polygon points="1244.4 753.3 1244.4 837.5 1317.6 795.3 1244.4 753.3" fill="#e9e9e9"/>
    <polygon points="1244.4 837.5 1244.4 753.3 1171.2 795.5 1244.4 837.5" fill="#e9e9e9"/>
    <polygon points="951.7 837.8 951.7 922 1024.9 879.8 951.7 837.8" fill="#e1e2e1"/>
    <polygon points="1390.6 669.1 1390.6 753.3 1463.8 711.1 1390.6 669.1" fill="#e9e9e9"/>
    <polygon points="1390.6 753.3 1390.6 669.1 1317.4 711.3 1390.6 753.3" fill="#e0e0df"/>
    <polygon points="1390.6 753.3 1390.6 837.4 1463.8 795.3 1390.6 753.3" fill="#e9e9e9"/>
    <polygon points="1537 753.1 1537 837.3 1610.2 795.1 1537 753.1" fill="#e9e9e9"/>
    <polygon points="1171.2 711.3 1171.2 795.5 1244.4 753.3 1171.2 711.3" fill="#e0e0df"/>
    <polygon points="1171.2 795.5 1171.2 711.3 1098 753.5 1171.2 795.5" fill="#efeeee"/>
    <polygon points="1171.2 879.6 1171.2 795.5 1098 837.6 1171.2 879.6" fill="#d4d3d2"/>
    <polygon points="1317.6 627 1317.6 711.2 1390.8 669 1317.6 627" fill="#efeeee"/>
    <polygon points="1317.6 711.2 1317.6 627 1244.4 669.2 1317.6 711.2" fill="#e9e9e9"/>
    <polygon points="1317.6 711.2 1317.6 795.3 1390.8 753.1 1317.6 711.2" fill="#e9e9e9"/>
    <polygon points="1317.6 795.3 1317.6 711.2 1244.4 753.3 1317.6 795.3" fill="#e1e2e1"/>
    <polygon points="1024.9 879.8 1024.9 795.6 951.7 837.8 1024.9 879.8" fill="#e9e9e9"/>
    <polygon points="1463.8 711.1 1463.8 795.3 1537 753.1 1463.8 711.1" fill="#dcdbdb"/>
    <polygon points="1463.8 795.3 1463.8 711.1 1390.7 753.3 1463.8 795.3" fill="#e9e9e9"/>
    <polygon points="1463.8 795.3 1463.8 879.4 1537 837.3 1463.8 795.3" fill="#dcdbdb"/>
    <polygon points="1463.8 879.4 1463.8 795.3 1390.7 837.4 1463.8 879.4" fill="#e1e2e1"/>
    <polygon points="1610.3 795 1610.3 879.1 1683.4 837 1610.3 795" fill="#e1e2e1"/>
    <polygon points="1610.2 879.3 1610.2 795.1 1537.1 837.3 1610.2 879.3" fill="#e9e9e9"/>
    <polygon points="1463.5 40.2 1463.5 124.3 1536.7 82.1 1463.5 40.2" fill="#e9e9e9"/>
    <polygon points="1463.5 206.3 1463.5 290.5 1536.7 248.3 1463.5 206.3" fill="#e9e9e9"/>
    <polygon points="1463.5 290.5 1463.5 206.3 1390.4 248.5 1463.5 290.5" fill="#e4e4e4"/>
    <polygon points="1463.5 290.5 1463.5 374.6 1536.7 332.4 1463.5 290.5" fill="#fff"/>
    <polygon points="1463.5 374.6 1463.5 290.5 1390.4 332.6 1463.5 374.6" fill="#e9e9e9"/>
    <polygon points="1463.5 374.6 1463.5 458.8 1536.7 416.6 1463.5 374.6" fill="#e0e0df"/>
    <polygon points="1463.5 458.8 1463.5 374.6 1390.4 416.8 1463.5 458.8" fill="#e9e9e9"/>
    <polygon points="1463.5 458.8 1463.5 542.9 1536.7 500.7 1463.5 458.8" fill="#e0e0df"/>
    <polygon points="1463.5 542.9 1463.5 458.8 1390.4 500.9 1463.5 542.9" fill="#e9e9e9"/>
    <polygon points="1463.5 542.9 1463.5 627 1536.7 584.9 1463.5 542.9" fill="#cccbca"/>
    <polygon points="1463.5 627 1463.5 542.9 1390.4 585.1 1463.5 627" fill="#e1e2e1"/>
    <polygon points="1463.5 627 1463.5 711.2 1536.7 669 1463.5 627" fill="#e9e9e9"/>
    <polygon points="1463.5 711.2 1463.5 627 1390.4 669.2 1463.5 711.2" fill="#e1e2e1"/>
    <polygon points="1610 206.2 1610 290.3 1683.1 248.1 1610 206.2" fill="#d0d1d1"/>
    <polygon points="1610 290.3 1610 374.4 1683.1 332.3 1610 290.3" fill="#fff"/>
    <polygon points="1610 374.4 1610 290.3 1536.8 332.5 1610 374.4" fill="#f7f8f7"/>
    <polygon points="1610 374.4 1610 458.6 1683.1 416.4 1610 374.4" fill="#e9e9e9"/>
    <polygon points="1610 458.6 1610 374.4 1536.8 416.6 1610 458.6" fill="#efeeee"/>
    <polygon points="1610 458.6 1610 542.7 1683.1 500.6 1610 458.6" fill="#e1e2e1"/>
    <polygon points="1610 542.7 1610 458.6 1536.8 500.8 1610 542.7" fill="#dcdbdb"/>
    <polygon points="1610 542.7 1610 626.9 1683.1 584.7 1610 542.7" fill="#e9e9e9"/>
    <polygon points="1610 626.9 1610 542.7 1536.8 584.9 1610 626.9" fill="#efeeee"/>
    <polygon points="1610 626.9 1610 711 1683.1 668.9 1610 626.9" fill="#e9e9e9"/>
    <polygon points="1610 711 1610 626.9 1536.8 669 1610 711" fill="#cccbca"/>
    <polygon points="1610 711 1610 795.2 1683.1 753 1610 711" fill="#e9e9e9"/>
    <polygon points="1610 795.2 1610 711 1536.8 753.2 1610 795.2" fill="#cccbca"/>
    <polygon points="1317.3 206.5 1317.3 290.6 1390.5 248.5 1317.3 206.5" fill="#e9e9e9"/>
    <polygon points="1317.3 290.6 1317.3 374.8 1390.5 332.6 1317.3 290.6" fill="#e1e2e1"/>
    <polygon points="1317.3 374.8 1317.3 458.9 1390.5 416.7 1317.3 374.8" fill="#efeeee"/>
    <polygon points="1317.3 458.9 1317.3 543.1 1390.5 500.9 1317.3 458.9" fill="#e9e9e9"/>
    <polygon points="1317.4 543 1317.4 627.2 1390.5 585 1317.4 543" fill="#e9e9e9"/>
    <polygon points="1756.2 122 1756.2 206.1 1829.3 164 1756.2 122" fill="#e1e2e1"/>
    <polygon points="1756.2 206.1 1756.2 290.3 1829.3 248.1 1756.2 206.1" fill="#d0d1d1"/>
    <polygon points="1756.2 290.3 1756.2 206.1 1683 248.3 1756.2 290.3" fill="#e4e4e4"/>
    <polygon points="1756.2 290.3 1756.2 374.4 1829.3 332.3 1756.2 290.3" fill="#e9e9e9"/>
    <polygon points="1756.2 374.4 1756.2 290.3 1683 332.4 1756.2 374.4" fill="#cccbca"/>
    <polygon points="1756.2 374.4 1756.2 458.6 1829.3 416.4 1756.2 374.4" fill="#e9e9e9"/>
    <polygon points="1756.2 458.6 1756.2 374.4 1683 416.6 1756.2 458.6" fill="#e1e2e1"/>
    <polygon points="1756.2 458.6 1756.2 542.7 1829.3 500.5 1756.2 458.6" fill="#e1e2e1"/>
    <polygon points="1756.2 542.7 1756.2 458.6 1683 500.7 1756.2 542.7" fill="#e1e2e1"/>
    <polygon points="1756.2 542.7 1756.2 626.9 1829.3 584.7 1756.2 542.7" fill="#e1e2e1"/>
    <polygon points="1756.2 626.9 1756.2 542.7 1683 584.9 1756.2 626.9" fill="#e9e9e9"/>
    <polygon points="1756.2 626.9 1756.2 711 1829.3 668.8 1756.2 626.9" fill="#e9e9e9"/>
    <polygon points="1756.2 711 1756.2 626.9 1683 669 1756.2 711" fill="#e1e2e1"/>
    <polygon points="1756.2 711 1756.2 795.1 1829.3 753 1756.2 711" fill="#e1e2e1"/>
    <polygon points="1756.2 795.1 1756.2 711 1683 753.2 1756.2 795.1" fill="#cccbca"/>
    <polygon points="1902.6 290.1 1902.6 206 1829.4 248.1 1902.6 290.1" fill="#e0e0df"/>
    <polygon points="1902.6 374.3 1902.6 290.1 1829.4 332.3 1902.6 374.3" fill="#e1e2e1"/>
    <polygon points="1902.6 458.4 1902.6 374.3 1829.4 416.4 1902.6 458.4" fill="#e0e0df"/>
    <polygon points="1902.6 542.5 1902.6 458.4 1829.4 500.6 1902.6 542.5" fill="#f7f8f7"/>
    <polygon points="1902.6 626.7 1902.6 542.5 1829.4 584.7 1902.6 626.7" fill="#e9e9e9"/>
    <polygon points="1902.6 710.8 1902.6 626.7 1829.4 668.9 1902.6 710.8" fill="#f7f8f7"/>
    <polygon points="1536.8 248.3 1536.8 332.4 1609.9 290.3 1536.8 248.3" fill="#e9e9e9"/>
    <polygon points="1536.8 332.4 1536.8 248.3 1463.6 290.5 1536.8 332.4" fill="#e9e9e9"/>
    <polygon points="1536.8 332.5 1536.8 416.6 1609.9 374.4 1536.8 332.5" fill="#e0e0df"/>
    <polygon points="1536.8 416.6 1536.8 332.5 1463.6 374.6 1536.8 416.6" fill="#e9e9e9"/>
    <polygon points="1536.8 416.6 1536.8 500.7 1609.9 458.6 1536.8 416.6" fill="#e9e9e9"/>
    <polygon points="1536.8 500.7 1536.8 416.6 1463.6 458.8 1536.8 500.7" fill="#e9e9e9"/>
    <polygon points="1536.8 500.7 1536.8 584.9 1609.9 542.7 1536.8 500.7" fill="#dcdbdb"/>
    <polygon points="1536.8 584.9 1536.8 500.7 1463.6 542.9 1536.8 584.9" fill="#e9e9e9"/>
    <polygon points="1536.8 584.9 1536.8 669 1609.9 626.9 1536.8 584.9" fill="#e1e2e1"/>
    <polygon points="1536.8 669 1536.8 584.9 1463.6 627 1536.8 669" fill="#efeeee"/>
    <polygon points="1536.8 669 1536.8 753.2 1609.9 711 1536.8 669" fill="#cccbca"/>
    <polygon points="1536.8 753.2 1536.8 669 1463.6 711.2 1536.8 753.2" fill="#e1e2e1"/>
    <polygon points="1683.2 164 1683.2 248.1 1756.3 206 1683.2 164" fill="#d0d1d1"/>
    <polygon points="1683.2 248.1 1683.2 164 1610 206.1 1683.2 248.1" fill="#fff"/>
    <polygon points="1683.2 248.1 1683.2 332.3 1756.3 290.1 1683.2 248.1" fill="#e0e0df"/>
    <polygon points="1683.2 332.3 1683.2 248.1 1610 290.3 1683.2 332.3" fill="#cccbca"/>
    <polygon points="1683.2 332.3 1683.2 416.4 1756.3 374.3 1683.2 332.3" fill="#e9e9e9"/>
    <polygon points="1683.2 416.4 1683.2 332.3 1610 374.4 1683.2 416.4" fill="#e0e0df"/>
    <polygon points="1683.2 416.4 1683.2 500.6 1756.3 458.4 1683.2 416.4" fill="#e9e9e9"/>
    <polygon points="1683.2 500.6 1683.2 416.4 1610 458.6 1683.2 500.6" fill="#efeeee"/>
    <polygon points="1683.2 500.6 1683.2 584.7 1756.3 542.6 1683.2 500.6" fill="#cccbca"/>
    <polygon points="1683.2 584.7 1683.2 500.6 1610 542.7 1683.2 584.7" fill="#e9e9e9"/>
    <polygon points="1683.2 584.7 1683.2 668.9 1756.3 626.7 1683.2 584.7" fill="#e1e2e1"/>
    <polygon points="1683.2 668.9 1683.2 584.7 1610 626.9 1683.2 668.9" fill="#e9e9e9"/>
    <polygon points="1683.2 668.9 1683.2 753 1756.3 710.8 1683.2 668.9" fill="#e1e2e1"/>
    <polygon points="1683.2 753 1683.2 668.9 1610 711 1683.2 753" fill="#e1e2e1"/>
    <polygon points="1683.2 753 1683.2 837.1 1756.3 795 1683.2 753" fill="#e9e9e9"/>
    <polygon points="1683.2 837.1 1683.2 753 1610 795.2 1683.2 837.1" fill="#e9e9e9"/>
    <polygon points="1390.3 80.4 1390.3 164.5 1463.5 122.4 1390.3 80.4" fill="#e9e9e9"/>
    <polygon points="1390.6 248.4 1390.6 164.3 1317.4 206.5 1390.6 248.4" fill="#e1e2e1"/>
    <polygon points="1390.6 248.5 1390.6 332.6 1463.7 290.4 1390.6 248.5" fill="#e9e9e9"/>
    <polygon points="1390.6 332.6 1390.6 248.5 1317.4 290.6 1390.6 332.6" fill="#e9e9e9"/>
    <polygon points="1390.6 332.6 1390.6 416.8 1463.7 374.6 1390.6 332.6" fill="#e9e9e9"/>
    <polygon points="1390.6 416.8 1390.6 332.6 1317.4 374.8 1390.6 416.8" fill="#e4e4e4"/>
    <polygon points="1390.6 416.8 1390.6 500.9 1463.7 458.7 1390.6 416.8" fill="#e9e9e9"/>
    <polygon points="1390.6 500.9 1390.6 416.8 1317.4 458.9 1390.6 500.9" fill="#efeeee"/>
    <polygon points="1390.6 500.9 1390.6 585 1463.7 542.9 1390.6 500.9" fill="#efeeee"/>
    <polygon points="1390.6 585 1390.6 500.9 1317.4 543.1 1390.6 585" fill="#e9e9e9"/>
    <polygon points="1390.6 585 1390.6 669.2 1463.7 627 1390.6 585" fill="#e9e9e9"/>
    <polygon points="1390.5 669.2 1390.5 585 1317.4 627.2 1390.5 669.2" fill="#dcdbdb"/>
    <polygon points="1829.4 332.3 1829.4 248.1 1756.2 290.3 1829.4 332.3" fill="#d0d1d1"/>
    <polygon points="1829.4 332.3 1829.4 416.4 1902.6 374.2 1829.4 332.3" fill="#e0e0df"/>
    <polygon points="1829.4 416.4 1829.4 332.3 1756.2 374.4 1829.4 416.4" fill="#d0d1d1"/>
    <polygon points="1829.4 416.4 1829.4 500.6 1902.6 458.4 1829.4 416.4" fill="#e9e9e9"/>
    <polygon points="1829.4 500.6 1829.4 416.4 1756.2 458.6 1829.4 500.6" fill="#e1e2e1"/>
    <polygon points="1829.4 500.6 1829.4 584.7 1902.6 542.5 1829.4 500.6" fill="#e1e2e1"/>
    <polygon points="1829.4 584.7 1829.4 500.6 1756.2 542.7 1829.4 584.7" fill="#e9e9e9"/>
    <polygon points="1829.4 584.7 1829.4 668.8 1902.6 626.7 1829.4 584.7" fill="#e0e0df"/>
    <polygon points="1829.4 668.8 1829.4 584.7 1756.2 626.9 1829.4 668.8" fill="#e9e9e9"/>
    <polygon points="1829.4 668.8 1829.4 753 1902.6 710.8 1829.4 668.8" fill="#e1e2e1"/>
    <polygon points="1829.4 753 1829.4 668.8 1756.2 711 1829.4 753" fill="#cccbca"/>
    <polygon points="1829.4 752.8 1829.4 837 1902.6 794.8 1829.4 752.8" fill="#e1e2e1"/>
    <polygon points="1829.4 837 1829.4 752.8 1756.3 795 1829.4 837" fill="#f7f8f7"/>
    <polygon points="1829.4 837 1829.4 921.1 1902.6 879 1829.4 837" fill="#e9e9e9"/>
    <polygon points="1902.7 794.8 1902.7 710.7 1829.5 752.8 1902.7 794.8" fill="#e9e9e9"/>
    <polygon points="1902.7 879 1902.7 794.8 1829.5 837 1902.7 879" fill="#e9e9e9"/>
  </g>
  <polygon points="292.9 207.4 292.9 123.3 219.7 165.5 292.9 207.4" fill="#70c4d4"/>
  <polygon points="439.1 375.7 439.1 291.6 366 333.7 439.1 375.7" fill="#6bc2cc"/>
  <polygon points="366.1 165.3 366.1 81.1 293 123.3 366.1 165.3" fill="#353384"/>
  <polygon points="366.1 333.6 366.1 249.4 293 291.6 366.1 333.6" fill="#0f5679"/>
  <polygon points="512.4 249.4 512.4 165.3 439.2 207.4 512.4 249.4" fill="#80b955"/>
  <polygon points="658.8 249.2 658.8 165.1 585.6 207.3 658.8 249.2" fill="#80b955"/>
  <polygon points="1244.3 164.4 1244.3 248.6 1317.5 206.4 1244.3 164.4" fill="#c2265b"/>
  <polygon points="1463.5 206.3 1463.5 122.2 1390.4 164.3 1463.5 206.3" fill="#ec8131"/>
  <polygon points="1610 290.3 1610 206.2 1536.8 248.3 1610 290.3" fill="#de314f"/>
  <polygon points="1536.8 84.1 1536.8 0 1463.6 42.2 1536.8 84.1" fill="#dd2482"/>
  <polygon points="1683.2 79.8 1683.2 164 1756.3 121.8 1683.2 79.8" fill="#243b6d"/>
  <polygon points="1390.6 164.3 1390.6 248.4 1463.7 206.3 1390.6 164.3" fill="#9e2c7e"/>
  <polygon points="1829.4 79.8 1829.4 164 1902.6 121.8 1829.4 79.8" fill="#af3d8a"/>
</svg>
