<?xml version="1.0" encoding="UTF-8" standalone="no"?>
<!DOCTYPE svg PUBLIC "-//W3C//DTD SVG 1.1//EN" "http://www.w3.org/Graphics/SVG/1.1/DTD/svg11.dtd">
<svg width="100%" height="100%" viewBox="0 0 30 30" version="1.1" xmlns="http://www.w3.org/2000/svg" xmlns:xlink="http://www.w3.org/1999/xlink" xml:space="preserve" xmlns:serif="http://www.serif.com/" style="fill-rule:evenodd;clip-rule:evenodd;stroke-linejoin:round;stroke-miterlimit:2;">
    <g transform="matrix(1,0,0,1,-571,-352)">
        <g id="social-facebook" transform="matrix(1,0,0,1,566,347)">
            <g>
                <g>
                    <circle cx="20" cy="20" r="15" style="fill:rgb(58,90,152);"/>
                    <path d="M34.9,21.69L24.05,10.84L18.42,16.47L18.75,16.81L15.55,20L18.17,22.63L17.82,22.97L20.67,25.81L17.39,29.1L23,34.7C29.349,33.402 34.172,28.129 34.9,21.69Z" style="fill:rgb(46,77,114);fill-rule:nonzero;"/>
                    <path d="M17.38,14.43L17.38,16.94L15.53,16.94L15.53,20L17.38,20L17.38,29.14L21.16,29.14L21.16,20L23.7,20C23.7,20 23.94,18.52 24.05,16.91L21.18,16.91L21.18,14.83C21.248,14.424 21.59,14.117 22,14.09L24.06,14.09L24.06,10.89L21.25,10.89C17.28,10.89 17.38,14 17.38,14.43Z" style="fill:white;fill-rule:nonzero;"/>
                </g>
            </g>
        </g>
    </g>
</svg>
