<?xml version="1.0" encoding="UTF-8" standalone="no"?>
<!DOCTYPE svg PUBLIC "-//W3C//DTD SVG 1.1//EN" "http://www.w3.org/Graphics/SVG/1.1/DTD/svg11.dtd">
<svg width="100%" height="100%" viewBox="0 0 36 29" version="1.1" xmlns="http://www.w3.org/2000/svg" xmlns:xlink="http://www.w3.org/1999/xlink" xml:space="preserve" xmlns:serif="http://www.serif.com/" style="fill-rule:evenodd;clip-rule:evenodd;stroke-linejoin:round;stroke-miterlimit:2;">
    <g transform="matrix(1,0,0,1,-250,-187)">
        <g id="social-twitter-footer" transform="matrix(1,0,0,1,245,182)">
            <path d="M40.1,8.4C38.787,8.943 37.409,9.313 36,9.5C37.527,8.612 38.668,7.185 39.2,5.5C37.787,6.372 36.229,6.982 34.6,7.3C33.248,5.807 31.314,4.968 29.3,5C27.383,4.961 25.534,5.722 24.2,7.1C22.822,8.434 22.061,10.283 22.1,12.2C22.105,12.772 22.172,13.342 22.3,13.9C19.406,13.704 16.582,12.921 14,11.6C11.449,10.322 9.199,8.515 7.4,6.3C6.737,7.383 6.391,8.63 6.4,9.9C6.276,12.31 7.463,14.607 9.5,15.9C8.326,15.85 7.173,15.579 6.1,15.1C6.102,16.786 6.705,18.418 7.8,19.7C8.891,20.967 10.366,21.845 12,22.2L10.3,22.5L8.9,22.3C9.372,23.741 10.281,24.999 11.5,25.9C12.704,26.822 14.183,27.315 15.7,27.3C13.143,29.33 9.965,30.425 6.7,30.4L5,30.4C8.271,32.527 12.099,33.641 16,33.6C18.484,33.617 20.952,33.211 23.3,32.4C25.373,31.629 27.3,30.514 29,29.1C30.581,27.705 31.99,26.127 33.2,24.4C34.298,22.663 35.14,20.777 35.7,18.8C36.291,16.923 36.594,14.968 36.6,13C36.629,12.696 36.595,12.39 36.5,12.1C37.941,11.126 39.166,9.867 40.1,8.4Z" style="fill:rgb(9,84,122);"/>
        </g>
    </g>
</svg>
