<?xml version="1.0" encoding="UTF-8" standalone="no"?>
<!DOCTYPE svg PUBLIC "-//W3C//DTD SVG 1.1//EN" "http://www.w3.org/Graphics/SVG/1.1/DTD/svg11.dtd">
<svg width="100%" height="100%" viewBox="0 0 30 30" version="1.1" xmlns="http://www.w3.org/2000/svg" xmlns:xlink="http://www.w3.org/1999/xlink" xml:space="preserve" xmlns:serif="http://www.serif.com/" style="fill-rule:evenodd;clip-rule:evenodd;stroke-linejoin:round;stroke-miterlimit:2;">
    <g transform="matrix(1,0,0,1,-491,-352)">
        <g id="social-rss" transform="matrix(1,0,0,1,486,347)">
            <g>
                <g>
                    <circle cx="20" cy="20" r="15" style="fill:rgb(237,128,44);"/>
                    <path d="M33.32,26.89L23.32,16.89L21.65,18.56L17.13,14L15.07,13.22L12.93,15.4L18.83,21.31L18.34,21.79L14.93,18.37L12.93,20.37L26.21,33.65C29.27,32.258 31.775,29.876 33.32,26.89ZM13.48,26.67L21.71,34.9C23.212,34.731 24.679,34.333 26.06,33.72L16.24,23.9L13.48,26.67Z" style="fill:rgb(213,103,39);fill-rule:nonzero;"/>
                    <path d="M16.25,24C16.622,24.358 16.832,24.853 16.83,25.37C16.83,25.884 16.625,26.378 16.26,26.74C15.9,27.109 15.405,27.315 14.89,27.31C14.374,27.305 13.879,27.101 13.51,26.74C13.142,26.377 12.934,25.882 12.934,25.365C12.934,24.853 13.138,24.362 13.5,24C13.863,23.631 14.362,23.425 14.88,23.43C15.395,23.425 15.89,23.631 16.25,24ZM12.93,17.58L12.93,20.39C16.696,20.406 19.789,23.504 19.8,27.27L22.61,27.27C22.605,21.96 18.24,17.591 12.93,17.58ZM12.93,12.59L12.93,15.39C19.443,15.406 24.795,20.767 24.8,27.28L27.61,27.28C27.588,19.235 20.975,12.622 12.93,12.6L12.93,12.59Z" style="fill:white;fill-rule:nonzero;"/>
                </g>
            </g>
        </g>
    </g>
</svg>
