ПОДКЛЮЧЕНИЕ
    tmux ls                             - список сессий
    tmux kill-session -t %TITLE%        - завершить сессию

    tmux new -s %TITLE%                 - открыть новую сессию с именем
    tmux                                - открыть новую сессию

    tmux a -t %TITLE%                   - подключиться к сессии по имени
    tmux a  #                           - подключиться по номеру

ОТКЛЮЧЕНИЕ
    <Ctrl+b> d                              - отключиться
    exit                                    - выйти из сессии

РЕЖИМ СКРОЛЛА
    <Ctrl+b> [                              - режим скролла, 
                                              дальше стрелочки вверх/вниз
    q                                       - выйти из режима
    
ОКНА
    <Ctrl+b> c                              — новое окно
    <Ctrl+b> 0...9                          — перейти в окно
    Ctrl+b & или exit                       — закрыть окно

ТАБЫ (ПАНЕЛИ)
    Ctrl+b %                                — разбить по вертикали
    Ctrl+b "                                — разбить по горизонтали
    Ctrl+b →←↑↓                             — перех между табами
    Ctrl+b x или exit                       — закрыть таб
