{
	"port": 4000,
	"noindex": true,
	"readonly": false,

	"webservice": {
		"database": "mongodb://mongo/pa11y-webservice",
		"host": "0.0.0.0",
		"port": 3000,
		"cron": "0 30 0 * * *",
		"allowedStandards": "WCAG2AA",
		"level": "error",
		"chromeLaunchConfig": {
			"args": [
				"--no-sandbox",
				"--disable-setuid-sandbox",
				"--disable-dev-shm-usage"
			]
		}
	}
}