<?xml version="1.0" encoding="utf-8"?>
<svg viewBox="0 0 16 16" xmlns="http://www.w3.org/2000/svg">
  <path fill="#78b978" d="M2 0v16h12V4l-4-4H2z"/>
  <path opacity=".65" fill="#FFF" d="M10 3.98V0l4 4-4-.02z"/>
  <path opacity=".2" d="M13 5v5L9 5h4z"/>
  <path fill="#999" d="M2 0v16h12V4h-.012l.004-.008L10.008.006 10 .014V0H2zm1 1h6v4h4v10H3V1zm7 .412L12.586 4H10V1.412z"/>
  <text x="8.873" y="11.42" transform="matrix(0.248403, 0, 0, 0.252891, 0.83796, 9.896851)" style="font-size: 26px; font-weight: bold; white-space: pre;font-family:arial;fill:#fff">LV</text>
</svg>
