<?xml version="1.0" encoding="UTF-8" standalone="no"?>
<!-- Generator: Adobe Illustrator 14.0.0, SVG Export Plug-In  -->

<svg
   xmlns:dc="http://purl.org/dc/elements/1.1/"
   xmlns:cc="http://creativecommons.org/ns#"
   xmlns:rdf="http://www.w3.org/1999/02/22-rdf-syntax-ns#"
   xmlns:svg="http://www.w3.org/2000/svg"
   xmlns="http://www.w3.org/2000/svg"
   xmlns:sodipodi="http://sodipodi.sourceforge.net/DTD/sodipodi-0.dtd"
   xmlns:inkscape="http://www.inkscape.org/namespaces/inkscape"
   version="1.1"
   x="0px"
   y="0px"
   width="202.70134"
   height="59.781677"
   viewBox="0 0 202.70135 59.781677"
   enable-background="new 0 0 303 90"
   xml:space="preserve"
   id="svg5383"
   inkscape:version="0.91 r13725"
   sodipodi:docname="logo-brk.svg"><metadata
     id="metadata5433"><rdf:RDF><cc:Work
         rdf:about=""><dc:format>image/svg+xml</dc:format><dc:type
           rdf:resource="http://purl.org/dc/dcmitype/StillImage" /><dc:title></dc:title></cc:Work></rdf:RDF></metadata><sodipodi:namedview
     pagecolor="#ffffff"
     bordercolor="#666666"
     borderopacity="1"
     objecttolerance="10"
     gridtolerance="10"
     guidetolerance="10"
     inkscape:pageopacity="0"
     inkscape:pageshadow="2"
     inkscape:window-width="1920"
     inkscape:window-height="1176"
     id="namedview5431"
     showgrid="false"
     fit-margin-top="0"
     fit-margin-left="0"
     fit-margin-right="0"
     fit-margin-bottom="0"
     inkscape:zoom="6.0489134"
     inkscape:cx="110.96053"
     inkscape:cy="34.632213"
     inkscape:window-x="0"
     inkscape:window-y="24"
     inkscape:window-maximized="1"
     inkscape:current-layer="svg5383" /><defs
     id="defs5385" /><path
     d="m 74.854046,1.4726513e-6 6.567086,0 c 1.300007,0 2.269481,0.053670597349 2.907752,0.1616828273487 0.638272,0.1080118 1.210838,0.33409944 1.715017,0.67624969 0.504182,0.34282101 0.924555,0.79902121 1.260452,1.36927151 0.335897,0.5702501 0.504181,1.2096012 0.504181,1.9173824 0,0.7674897 -0.20717,1.4719166 -0.620167,2.1126093 -0.413671,0.6406928 -0.97417,1.1217161 -1.681497,1.4417266 0.997633,0.2925046 1.763961,0.7896287 2.300323,1.4940559 0.535692,0.7037558 0.803873,1.5309533 0.803873,2.4815943 0,0.748704 -0.173647,1.476613 -0.520943,2.183723 -0.347964,0.707782 -0.821974,1.272664 -1.42337,1.695991 -0.601395,0.422655 -1.342246,0.682958 -2.22389,0.780236 -0.552455,0.05971 -1.885985,0.09728 -3.999253,0.112034 l -5.590235,0 0,-16.4265599073487 6.71e-4,0 z M 78.178821,2.7304939 l 0,3.7857908 2.169585,0 c 1.289951,0 2.091814,-0.018113 2.404244,-0.055679 0.566532,-0.067086 1.011712,-0.262315 1.336883,-0.5863515 0.323828,-0.3240365 0.486748,-0.7500468 0.486748,-1.2787024 0,-0.5058455 -0.139453,-0.9177674 -0.419702,-1.2337531 C 83.877,3.0451375 83.461318,2.853936 82.909536,2.7868478 82.581685,2.7499491 81.638357,2.7311649 80.080225,2.7311649 l -1.901404,0 0,-6.708e-4 z m 0,6.5162831 0,4.405014 3.071343,0 c 1.19542,0 1.954371,-0.03354 2.275518,-0.101304 0.492783,-0.08989 0.894383,-0.309278 1.204803,-0.657465 0.30975,-0.348859 0.465296,-0.815123 0.465296,-1.399461 0,-0.494441 -0.119342,-0.913743 -0.358693,-1.258576 C 84.598407,9.8908175 84.252452,9.6399077 83.800569,9.4822502 83.348682,9.3252644 82.367808,9.2461009 80.85862,9.2461009 l -2.679799,0 0,6.696e-4 z"
     id="path5387"
     inkscape:connector-curvature="0"
     style="clip-rule:evenodd;fill-rule:evenodd" /><path
     d="M 93.283451,8.1908074 90.440061,7.6863041 C 90.76121,6.5236639 91.313659,5.6635922 92.097421,5.1047474 92.88185,4.5465731 94.046428,4.266815 95.591822,4.266815 c 1.403257,0 2.449163,0.1663789 3.135708,0.4984658 0.686542,0.3320868 1.169939,0.7547427 1.45019,1.2659556 0.27958,0.5112119 0.4197,1.4504482 0.4197,2.8163655 l -0.0463,3.6730801 c 0,1.045236 0.0503,1.816081 0.15018,2.311863 0.0999,0.496453 0.28696,1.028463 0.56117,1.596029 l -3.118274,0 c -0.08179,-0.207302 -0.182363,-0.513226 -0.301034,-0.91978 -0.05231,-0.184493 -0.08917,-0.306593 -0.111961,-0.36563 -0.535692,0.527985 -1.108258,0.923133 -1.718372,1.187462 -0.610111,0.264328 -1.261121,0.39582 -1.953699,0.39582 -1.220224,0 -2.181652,-0.332087 -2.884958,-0.996932 -0.703275,-0.664843 -1.054592,-1.504789 -1.054592,-2.519835 0,-0.671554 0.160238,-1.271322 0.480715,-1.797294 0.320475,-0.526644 0.769679,-0.929843 1.34761,-1.209601 0.57793,-0.2797575 1.411303,-0.5246304 2.500789,-0.7332748 1.468962,-0.2764028 2.486709,-0.5340222 3.053911,-0.7728562 l 0,-0.3179986 c 0,-0.6125162 -0.14951,-1.04926 -0.448532,-1.3102338 -0.299695,-0.2609737 -0.864217,-0.3911241 -1.694237,-0.3911241 -0.560498,0 -0.998304,0.1120378 -1.312747,0.3354406 -0.315113,0.2240756 -0.569883,0.616541 -0.763646,1.1780703 l 0,0 z m 4.21849,2.5466696 c -0.402941,0.134176 -1.041213,0.294518 -1.913473,0.481693 -0.872928,0.186506 -1.444155,0.369656 -1.712336,0.548782 -0.410316,0.291163 -0.615476,0.66082 -0.615476,1.1083 0,0.440768 0.164261,0.821831 0.492112,1.142512 0.327853,0.320682 0.746214,0.481693 1.253749,0.481693 0.567201,0 1.108258,-0.186505 1.623164,-0.560187 0.380817,-0.283112 0.630226,-0.63063 0.750237,-1.041209 0.0818,-0.269024 0.123364,-0.780907 0.123364,-1.534979 l 0,-0.626605 -0.0013,0 z"
     id="path5389"
     inkscape:connector-curvature="0"
     style="clip-rule:evenodd;fill-rule:evenodd" /><path
     d="m 101.73853,4.5197378 3.34757,0 2.85479,8.4470812 2.78574,-8.4470812 3.25571,0 -4.19703,11.4600162 -0.75762,2.068331 c -0.27689,0.693694 -0.54105,1.223019 -0.7918,1.587979 -0.25074,0.364959 -0.53971,0.66149 -0.86555,0.88892 -0.32584,0.227429 -0.72677,0.404541 -1.20212,0.531339 -0.47536,0.126797 -1.01306,0.189859 -1.61177,0.189859 -0.60676,0 -1.20213,-0.06307 -1.78676,-0.189859 L 102.4948,18.59888 c 0.49413,0.09794 0.93931,0.146253 1.33689,0.146253 0.73414,0 1.27654,-0.216025 1.6292,-0.646732 0.35131,-0.430707 0.62151,-0.980159 0.80856,-1.647687 l -4.53092,-11.9309762 0,0 z"
     id="path5391"
     inkscape:connector-curvature="0" /><path
     d="m 122.43876,12.664924 3.14174,0.527983 c -0.40293,1.151235 -1.03919,2.028078 -1.90876,2.629861 -0.86959,0.601781 -1.95774,0.903007 -3.26311,0.903007 -2.06768,0 -3.597,-0.676921 -4.58991,-2.031432 -0.78378,-1.084817 -1.176,-2.45409 -1.176,-4.107815 0,-1.9757482 0.51492,-3.5221323 1.54407,-4.6411647 1.02915,-1.1190322 2.33116,-1.6778775 3.90404,-1.6778775 1.76799,0 3.16254,0.5856807 4.18431,1.7563704 1.02176,1.17069 1.51051,2.9639601 1.4656,5.3798078 l -7.8644,0 c 0.022,0.933868 0.27487,1.661104 0.75895,2.180368 0.48338,0.519264 1.08612,0.779566 1.80685,0.779566 0.49079,0 0.90378,-0.134177 1.23901,-0.402531 0.33388,-0.268352 0.58664,-0.69973 0.75761,-1.296143 l 0,0 z m 0.1837,-3.1887052 c -0.022,-0.9144129 -0.25677,-1.6094479 -0.70329,-2.085104 -0.44653,-0.475655 -0.99026,-0.7138183 -1.63055,-0.7138183 -0.68454,0 -1.25038,0.2509098 -1.69758,0.7534011 -0.44652,0.5024903 -0.66643,1.1841071 -0.6584,2.0461919 l 4.68982,0 0,-6.707e-4 z"
     id="path5393"
     inkscape:connector-curvature="0"
     style="clip-rule:evenodd;fill-rule:evenodd" /><path
     d="m 130.87172,16.427903 -3.14175,0 0,-11.9081652 2.91245,0 0,1.6912948 c 0.50151,-0.7990209 0.95205,-1.3229802 1.35231,-1.5712069 0.40091,-0.2488974 0.85484,-0.3730107 1.36369,-0.3730107 0.71807,0 1.41064,0.1979104 2.0764,0.5937311 l -0.97416,2.7439097 c -0.53102,-0.3434915 -1.02446,-0.5159084 -1.48038,-0.5159084 -0.44114,0 -0.81459,0.12143 -1.12165,0.3642889 -0.3064,0.2421893 -0.54711,0.6809462 -0.72342,1.315601 -0.17568,0.6346548 -0.26349,1.9630017 -0.26349,3.9857127 l 0,3.673753 0,0 z"
     id="path5395"
     inkscape:connector-curvature="0" /><path
     d="m 136.32115,2.9136447 0,-2.9136432273487 3.14107,0 0,2.9136432273487 -3.14107,0 0,0 z m 0,13.5142583 0,-11.9081652 3.14107,0 0,11.9081652 -3.14107,0 0,0 z"
     id="path5397"
     inkscape:connector-curvature="0"
     style="clip-rule:evenodd;fill-rule:evenodd" /><path
     d="m 141.0968,13.078188 3.16453,-0.482366 c 0.13475,0.608491 0.40696,1.070058 0.81796,1.385373 0.40965,0.315315 0.98557,0.472972 1.72374,0.472972 0.81392,0 1.42604,-0.149607 1.83636,-0.44882 0.27622,-0.209987 0.41435,-0.490416 0.41435,-0.841958 0,-0.239506 -0.0752,-0.438087 -0.22461,-0.595073 -0.15689,-0.149607 -0.5082,-0.28848 -1.05329,-0.415276 -2.54034,-0.561529 -4.15011,-1.074755 -4.8306,-1.538334 -0.94133,-0.6440465 -1.41198,-1.5390036 -1.41198,-2.6848724 0,-1.0338299 0.4063,-1.9019514 1.22089,-2.6063787 0.81394,-0.7037557 2.07571,-1.0559691 3.78606,-1.0559691 1.62785,0 2.83735,0.2670115 3.62913,0.8003631 0.79183,0.5333511 1.3369,1.3223092 1.63525,2.366203 l -2.95803,0.5507947 c -0.12672,-0.4662639 -0.36943,-0.8245149 -0.7261,-1.0727411 -0.35669,-0.2482272 -0.86488,-0.3723398 -1.52527,-0.3723398 -0.83271,0 -1.43008,0.1160627 -1.79012,0.3481882 -0.24002,0.1650366 -0.36071,0.377706 -0.36071,0.640021 0,0.2240756 0.10463,0.4152769 0.31511,0.5729344 0.28429,0.209315 1.26717,0.5051739 2.94799,0.886907 1.68149,0.381732 2.85544,0.8493372 3.52189,1.4028147 0.65839,0.560187 0.98823,1.341765 0.98823,2.344063 0,1.091526 -0.45589,2.02942 -1.36704,2.815024 -0.91182,0.784933 -2.26143,1.177399 -4.04685,1.177399 -1.62183,0 -2.90575,-0.327391 -3.85108,-0.981501 -0.94535,-0.654111 -1.56416,-1.544372 -1.85581,-2.667428 l 0,0 z"
     id="path5399"
     inkscape:connector-curvature="0" /><path
     d="m 164.89251,8.0532766 -3.09548,0.5507947 c -0.10398,-0.6151998 -0.34125,-1.0787801 -0.71069,-1.3907396 -0.36943,-0.3112901 -0.84946,-0.4676052 -1.43878,-0.4676052 -0.78377,0 -1.40863,0.2717072 -1.87526,0.8137803 -0.46597,0.5427438 -0.6993,1.4504481 -0.6993,2.7231122 0,1.414892 0.23668,2.414507 0.71002,2.998173 0.47267,0.583669 1.10826,0.876174 1.90609,0.876174 0.59605,0 1.08346,-0.170405 1.46361,-0.511883 0.38015,-0.341479 0.64899,-0.927832 0.80455,-1.759725 l 3.09546,0.527313 c -0.32113,1.422942 -0.93595,2.497696 -1.84642,3.223591 -0.90979,0.726567 -2.13001,1.090184 -3.65932,1.090184 -1.73782,0 -3.12363,-0.550123 -4.15681,-1.6497 -1.03316,-1.099578 -1.55009,-2.62248 -1.55009,-4.56804 0,-1.9683692 0.51761,-3.4999939 1.55479,-4.5962159 1.03653,-1.0962223 2.4391,-1.6443333 4.20573,-1.6443333 1.44686,0 2.59734,0.3119604 3.45016,0.9358813 0.85616,0.6225788 1.46963,1.5725486 1.84174,2.8492385 l 0,0 z"
     id="path5401"
     inkscape:connector-curvature="0" /><path
     d="m 169.93229,1.4726513e-6 0,6.0896011273487 c 1.02042,-1.2149679 2.24132,-1.8221168 3.66068,-1.8221168 0.72879,0 1.38515,0.1348474 1.97113,0.4032006 0.58531,0.2683529 1.02647,0.6125161 1.32348,1.0304756 0.29702,0.4179595 0.49949,0.8808691 0.6081,1.3887267 0.10854,0.507188 0.1636,1.2948036 0.1636,2.3621785 l 0,6.9758358 -3.14175,0 0,-6.280802 c 0,-1.2465002 -0.0608,-2.0374702 -0.18169,-2.3735825 -0.12069,-0.3354417 -0.3339,-0.6024522 -0.63962,-0.8003632 -0.30572,-0.1979099 -0.68855,-0.2965295 -1.14915,-0.2965295 -0.52832,0 -1.00032,0.1267962 -1.41533,0.3803897 -0.41501,0.2535934 -0.71872,0.6366678 -0.91116,1.147209 -0.1924,0.5112129 -0.28894,1.266627 -0.28894,2.2669125 l 0,5.956096 -3.14174,0 0,-16.4272315273487 3.14239,0 0,0 z"
     id="path5403"
     inkscape:connector-curvature="0" /><path
     d="m 187.27491,12.664924 3.14175,0.527983 c -0.40363,1.151235 -1.03988,2.028078 -1.9088,2.629861 -0.87024,0.601781 -1.95772,0.903007 -3.26377,0.903007 -2.067,0 -3.59697,-0.676921 -4.58991,-2.031432 -0.78375,-1.084817 -1.1753,-2.45409 -1.1753,-4.107815 0,-1.9757482 0.5149,-3.5221323 1.54339,-4.6411647 1.02913,-1.1183614 2.33115,-1.6778775 3.9047,-1.6778775 1.76732,0 3.16254,0.5856807 4.18364,1.7563704 1.02177,1.17069 1.51051,2.9639601 1.46627,5.3798078 l -7.86441,0 c 0.0214,0.933868 0.27488,1.661104 0.75828,2.180368 0.48406,0.519264 1.08612,0.779566 1.80753,0.779566 0.49079,0 0.90378,-0.134177 1.23834,-0.402531 0.33456,-0.268352 0.58665,-0.69973 0.75829,-1.296143 l 0,0 z m 0.18369,-3.1887052 c -0.022,-0.9144129 -0.25746,-1.6094479 -0.70396,-2.085104 -0.44652,-0.475655 -0.99026,-0.7138183 -1.62988,-0.7138183 -0.68518,0 -1.25107,0.2509098 -1.69758,0.7534011 -0.44719,0.5024903 -0.66643,1.1841071 -0.65838,2.0461919 l 4.6898,0 0,-6.707e-4 z"
     id="path5405"
     inkscape:connector-curvature="0"
     style="clip-rule:evenodd;fill-rule:evenodd" /><path
     d="m 191.58054,13.078188 3.16389,-0.482366 c 0.13475,0.608491 0.40696,1.070058 0.81794,1.385373 0.41099,0.315315 0.98557,0.472972 1.72374,0.472972 0.81392,0 1.42603,-0.149607 1.83703,-0.44882 0.27555,-0.209987 0.41368,-0.490416 0.41368,-0.841958 0,-0.239506 -0.0744,-0.438087 -0.22462,-0.595073 -0.1562,-0.149607 -0.50751,-0.28848 -1.05326,-0.415276 -2.54036,-0.561529 -4.15011,-1.074755 -4.83062,-1.538334 -0.94131,-0.6440465 -1.41199,-1.5390036 -1.41199,-2.6848724 0,-1.0338299 0.40697,-1.9019514 1.22089,-2.6063787 0.81397,-0.7044265 2.07641,-1.0559691 3.78607,-1.0559691 1.62853,0 2.83803,0.2670115 3.62915,0.8003631 0.79248,0.5333511 1.33689,1.3223092 1.63591,2.366203 l -2.95805,0.5507947 c -0.12737,-0.4662639 -0.37008,-0.8245149 -0.72608,-1.0727411 -0.35669,-0.2482272 -0.86556,-0.3723398 -1.52529,-0.3723398 -0.83337,0 -1.43075,0.1160627 -1.79077,0.3481882 -0.24003,0.1650366 -0.36004,0.377706 -0.36004,0.640021 0,0.2240756 0.10463,0.4152769 0.31444,0.5729344 0.28494,0.209315 1.26782,0.5051739 2.94865,0.886907 1.68149,0.381732 2.85479,0.8493372 3.52123,1.4028147 0.65906,0.560187 0.98891,1.341765 0.98891,2.344063 0,1.091526 -0.4559,2.02942 -1.36772,2.815024 -0.91181,0.785603 -2.26078,1.177399 -4.04685,1.177399 -1.62184,0 -2.90507,-0.327391 -3.85109,-0.981501 -0.94534,-0.655452 -1.56349,-1.544372 -1.85515,-2.667428 l 0,0 z"
     id="path5407"
     inkscape:connector-curvature="0" /><polygon
     points="88.612,29.684 88.612,59.22 59.076,59.22 59.076,88.756 29.538,88.756 29.538,59.22 0,59.22 0,29.684 0,29.684 29.538,29.684 29.538,0.147 59.076,0.147 59.076,29.684 "
     id="polygon5409"
     style="fill:#e60005;fill-opacity:1"
     transform="matrix(0.67045281,0,0,0.67088261,0,1.4726513e-6)" /><path
     d="m 74.900306,21.517891 8.849308,0 c 2.942618,0 4.804464,2.048202 4.804464,4.531812 0,1.93281 -0.781746,3.381247 -2.598006,4.117875 l 0,0.04495 c 1.770666,0.460897 2.276189,2.185737 2.390836,3.842145 0.06906,1.035173 0.04558,2.967314 0.689226,3.887096 l -3.609049,0 c -0.436463,-1.035178 -0.390203,-2.622486 -0.574577,-3.93339 -0.25276,-1.724169 -0.919191,-2.483608 -2.734778,-2.483608 l -3.609046,0 0,6.416993 -3.609047,0 0,-16.423877 6.69e-4,0 z m 3.609047,7.430023 3.95299,0 c 1.609088,0 2.482687,-0.689666 2.482687,-2.346747 0,-1.586637 -0.873599,-2.276976 -2.482687,-2.276976 l -3.95299,0 0,4.623723 0,0 z"
     id="path5411"
     inkscape:connector-curvature="0" /><path
     d="m 96.621637,25.727678 c 3.746493,0 6.160113,2.484278 6.160113,6.280133 0,3.771031 -2.41429,6.25598 -6.160113,6.25598 -3.724366,0 -6.137325,-2.484949 -6.137325,-6.25598 0,-3.795855 2.413629,-6.280133 6.137325,-6.280133 l 0,0 z m 0,10.074643 c 2.229925,0 2.896356,-1.90933 2.896356,-3.79451 0,-1.909333 -0.666431,-3.818665 -2.896356,-3.818665 -2.20646,0 -2.872891,1.910005 -2.872891,3.818665 0,1.88585 0.666431,3.79451 2.872891,3.79451 l 0,0 z"
     id="path5413"
     inkscape:connector-curvature="0" /><path
     d="m 108.98881,26.049703 2.39017,0 0,2.185734 -2.39017,0 0,5.887666 c 0,1.104273 0.27623,1.380005 1.37979,1.380005 0.34461,0 0.66642,-0.0228 1.01105,-0.0919 l 0,2.553379 c -0.55112,0.0919 -1.26448,0.115392 -1.90745,0.115392 -1.99995,0 -3.74716,-0.460896 -3.74716,-2.829783 l 0,-7.014748 -1.97716,0 0,-2.185735 1.97716,0 0,-3.565071 3.26377,0 0,3.565071 0,0 z"
     id="path5415"
     inkscape:connector-curvature="0" /><path
     d="m 115.70004,32.788718 c 0.0926,2.071015 1.10355,3.013603 2.91916,3.013603 1.31005,0 2.36737,-0.804386 2.57453,-1.541016 l 2.87356,0 c -0.91986,2.806303 -2.87356,4.002486 -5.56342,4.002486 -3.74649,0 -6.06827,-2.576861 -6.06827,-6.25598 0,-3.565742 2.45923,-6.280133 6.06827,-6.280133 4.04553,0 5.9999,3.40473 5.76993,7.06104 l -8.57376,0 0,0 z m 5.30998,-2.069673 c -0.29834,-1.656409 -1.01171,-2.529899 -2.59733,-2.529899 -2.069,0 -2.66707,1.610119 -2.71265,2.529899 l 5.30998,0 0,0 z"
     id="path5417"
     inkscape:connector-curvature="0" /><path
     d="m 128.73364,34.077483 c 0.0229,1.425625 1.21822,2.000573 2.50548,2.000573 0.94266,0 2.13807,-0.367645 2.13807,-1.517536 0,-0.990225 -1.35698,-1.335057 -3.70155,-1.840232 -1.886,-0.413935 -3.76996,-1.081464 -3.76996,-3.173946 0,-3.036415 2.62013,-3.818664 5.1712,-3.818664 2.59868,0 4.98884,0.874161 5.24159,3.795184 l -3.10353,0 c -0.0912,-1.264614 -1.05661,-1.609448 -2.22924,-1.609448 -0.73617,0 -1.8156,0.138201 -1.8156,1.104273 0,1.172703 1.83905,1.334385 3.70024,1.771801 1.90877,0.436745 3.77062,1.127082 3.77062,3.334957 0,3.128325 -2.71266,4.140688 -5.4253,4.140688 -2.75825,0 -5.4481,-1.035173 -5.58621,-4.186308 l 3.10419,0 0,-0.0013 z"
     id="path5419"
     inkscape:connector-curvature="0" /><polygon
     points="123.75,73.817 134.241,88.629 127.486,88.629 120.115,77.623 117.03,80.743 117.03,88.629 111.647,88.629 111.647,64.149 111.647,64.149 117.03,64.149 117.03,74.298 126.596,64.149 133.315,64.149 "
     id="polygon5421"
     transform="matrix(0.67045281,0,0,0.67088261,0,1.4726513e-6)" /><path
     d="m 91.105151,47.567591 3.103526,0 0,2.208546 0.04559,0 c 0.598044,-1.495398 2.20713,-2.53057 3.792752,-2.53057 0.229963,0 0.50552,0.0463 0.71269,0.116063 l 0,3.035073 c -0.298351,-0.0691 -0.781077,-0.114717 -1.171952,-0.114717 -2.390164,0 -3.218174,1.72551 -3.218174,3.817994 l 0,5.359009 -3.264434,0 0,-11.891394 0,0 z"
     id="path5423"
     inkscape:connector-curvature="0" /><path
     d="m 102.32652,54.307276 c 0.0919,2.070346 1.10356,3.012935 2.91915,3.012935 1.31007,0 2.36738,-0.804388 2.57454,-1.540347 l 2.87356,0 c -0.91985,2.805632 -2.87356,4.001815 -5.56341,4.001815 -3.7465,0 -6.068275,-2.576189 -6.068275,-6.255979 0,-3.565742 2.459225,-6.280133 6.068275,-6.280133 4.04551,0 5.99988,3.404729 5.76991,7.061709 l -8.57375,0 0,0 z m 5.30998,-2.070342 c -0.29834,-1.656409 -1.0117,-2.529899 -2.59733,-2.529899 -2.06902,0 -2.66706,1.610119 -2.71265,2.529899 l 5.30998,0 0,0 z"
     id="path5425"
     inkscape:connector-curvature="0" /><path
     d="m 123.77297,59.459657 -3.10355,0 0,-1.655739 -0.0698,0 c -0.82727,1.333715 -2.25198,1.977761 -3.63177,1.977761 -3.47093,0 -4.34387,-1.954951 -4.34387,-4.899455 l 0,-7.314633 3.26377,0 0,6.716206 c 0,1.955622 0.57457,2.921693 2.0918,2.921693 1.77,0 2.52829,-0.989553 2.52829,-3.404058 l 0,-6.233841 3.26444,0 0,11.892066 6.7e-4,0 z"
     id="path5427"
     inkscape:connector-curvature="0" /><polygon
     points="187.284,88.629 187.284,84.96 187.284,84.96 196.507,74.572 187.97,74.572 187.97,70.903 202.919,70.903 202.919,74.572 193.695,84.96 203.569,84.96 203.569,88.629 "
     id="polygon5429"
     transform="matrix(0.67045281,0,0,0.67088261,0,1.4726513e-6)" /></svg>