<?xml version="1.0" encoding="utf-8"?>
<!-- Generator: Adobe Illustrator 15.0.2, SVG Export Plug-In . SVG Version: 6.00 Build 0)  -->
<!DOCTYPE svg PUBLIC "-//W3C//DTD SVG 1.1//EN" "http://www.w3.org/Graphics/SVG/1.1/DTD/svg11.dtd">
<svg version="1.1" id="Ebene_1" xmlns="http://www.w3.org/2000/svg" xmlns:xlink="http://www.w3.org/1999/xlink" x="0px" y="0px"
	 width="20px" height="20px" viewBox="0 0 20 20" enable-background="new 0 0 20 20" xml:space="preserve">
<g>
	<path fill="#0075A9" d="M10,5C8.897,5,8,5.897,8,7s0.897,2,2,2c1.103,0,2-0.897,2-2S11.103,5,10,5z M10,8C9.449,8,9,7.551,9,7
		s0.449-1,1-1c0.552,0,1,0.449,1,1S10.552,8,10,8z"/>
	<path fill="#0075A9" d="M10,0C6.14,0,3,3.14,3,7c0,3.709,6.326,12.426,6.596,12.795C9.689,19.924,9.84,20,10,20
		s0.31-0.076,0.404-0.205C10.673,19.426,17,10.709,17,7C17,3.14,13.859,0,10,0z M10,18.638C8.593,16.637,4,9.882,4,7
		c0-3.309,2.691-6,6-6c3.309,0,6,2.691,6,6C16,9.882,11.406,16.637,10,18.638z"/>
</g>
</svg>
