<?xml version="1.0" encoding="utf-8"?>
<!-- Generator: Adobe Illustrator 18.1.1, SVG Export Plug-In . SVG Version: 6.00 Build 0)  -->
<svg version="1.1" id="Ebene_1" xmlns="http://www.w3.org/2000/svg" xmlns:xlink="http://www.w3.org/1999/xlink" x="0px" y="0px"
	 viewBox="137 70 190.2 190.1" enable-background="new 137 70 190.2 190.1" xml:space="preserve">
<g>
	<path fill="#FFFFFF" d="M318.6,183.3c-0.4,0-2.2,1.1-4.8,3.3c-2.2,2.2-3.3,4.4-3.3,5.1c1.5,1.1,1.1,2.6,0.7,2.9
		c-0.4,0.4-1.1,1.8-2.9,1.8c0,0.4-1.1,2.2-1.1,5.5s0.7,5.5,1.5,5.8c1.8,0,2.6,1.1,2.9,1.5c0.1,0.1,0.1,0.2,0.1,0.3
		c1.6-2.8,3-5.7,4.3-8.7c0.2-2.7,1.1-5.1,2.7-7.1c1-2.9,1.8-5.9,2.5-9C320.6,184.7,319.6,184.5,318.6,183.3z"/>
	<path fill="#FFFFFF" d="M161.8,109.5v-2.9c-0.7,0.9-1.5,1.8-2.2,2.7v0.2C159.6,109.5,161.8,109.5,161.8,109.5z"/>
	<path fill="#FFFFFF" d="M162.6,157h1.8l-1.8,9.5c7.7,0.4,13.9,0.7,17.9,1.5v-26l-17.2-28.9h-2.9v3.7h-3.7v-3.5
		c-0.8,1.1-1.5,2.2-2.2,3.3v31.2C158.9,148.6,161.8,152.2,162.6,157z"/>
	<path fill="#FFFFFF" d="M263.4,230v-42c0-17.2-13.9-31.4-31.1-31.4H232c-17.2,0.4-31.1,14.2-31.1,31.4v42l9.9,9.9l1.8,14.4
		c6.2,1.3,12.7,2.1,19.3,2.1c6.7,0,13.3-0.7,19.6-2.1l1.9-14.3L263.4,230z"/>
	<path fill="#FFFFFF" d="M290.8,156.2l-3.7-25.9c-0.7-4.8-5.1-9.1-10.2-9.1H251v-3.7h25.9c6.6,0,12.8,5.5,13.9,12.1l2.9,22.7h9.1
		v-10.6c0-1.1,0.4-1.8,1.1-2.6c0.7-0.7,1.5-1.1,2.6-1.1h1.8v3.7h-1.8v6.9v4h10.2v-5.8h3.7v5.8h2.1c-6.1-44.6-44.3-78.9-90.5-78.9
		c-27.8,0-52.8,12.5-69.5,32.2h3v3.7h25.2v3.7h-7.3v26.3h3.3v3.7h-3.3V169c2.2,0.7,2.9,1.8,2.9,2.9v47.5l-0.7,0.4
		c-2.2,3.2-13.9,4.1-23.2,4.3c11.8,13.9,27.7,24.2,45.9,29.1l-1.5-11.5l-10.2-9.9v-43.5c0-19,15.7-35.1,34.7-35.1h0.4
		c19.4,0.4,34.7,16.1,34.7,35.1v43.5l-10.2,9.9l-1.5,11.8c22.1-5.6,41-19.3,53.3-37.8c-1.2-1.9-1.7-3.8-1-5.1
		c-0.4,0-0.7-0.4-1.1-0.7c-1.8-1.8-2.6-5.5-2.6-8.4c0-0.7,0-1.1,0-1.8h-18.7c-1.1,1.8-2.2,2.9-3.7,2.9c2.6,2.9-0.7,9.1-5.1,13.5
		c-1.1,1.1-2.6,2.2-3.7,3.3l-2.2-2.9c1.1-0.7,2.2-1.8,3.3-2.6c4-4,5.1-7.7,4.8-8.4c-1.8-1.8-1.5-3.3-1.1-4c0.4-0.7,1.1-1.8,3.7-2.2
		c0.7-0.4,2.2-3.7,2.2-9.5s-1.8-9.1-2.6-9.5c-2.6,0-3.3-1.1-3.7-1.8c-0.4-0.7-0.7-2.2,1.1-4c0.4-0.7-0.7-4-5.1-8.4
		c-4-4-7.7-5.1-8.4-4.8c-1.8,1.8-3.3,1.5-4,1.1c-0.7-0.4-1.8-1.1-2.2-3.7c-0.4-0.7-3.3-2.2-8.8-2.2h-0.7v-3.7h0.7
		c6.2,0,12.1,1.8,12.4,5.8c0.7-0.7,2.9-1.8,6.2,0c2.2,1.1,4.8,2.9,6.9,5.1c2.2,2.2,4,4.8,5.1,6.9c1.5,3.3,1.1,5.5,0,6.2
		c4,0.4,5.8,6.9,5.8,13.2c0,2.2-0.4,4.4-0.7,6.6h17.9c0.7-1.8,1.5-3.3,2.9-3.7c0-0.4-0.4-0.7-0.4-1.5c0-2.6,2.2-5.5,4-7.7
		c2.9-2.9,6.6-5.1,9.1-4c0.6-1.4,2.1-2.4,4-2.9c0.5-3.9,0.8-8,0.8-12c0-3-0.1-5.9-0.4-8.8h-31.9V156.2z M230.9,144.5
		c-10.2,0-18.6-8.4-18.6-18.6s8.4-18.6,18.6-18.6c10.2,0,18.6,8.4,18.6,18.6C249.2,136.1,241.1,144.5,230.9,144.5z M281.3,149.7
		c-1.1,1.1-2.6,1.8-4,1.8h-24.1c-1.5,0-2.9-0.7-4-1.8c-1.1-1.1-1.8-2.6-1.8-4v-6.9h3.6v6.9c0,0.7,0.4,1.1,0.7,1.5
		c0.4,0.4,1.1,0.7,1.5,0.7h24.1c0.4,0,1.1-0.4,1.5-0.7c0.4-0.4,0.4-0.7,0.4-1.5l-1.2-11.4c0-1.1-1.5-2.2-2.6-2.2h-22.2v-3.7h22.3
		c2.9,0,5.8,2.6,6.2,5.5l1.1,11.3C282.8,146.7,282.4,148.2,281.3,149.7z M319.7,170.8h-13.9v-3.7h13.9V170.8z M319.7,163.5h-13.9
		v-3.7h13.9V163.5z"/>
	<path fill="#FFFFFF" d="M141,157h1.5c0.7-4.8,4-8.4,8.4-9.1V123c-6.5,12.6-10.2,26.9-10.2,42c0,0.7,0,1.4,0,2.1
		c0.6-0.1,1.1-0.2,1.8-0.2L141,157z"/>
	<path fill="#FFFFFF" d="M230.9,110.9c-8,0-15,6.6-15,15c0,8,6.6,15,15,15c8,0,15-6.6,15-15C245.5,117.9,238.9,110.9,230.9,110.9z"
		/>
	<path fill="#FFFFFF" d="M161.1,174.5c9.1,0,15.7-1.1,19-1.8V172c-3.3-1.1-9.5-1.8-18.3-1.8L161.1,174.5z"/>
	<path fill="#FFFFFF" d="M145.8,157h12.8c-0.4-2.6-1.8-4.8-4.4-5.5v0.7h-3.7v-0.7C148,152.2,146.5,154.4,145.8,157z"/>
	<path fill="#FFFFFF" d="M143.2,170.5c-0.9,0.1-1.7,0.2-2.4,0.3c0,0.8,0.1,1.6,0.2,2.3c0.8,0.1,1.6,0.2,2.6,0.3L143.2,170.5z"/>
	<path fill="#FFFFFF" d="M147.2,173.8c2.9,0.4,6.6,0.4,10.2,0.4l2.2-13.5H145L147.2,173.8z"/>
	<polygon fill="#FFFFFF" points="167.3,113.1 180.1,135 180.1,113.1 	"/>
	<path fill="#FFFFFF" d="M183.4,175.6c-5.8,2.2-17.5,2.6-25.2,2.6c-4.8,0-11.2-0.1-16.7-0.8c2.2,16.1,8.6,30.9,18,43.2
		c14.2-0.1,22.1-1.8,23.9-2.5C183.4,218.1,183.4,175.6,183.4,175.6z"/>
	<rect x="305.8" y="159.9" fill="#E66446" width="13.9" height="3.7"/>
	<path fill="#E66446" d="M275.5,128.5h-22.3v3.7h22.3c1.1,0,2.6,1.1,2.6,2.2l1.1,11.3c0,0.7,0,1.1-0.4,1.5c-0.4,0.4-1.1,0.7-1.5,0.7
		h-24.1c-0.4,0-1.1-0.4-1.5-0.7c-0.4-0.4-0.7-0.7-0.7-1.5v-6.9h-3.7v6.9c0,1.5,0.7,2.9,1.8,4c1.1,1.1,2.6,1.8,4,1.8h24.1
		c1.5,0,2.9-0.7,4-1.8c1.1-1.5,1.5-2.9,1.5-4.4l-1.1-11.3C281.3,131,278.4,128.5,275.5,128.5z"/>
	<rect x="305.8" y="167.2" fill="#E66446" width="13.9" height="3.7"/>
	<path fill="#E66446" d="M230.9,107.3c-10.2,0-18.6,8.4-18.6,18.6s8.4,18.6,18.6,18.6c10.2,0,18.3-8.4,18.6-18.6
		C249.5,115.7,241.1,107.3,230.9,107.3z M230.9,140.9c-8.4,0-15-6.9-15-15c0-8.4,6.9-15,15-15c8.1,0,14.6,6.9,15,15
		C245.9,134.3,238.9,140.9,230.9,140.9z"/>
	<path fill="#E66446" d="M326.7,157c-0.1-1.3-0.2-2.6-0.4-3.9c-6-46.7-46.1-83.1-94.3-83.1c-29.9,0-56.7,14-74.2,35.8
		c-0.6,0.8-1.2,1.6-1.8,2.4c-0.3,0.4-0.6,0.9-0.9,1.3c-1.5,2-2.9,4.1-4.2,6.2C142.1,130.1,137,147,137,165c0,0.9,0,1.8,0,2.7
		c0,1.2,0.1,2.4,0.2,3.7c0,0.4,0.1,0.8,0.1,1.2c0.1,1.4,0.3,2.8,0.4,4.3c2,16.2,8.2,31.1,17.3,43.7c0.9,1.2,1.8,2.5,2.8,3.7
		c12.8,16,30.6,27.8,51,32.9c1.4,0.4,2.9,0.7,4.4,1c6.1,1.2,12.4,1.9,18.9,1.9c6.6,0,13-0.7,19.1-2c1-0.2,2-0.4,3-0.7
		c23.1-5.6,43-19.6,56.1-38.6c0.7-1.1,1.5-2.2,2.2-3.3c1.7-2.8,3.3-5.6,4.8-8.6c0.9-1.8,1.7-3.6,2.5-5.5c0.8-1.9,1.6-3.9,2.3-5.9
		c0.6-1.9,1.2-3.8,1.7-5.7c0.8-3.1,1.5-6.3,2.1-9.5c0.2-1.3,0.4-2.6,0.6-3.9c0.5-3.7,0.7-7.5,0.7-11.4
		C327,162.3,326.9,159.6,326.7,157z M161.8,106.5v2.9h-2.2v-0.2C160.4,108.3,161.1,107.4,161.8,106.5z M156.7,113.3v3.5h3.7v-3.7
		h2.9l17.2,28.9v25.9c-4-0.7-10.2-1.1-17.9-1.5l1.8-9.5h-1.8c-0.7-4.8-3.7-8.4-8-9.1v-31.2C155.2,115.5,156,114.4,156.7,113.3z
		 M167.3,113.1h12.8V135L167.3,113.1z M180.1,171.9v0.7c-3.3,0.7-9.9,1.8-19,1.8l0.7-4.4C170.6,170.1,176.8,170.8,180.1,171.9z
		 M154.2,152.2v-0.7c2.6,0.7,4,2.9,4.4,5.5h-12.8c0.7-2.6,2.2-4.8,4.8-5.5v0.7H154.2z M159.7,160.6l-2.2,13.5c-3.7,0-7.3,0-10.2-0.4
		l-2.2-13.2L159.7,160.6L159.7,160.6z M140.7,165c0-15.1,3.7-29.4,10.2-42v24.8c-4.4,0.7-7.7,4.4-8.4,9.1H141l1.5,9.9
		c-0.7,0.1-1.2,0.2-1.8,0.2C140.7,166.4,140.7,165.7,140.7,165z M140.8,170.8c0.7-0.1,1.5-0.2,2.4-0.3l0.4,2.9
		c-0.9-0.1-1.8-0.2-2.6-0.3C140.9,172.3,140.9,171.5,140.8,170.8z M141.5,177.4c5.5,0.6,11.9,0.8,16.7,0.8c7.7,0,19.4-0.4,25.2-2.6
		V218c-1.8,0.7-9.8,2.4-23.9,2.5C150.1,208.2,143.7,193.5,141.5,177.4z M232,256.3c-6.6,0-13.1-0.7-19.3-2.1l-1.8-14.4l-9.9-9.9v-42
		c0-17.2,13.9-31.1,31.1-31.4h0.4c17.2,0,31.1,14.2,31.1,31.4v42l-9.9,9.9l-1.9,14.3C245.3,255.6,238.7,256.3,232,256.3z
		 M318.8,193.6c-1.6,2-2.5,4.5-2.7,7.1c-1.3,3-2.7,5.9-4.3,8.7c0-0.1-0.1-0.2-0.1-0.3c-0.4-0.4-1.1-1.5-2.9-1.5
		c-0.7-0.4-1.5-2.6-1.5-5.8s1.1-5.1,1.1-5.5c1.8,0,2.6-1.5,2.9-1.8c0.4-0.4,0.7-1.8-0.7-2.9c0-0.7,1.1-2.9,3.3-5.1
		c2.6-2.2,4.4-3.3,4.8-3.3c1,1.2,2,1.5,2.6,1.4C320.6,187.7,319.7,190.7,318.8,193.6z M322.6,177c-1.9,0.6-3.4,1.5-4,2.9
		c-2.6-1.1-6.2,1.1-9.1,4c-1.8,2.2-4,5.1-4,7.7c0,0.7,0.4,1.1,0.4,1.5c-1.5,0.4-2.2,1.8-2.9,3.7h-18c0.4-2.2,0.7-4.4,0.7-6.6
		c0-6.2-1.8-12.8-5.8-13.2c1.1-0.7,1.5-2.9,0-6.2c-1.1-2.2-2.9-4.8-5.1-6.9c-2.2-2.2-4.7-4-6.9-5.1c-3.3-1.8-5.5-0.7-6.2,0
		c-0.4-4-6.2-5.8-12.4-5.8h-0.7v3.7h0.7c5.5,0,8.4,1.5,8.8,2.2c0.4,2.6,1.5,3.3,2.2,3.7c0.7,0.4,2.2,0.7,4-1.1
		c0.7-0.4,4.4,0.7,8.4,4.8c4.4,4.4,5.5,7.7,5.1,8.4c-1.8,1.8-1.5,3.3-1.1,4c0.4,0.7,1.1,1.8,3.7,1.8c0.7,0.4,2.6,3.7,2.6,9.5
		s-1.5,9.1-2.2,9.5c-2.6,0.4-3.3,1.5-3.7,2.2s-0.7,2.2,1.1,4c0.4,0.7-0.7,4.4-4.8,8.4c-1.1,0.7-2.2,1.8-3.3,2.6l2.2,2.9
		c1.1-1.1,2.6-2.2,3.7-3.3c4.4-4.4,7.7-10.6,5.1-13.5c1.5,0,2.6-1.1,3.7-2.9h18.6c0,0.7,0,1.1,0,1.8c0,2.9,0.7,6.6,2.6,8.4
		c0.4,0.4,0.7,0.7,1.1,0.7c-0.7,1.3-0.1,3.2,1,5.1c-12.3,18.4-31.2,32.1-53.3,37.8l1.5-11.8l10.2-9.9v-43.5
		c0-19-15.3-34.7-34.7-35.1h-0.4c-19,0-34.7,16.1-34.7,35.1V232l10.2,9.9l1.5,11.5c-18.1-4.9-34-15.2-45.9-29.1
		c9.3-0.2,21-1.2,23.2-4.3l0.7-0.4v-47.5c0-1.1-0.7-2.2-2.9-2.9v-25.9h3.3v-3.7h-3.3v-26.3h7.3v-3.7h-25.2v-3.7h-3
		c16.6-19.8,41.6-32.2,69.4-32.2c46.2,0,84.4,34.4,90.5,78.9h-2.1v-5.8h-3.7v5.8h-10.2v-4v-6.9h1.8V138h-1.8c-1.1,0-1.8,0.4-2.6,1.1
		c-0.7,0.7-1.1,1.5-1.1,2.6v10.6h-9.1l-2.9-22.7c-1.1-6.6-7.3-12.1-13.9-12.1H251v3.7h25.9c5.1,0,9.5,4.4,10.2,9.1l3.7,25.9h32.1
		c0.3,2.9,0.4,5.8,0.4,8.8C323.3,169.1,323.1,173.1,322.6,177z"/>
</g>
</svg>
