Pourcentage;Description;Source
67%;de la consommation d'énergie finale francilienne actuelle concerne le bâtiment résidentiel et tertiaire;Source : AIRPARIF pour le ROSE inventaire 2021 - décembre 2023, climat réel
25%;des surfaces de bâtiments concernés par le décret éco-énergie tertiaire sont en Ile-de-France;Source: base éco-énergie tertiaire, CEREMA, millésime 2021/ Traitements: DRIEAT
55%;des logements locatifs privés d'Ile-de-France classés en E, F ou G;Source : Note rapide de l'Institut Paris Région n° 957
74%;du parc de logements d'Ile de France construit avant 1990;Source : RPLS et fichiers fonciers MAJIC enrichis par le CEREMA, millésimes 2023 / Traitements : DRIEAT