Division,WeightClassKg,Place,Name,Team,BodyweightKg,Best3SquatKg,Best3BenchKg,Best3DeadliftKg,TotalKg,Equipment,Event,Sex
Boys,51.71,1,Jack Connelly,Springtown,51.71,113.4,68.04,113.4,294.84,Single-ply,SBD,M
Boys,51.71,2,D. Taylor #5,Springtown,51.71,38.56,43.09,61.23,142.88,Single-ply,SBD,M
Boys,55.79,1,Chase Lynn,Springtown,54.88,154.22,77.11,158.76,390.09,Single-ply,SBD,M
Boys,55.79,2,Schooter Tidwell,Azle,54.88,99.79,52.16,122.47,274.42,Single-ply,SBD,M
Boys,59.87,1,Giancario Gonzales,Saginaw,59.42,133.81,70.31,142.88,347,Single-ply,SBD,M
Boys,59.87,2,Collin Rector,Springtown,58.51,131.54,77.11,136.08,344.73,Single-ply,SBD,M
Boys,59.87,3,D Hutcherson,Azle,56.7,136.08,61.23,142.88,340.19,Single-ply,SBD,M
Boys,59.87,4,Colby Dauenhauer,Springtown,58.97,124.74,56.7,136.08,317.51,Single-ply,SBD,M
Boys,67.13,1,Austin Livingston,Weatherford,67.13,181.44,88.45,174.63,444.52,Single-ply,SBD,M
Boys,67.13,2,Jake Bartles,Weatherford,67.13,172.37,97.52,170.1,439.98,Single-ply,SBD,M
Boys,67.13,3,Billy Chappell,Springtown,65.77,163.29,86.18,185.97,435.45,Single-ply,SBD,M
Boys,67.13,4,Chris Smith #19,Azle,64.86,170.1,83.91,174.63,428.64,Single-ply,SBD,M
Boys,67.13,5,Austin Van Houtan,Weatherford,67.13,158.76,99.79,165.56,424.11,Single-ply,SBD,M
Boys,67.13,6,Jaun Diaz,Saginaw,67.13,156.49,99.79,154.22,410.5,Single-ply,SBD,M
Boys,67.13,7,Tucker Eagle,Azle,63.5,154.22,92.99,161.03,408.23,Single-ply,SBD,M
Boys,67.13,8,Bryan Bonnette,Weatherford,65.32,133.81,104.33,145.15,383.29,Single-ply,SBD,M
Boys,67.13,9,Scott Welch,Weatherford,63.05,149.69,83.91,147.42,381.02,Single-ply,SBD,M
Boys,67.13,10,Colten Nabers,Springtown,64.86,122.47,77.11,147.42,347,Single-ply,SBD,M
Boys,67.13,11,Josh Harris,Saginaw,64.86,113.4,86.18,142.88,342.46,Single-ply,SBD,M
Boys,74.84,1,Robert Ard,Weatherford,72.57,174.63,120.2,190.51,485.34,Single-ply,SBD,M
Boys,74.84,2,Thomas Tyre,Springtown,71.67,170.1,97.52,154.22,421.84,Single-ply,SBD,M
Boys,74.84,3,Kyle Petter,Azle,74.39,154.22,95.25,158.76,408.23,Single-ply,SBD,M
Boys,74.84,4,Colten Hall,Azle,74.84,151.95,83.91,158.76,394.63,Single-ply,SBD,M
Boys,74.84,5,Lewis Blackwell,Saginaw,71.67,176.9,74.84,136.08,387.82,Single-ply,SBD,M
Boys,74.84,6,Kevin Metcalf,Springtown,72.57,138.35,83.91,165.56,387.82,Single-ply,SBD,M
Boys,74.84,7,Tyler Chappell,Springtown,73.48,149.69,74.84,158.76,383.29,Single-ply,SBD,M
Boys,74.84,8,Christian Huges,Azle,68.04,142.88,77.11,161.03,381.02,Single-ply,SBD,M
Boys,74.84,DQ,Russell Abrams,Saginaw,73.48,167.83,,,,Single-ply,SBD,M
Boys,82.1,1,Manny Rodriguez,Saginaw,80.29,192.78,120.2,215.46,528.44,Single-ply,SBD,M
Boys,82.1,2,Dustin Donaldson,Weatherford,76.66,204.12,111.13,201.85,517.1,Single-ply,SBD,M
Boys,82.1,3,Joel Portillo,Azle,78.47,183.7,122.47,188.24,494.42,Single-ply,SBD,M
Boys,82.1,4,Clayton Hensley,Weatherford,82.1,170.1,117.93,181.44,469.47,Single-ply,SBD,M
Boys,82.1,5,Tanner Thorton,Weatherford,81.19,158.76,99.79,183.7,442.25,Single-ply,SBD,M
Boys,82.1,6,Jacob Jackson,Azle,78.02,149.69,106.59,181.44,437.72,Single-ply,SBD,M
Boys,82.1,7,Cesar Lino,Azle,78.02,142.88,92.99,174.63,410.5,Single-ply,SBD,M
Boys,82.1,8,Keith Cox,Saginaw,78.93,136.08,92.99,147.42,376.48,Single-ply,SBD,M
Boys,89.81,1,Dakota Brooks,Azle,89.36,226.8,115.67,208.65,551.11,Single-ply,SBD,M
Boys,89.81,2,Tyler Reynolds,Weatherford,87.09,210.92,124.74,204.12,539.77,Single-ply,SBD,M
Boys,89.81,3,Russell Murphy,Saginaw,87.77,210.92,124.74,183.7,519.36,Single-ply,SBD,M
Boys,89.81,4,Michael Garner,Weatherford,85.28,188.24,106.59,185.97,480.81,Single-ply,SBD,M
Boys,89.81,5,Eddie Warren,Azle,88,154.22,115.67,197.31,467.2,Single-ply,SBD,M
Boys,89.81,6,Tyler Jenkins,Weatherford,88,142.88,120.2,181.44,444.52,Single-ply,SBD,M
Boys,89.81,7,Benny Galvan,Azle,87.54,151.95,97.52,163.29,412.77,Single-ply,SBD,M
Boys,89.81,8,Brandon Stein,Springtown,88.45,161.03,92.99,158.76,412.77,Single-ply,SBD,M
Boys,89.81,9,Wesley May,Weatherford,85.28,147.42,74.84,167.83,390.09,Single-ply,SBD,M
Boys,99.79,1,Tj Bradley,Springtown,98.88,226.8,115.67,217.72,560.19,Single-ply,SBD,M
Boys,99.79,2,Brandon Fricke,Azle,97.52,183.7,120.2,226.8,530.7,Single-ply,SBD,M
Boys,99.79,3,Blade Bronstad,Azle,97.52,197.31,97.52,195.04,489.88,Single-ply,SBD,M
Boys,99.79,4,Derek Berry,Azle,97.98,181.44,92.99,190.51,464.93,Single-ply,SBD,M
Boys,99.79,5,Zach Harriman,Weatherford,95.25,181.44,102.06,170.1,453.59,Single-ply,SBD,M
Boys,99.79,6,Kelvine Mcswain,Saginaw,99.34,181.44,102.06,170.1,453.59,Single-ply,SBD,M
Boys,99.79,7,Casey Woods,Weatherford,92.99,165.56,102.06,176.9,444.52,Single-ply,SBD,M
Boys,99.79,8,Josh Finholt,Weatherford,93.89,158.76,106.59,179.17,444.52,Single-ply,SBD,M
Boys,99.79,9,Jc Parker,Springtown,97.52,170.1,97.52,176.9,444.52,Single-ply,SBD,M
Boys,99.79,10,Bobby Subert,Saginaw,96.16,170.1,95.25,161.03,426.38,Single-ply,SBD,M
Boys,99.79,DQ,Daniel Hoystradt,Saginaw,97.98,,113.4,,,Single-ply,SBD,M
Boys,99.79,DQ,Kent Sanner,Weatherford,97.07,161.03,,,,Single-ply,SBD,M
Boys,109.77,1,John Tow,Weatherford,107.5,197.31,147.42,204.12,548.85,Single-ply,SBD,M
Boys,109.77,2,Reese Richards,Azle,107.95,210.92,108.86,224.53,544.31,Single-ply,SBD,M
Boys,109.77,3,Hayden Davis,Weatherford,105.69,185.97,113.4,161.03,460.4,Single-ply,SBD,M
Boys,109.77,4,Chris Patton,Springtown,107.95,181.44,95.25,158.76,435.45,Single-ply,SBD,M
Boys,109.77,5,Jesse Melendez,Azle,109.32,172.37,92.99,167.83,433.18,Single-ply,SBD,M
Boys,109.77,6,Eric Gaucin,Springtown,108.41,165.56,90.72,161.03,417.3,Single-ply,SBD,M
Boys,124.74,1,Peter Lopez,Saginaw,113.85,238.14,142.88,219.99,601.01,Single-ply,SBD,M
Boys,124.74,2,Brandon King,Springtown,123.38,217.72,127.01,195.04,539.77,Single-ply,SBD,M
Boys,124.74,3,Trevor Winstead,Springtown,123.38,206.38,99.79,188.24,494.42,Single-ply,SBD,M
Boys,124.74,4,Troy Swift,Springtown,117.93,181.44,90.72,181.44,453.59,Single-ply,SBD,M
Boys,124.74,DQ,Jacob Patch,Azle,117.93,192.78,117.93,,,Single-ply,SBD,M
Boys,124.74+,1,Justin Soria,Saginaw,125.19,215.46,133.81,188.24,537.51,Single-ply,SBD,M
Boys,124.74+,2,Jacob Sorrells,Springtown,129.27,210.92,124.74,197.31,532.97,Single-ply,SBD,M
Boys,124.74+,3,Alec Puente,Azle,126.1,197.31,97.52,188.24,483.08,Single-ply,SBD,M
Boys,124.74+,4,James Taylor #6,Springtown,126.1,163.29,81.65,170.1,415.04,Single-ply,SBD,M
Boys,124.74+,5,Colton Sanders,Weatherford,126.55,142.88,113.4,131.54,387.82,Single-ply,SBD,M
