Name,WeightClassKg,Division,Sex,Best3SquatKg,Best3BenchKg,Best3DeadliftKg,TotalKg,Event,Equipment,Place
J. Jacobs,67.5,LW Masters,M,217.72,131.54,229.06,578.33,SBD,Single-ply,1
D. Long,82.5,LW Masters,M,226.8,151.95,274.42,653.17,SBD,Single-ply,2
Jim Benson,67.5,LW Masters,M,197.31,115.67,204.12,517.1,SBD,Single-ply,3
Burt Rosenfield,,LW Masters,M,158.76,138.35,201.85,498.95,SBD,Single-ply,4
J. Sutch,,LW Masters,M,145.15,83.91,170.1,399.16,SBD,Single-ply,5
Ed Jubinville,,LW Masters,M,90.72,68.04,154.22,312.98,SBD,Single-ply,6
Roland Cote,100,HW Masters,M,235.87,174.63,249.48,659.98,SBD,Single-ply,1
N. Cramer,100,HW Masters,M,229.06,129.27,235.87,594.21,SBD,Single-ply,2
Barbara Falconio,,Open,F,111.13,58.97,142.88,312.98,SBD,Single-ply,1
C. McLaughlin,,Open,F,113.4,58.97,154.22,326.59,SBD,Single-ply,2
C. Swagger,,Open,F,117.93,65.77,138.35,322.05,SBD,Single-ply,3
M. Galante #2,,Open,F,117.93,68.04,133.81,319.78,SBD,Single-ply,4
A. Stine,,Open,F,92.99,49.9,104.33,247.21,SBD,Single-ply,5
J. Krell,,Open,F,88.45,43.09,122.47,254.01,SBD,Single-ply,6
J. Cunningham,60,Open,M,204.12,131.54,199.58,535.24,SBD,Single-ply,1
T. Borgia,60,Open,M,195.04,120.2,195.04,510.29,SBD,Single-ply,2
J. Vernon,60,Open,M,185.97,124.74,195.04,505.76,SBD,Single-ply,3
Fred Class,60,Open,M,172.37,74.84,192.78,439.99,SBD,Single-ply,4
A. Mizel,60,Open,M,124.74,70.31,138.35,333.39,SBD,Single-ply,5
Joe Braca,67.5,Open,M,240.4,151.95,249.48,641.83,SBD,Single-ply,1
Lloyd Weinstein,67.5,Open,M,226.8,145.15,258.55,630.49,SBD,Single-ply,2
I. Jacobs,67.5,Open,M,217.72,131.54,229.06,578.33,SBD,Single-ply,3
Jim Benson,67.5,Open,M,197.31,115.67,204.12,517.1,SBD,Single-ply,4
J. Johnson,67.5,Open,M,183.71,108.86,204.12,496.68,SBD,Single-ply,5
R. Pfister,67.5,Open,M,163.29,95.25,215.46,474,SBD,Single-ply,6
D. Hall,67.5,Open,M,140.61,115.67,185.97,442.25,SBD,Single-ply,7
Howard Krieger,75,Open,M,274.42,156.49,265.35,696.27,SBD,Single-ply,1
Matt Moran #1,75,Open,M,254.01,158.76,244.94,657.71,SBD,Single-ply,2
J. Bey,75,Open,M,242.67,156.49,242.67,641.83,SBD,Single-ply,3
Gerry Raccio,75,Open,M,217.72,167.83,251.74,637.3,SBD,Single-ply,4
Joe Masher,75,Open,M,233.6,158.76,231.33,623.69,SBD,Single-ply,5
Antonio Vernon,75,Open,M,197.31,136.08,265.35,598.74,SBD,Single-ply,6
D. Turner,75,Open,M,208.65,113.4,240.4,562.46,SBD,Single-ply,7
B. Kelley,75,Open,M,190.51,113.4,240.4,544.31,SBD,Single-ply,8
Todd Wendling,75,Open,M,170.1,149.69,185.97,505.76,SBD,Single-ply,9
J. Pariso,75,Open,M,174.63,113.4,174.63,462.66,SBD,Single-ply,10
Robert Wagner,82.5,Open,M,331.12,167.83,272.16,771.11,SBD,Single-ply,1
D. Scott,82.5,Open,M,254.01,167.83,267.62,689.46,SBD,Single-ply,2
David Boucher,82.5,Open,M,281.23,163.29,240.4,684.93,SBD,Single-ply,3
J. O'Brian,82.5,Open,M,238.14,167.83,254.01,659.98,SBD,Single-ply,4
D. Long,82.5,Open,M,226.8,151.95,274.42,653.17,SBD,Single-ply,5
T. Groman,82.5,Open,M,247.21,138.35,251.74,637.3,SBD,Single-ply,6
Tony Pechthalt,82.5,Open,M,222.26,158.76,249.48,630.49,SBD,Single-ply,7
T. Slattery,82.5,Open,M,208.65,120.2,258.55,587.4,SBD,Single-ply,8
L. Peck,82.5,Open,M,197.31,147.42,242.67,587.4,SBD,Single-ply,9
J. Stinner,82.5,Open,M,183.71,122.47,201.85,508.02,SBD,Single-ply,10
Mark Krieger,90,Open,M,308.44,156.49,278.96,743.89,SBD,Single-ply,1
M. Kacmarski,90,Open,M,256.28,188.24,278.96,723.48,SBD,Single-ply,2
B. Lindsey,90,Open,M,263.08,183.71,260.82,707.6,SBD,Single-ply,3
D. Bonner,90,Open,M,263.08,183.71,260.82,707.6,SBD,Single-ply,4
Mike Tiano,90,Open,M,274.42,145.15,254.01,673.59,SBD,Single-ply,5
I. Wolfe,90,Open,M,274.42,183.71,210.92,669.05,SBD,Single-ply,6
Richard Ferro,90,Open,M,260.82,140.61,256.28,657.71,SBD,Single-ply,7
B. Harger,90,Open,M,249.48,151.95,238.14,639.57,SBD,Single-ply,8
P. Pean,90,Open,M,240.4,140.61,204.12,585.13,SBD,Single-ply,9
C. Edwards,90,Open,M,151.95,127.01,213.19,492.15,SBD,Single-ply,10
Robert Babbitt,100,Open,M,267.62,172.37,263.08,703.07,SBD,Single-ply,1
B. Paswall,100,Open,M,258.55,145.15,285.76,689.46,SBD,Single-ply,2
B. Pitcher,100,Open,M,263.08,158.76,249.48,671.32,SBD,Single-ply,3
Roland Cote,100,Open,M,235.87,174.63,249.48,659.98,SBD,Single-ply,4
T. Messick,100,Open,M,238.14,165.56,249.48,653.17,SBD,Single-ply,5
T. Bonner,100,Open,M,249.48,136.08,263.08,648.64,SBD,Single-ply,6
J. Battista,100,Open,M,258.55,154.22,226.8,639.57,SBD,Single-ply,7
F. Kreusher,100,Open,M,226.8,147.42,256.28,630.49,SBD,Single-ply,8
T. Mottem,100,Open,M,260.82,129.27,229.06,619.15,SBD,Single-ply,9
N. Cramer,100,Open,M,229.06,129.27,235.87,594.21,SBD,Single-ply,10
Kirk Karwoski,110,Open,M,385.55,208.65,317.52,911.72,SBD,Single-ply,1
J. Petrini,110,Open,M,249.48,165.56,251.74,666.78,SBD,Single-ply,2
John Mattei,110,Open,M,240.4,174.63,249.48,664.51,SBD,Single-ply,3
B. Lachell,110,Open,M,215.46,131.54,215.46,562.46,SBD,Single-ply,4
Bill Romaniello,125,Open,M,319.78,188.24,272.16,780.18,SBD,Single-ply,1
D. Dreher,125,Open,M,249.48,145.15,285.76,680.39,SBD,Single-ply,2
L. Volk,125,Open,M,65.77,167.83,185.97,419.57,SBD,Single-ply,3
M. Ahmed,125+,Open,M,213.19,190.51,158.76,562.46,SBD,Single-ply,1
