Name,Place,Division,Sex,Equipment,Country,State,WeightClassKg,BodyweightKg,Age,Best3SquatKg,Best3BenchKg,Best3DeadliftKg,TotalKg,Event
Michelle Riesbeck,1,Open,F,Raw,,ME,52,51.71,29,90,60,110,260,SBD
Vincent Rozzi,1,Open,M,Raw,,ME,90,89.81,30,227.5,165,275,667.5,SBD
Nicholas Chapman,1,Juniors 18-19,M,Wraps,Canada,NS,82.5,82.1,19,190,107.5,237.5,535,SBD
Tyler McGathey,1,Open,M,Wraps,,ME,110,105.69,22,217.5,132.5,215,565,SBD
Matt Watson,1,Open,M,Wraps,Canada,NS,125,116.35,33,185,150,227.5,562.5,SBD
Ilya Bezverkny,DQ,Open,M,Multi-ply,,ME,140,130.63,41,-375,,,,SBD
