Name,Team,Sex,Division,BodyweightKg,WeightClassKg,Squat1Kg,Squat2Kg,Squat3Kg,Best3SquatKg,Bench1Kg,Bench2Kg,Bench3Kg,Best3BenchKg,Deadlift1Kg,Deadlift2Kg,Deadlift3Kg,Best3DeadliftKg,TotalKg,Place,Equipment,Event
Marina Cornwall,SM,F,F-E-M3,44.5,47,72.5,77.5,-82.5,77.5,42.5,45,47.5,47.5,110,117.5,122.5,122.5,247.5,1,Single-ply,SBD
Louise Edwards #1,WM,F,F-E-Open,51.3,52,127.5,135,140,140,65,70,72.5,72.5,140,150,-160,150,362.5,1,Single-ply,SBD
Jenny Hunter,EM,F,F-E-M2,51.8,52,45,55,60,60,60,65,67.5,67.5,100,110,115,115,242.5,1,Single-ply,SBD
Jennifer Hancock,SW,F,F-E-U18,57,57,52.5,60,65,65,40,45,47.5,47.5,87.5,92.5,97.5,97.5,210,1,Single-ply,SBD
Amelia Maycock,NM,F,F-E-U18,57,57,50,55,60,60,27.5,30,32.5,32.5,85,95,102.5,102.5,195,2,Single-ply,SBD
Bianca-Jade Pennington,NM,F,F-E-U23,56,57,105,115,122.5,122.5,45,-50,50,50,115,125,132.5,132.5,305,1,Single-ply,SBD
Ellie Steel,WM,F,F-E-Open,55.3,57,165,175.5,180,180,105,-115,117.5,117.5,150,160,167.5,167.5,465,1,Single-ply,SBD
Susie Butler,SW,F,F-E-U23,59.8,63,135,142.5,150,150,67.5,72.5,77.5,77.5,130,137.5,145,145,372.5,1,Single-ply,SBD
Faye Jordan,EM,F,F-E-Open,60.8,63,115,125,130,130,90,-95,95,95,130,140,145,145,370,1,Single-ply,SBD
Yasmina Couty,SM,F,F-E-Open,61.6,63,92.5,100,105,105,42.5,47.5,-50,47.5,142.5,152.5,-157.5,152.5,305,2,Single-ply,SBD
Rosimery Lima,SW,F,F-E-G,62.6,63,160,170,-180,170,90,95,97.5,97.5,175,185,-193,185,452.5,G,Single-ply,SBD
Lucy Cohen,W,F,F-E-Open,71.6,72,140,152.5,162.5,162.5,85,95,100,100,130,145,150,150,412.5,1,Single-ply,SBD
Joanne Barnes #1,YNE,F,F-E-M1,70.5,72,135,142.5,147.5,147.5,80,82.5,,82.5,145,155,-160,155,385,1,Single-ply,SBD
Charlie Shotton-Gale,SW,F,F-E-Open,84,84,190,205,215,215,125,132.5,137.5,137.5,180,192.5,202.5,202.5,555,1,Single-ply,SBD
Jennifer Keane,WM,F,F-E-Open,82.1,84,185,200,210,210,95,100,-102.5,100,160,170,180,180,490,2,Single-ply,SBD
Christie Civetta,SW,F,F-E-Open,80.3,84,175,185,190,190,95,102.5,107.5,107.5,155,165,172.5,172.5,470,3,Single-ply,SBD
Victoria Embleton,YNE,F,F-E-Open,83.2,84,185,192.5,200,200,90,97.5,102.5,102.5,165,-172.5,-177.5,165,467.5,4,Single-ply,SBD
Shasha Bowers,SW,F,F-E-Open,82.1,84,135,142.5,150,150,65,67.5,70,70,117.5,125,130,130,350,5,Single-ply,SBD
Jean Maton,SM,F,F-E-M2,84,84,-160,160,-170,160,100,107.5,-110,107.5,160,170,-175,170,437.5,1,Single-ply,SBD
Helen Toms,SW,F,F-E-M2,83.7,84,-140,-140,140,140,70,75,-80,75,140,150,155,155,370,2,Single-ply,SBD
Charlie Chester,SW,F,F-C-U23,84.8,84+,145,152.5,155,155,70,75,77.5,77.5,157.5,167.5,172.5,172.5,405,1,Raw,SBD
Kelly Phasey,WM,F,F-E-M1,121.6,84+,200,-210,220,220,-135,135,142.5,142.5,140,-150,,140,502.5,1,Single-ply,SBD
Michelle Brand,SC,F,F-E-M1,89,84+,157.5,165,172.5,172.5,97.5,107.5,-115,107.5,145,155,-160,155,435,2,Single-ply,SBD
Jackie Blasbery,EM,F,F-E-M2,88.8,84+,130,140,150,150,90,105,112.5,112.5,145,155,165,165,427.5,1,Single-ply,SBD
Sue Hollands,YNE,F,F-E-M3,86.1,84+,162.5,170,177.5,177.5,85,90.5,92.5,92.5,152.5,162.5,-173,162.5,432.5,1,Single-ply,SBD
Joe Sherwood,YNE,M,M-E-U18,63,66,150,-160,165,165,82.5,87.5,90,90,150,162.5,170,170,425,1,Single-ply,SBD
Peter Barrett,SE,M,M-E-M4,64.5,66,95,100,105,105,65,67.5,-70,67.5,150,165,177.5,177.5,350,1,Single-ply,SBD
Daniel Sherman,YNE,M,M-E-U18,71.7,74,225,237.5,-245,237.5,-142.5,142.5,-145,142.5,225,237.5,240,240,620,1,Single-ply,SBD
Jack Suljevic,SW,M,M-E-U23,73.3,74,190,205,-215,205,40,50,,50,240,250,260,260,515,1,Single-ply,SBD
Sunil Shahal,WM,M,M-E-Open,72.2,74,250,262.5,-270,262.5,195,205,-218.5,205,250,260,265,265,732.5,1,Single-ply,SBD
William Murray,Sc,M,M-E-Open,72.3,74,225,230,235,235,165,170,-175,170,210,220,-225,220,625,2,Single-ply,SBD
Steven Tyers,SW,M,M-E-Open,72.1,74,185,200,-212.5,200,130,140,-150,140,235,250,-260,250,590,3,Single-ply,SBD
Bernie McGurk,Sc,M,M-E-Open,73.7,74,230,237.5,-245,237.5,-142.5,-142.5,,,260,270,-285.5,270,,DQ,Single-ply,SBD
Phil Richard,W,M,M-E-M1,74,74,-282.5,282.5,290,290,-207.5,207.5,212.5,212.5,242.5,252.5,-257.5,252.5,755,1,Single-ply,SBD
Allen Ottolangui,EM,M,M-E-M2,73.5,74,190,210,,210,130,140,,140,190,210,220,220,570,1,Single-ply,SBD
Steve Walker,EM,M,M-E-M3,73.2,74,210,222.5,-233,222.5,150,160,165,165,225,240,-245,240,627.5,1,Single-ply,SBD
Hari Singh Cheema,WM,M,M-E-M3,73.2,74,-195,200,215,215,-125,125,130,130,195,210,215,215,560,2,Single-ply,SBD
Desmond Scott,NI,M,M-E-M4,72.1,74,75,80,85,85,65,67.5,70,70,125,130,135,135,290,1,Single-ply,SBD
Jakub Zarebo,NM,M,M-E-U18,80.9,83,190,210,215,215,110,120,125,125,190,210,220,220,560,1,Single-ply,SBD
Ryan Strang,YNE,M,M-E-U23,81.2,83,255,-265,-267.5,255,172.5,-175,175,175,225,237.5,242.5,242.5,672.5,1,Single-ply,SBD
Ethan Brownlee,SW,M,M-E-U23,82.3,83,230,245,255,255,130,140,147.5,147.5,-230,-230,230,230,632.5,2,Single-ply,SBD
Daniel Saunders,NM,M,M-E-Open,82.7,83,220,-230,-230,220,140,145,-150,145,210,225,240,240,605,1,Single-ply,SBD
Shaun Haynes,NM,M,M-E-M1,82.1,83,225,235,242.5,242.5,180,187.5,-200,187.5,227.5,237.5,-240,237.5,667.5,1,Single-ply,SBD
Jasvinder Singh Cheema,WM,M,M-E-M1,82.2,83,230,242.5,247.5,247.5,-190,-190,190,190,220,230,-232.5,230,667.5,2,Single-ply,SBD
Glen Blacklock,YNE,M,M-E-M1,82.4,83,220,230,-237.5,230,-140,-140,-145,,240,250,-257.5,250,,DQ,Single-ply,SBD
Doug D'Gama,EM,M,M-E-M2,82.2,83,200,215,,215,140,147.5,150,150,225,240,-247.5,240,605,1,Single-ply,SBD
Farris Collins,SW,M,M-E-U18,91,93,170,180,,180,115,125,,125,180,,,180,485,1,Single-ply,SBD
John Walsh,YNE,M,M-E-U23,90.9,93,245,260,275,275,-197.5,-197.5,197.5,197.5,230,250,-262.5,250,722.5,1,Single-ply,SBD
Calum Keenan,Sc,M,M-E-Open,92.2,93,-225,230,-240,230,-135,140,145,145,270,282.5,-295,282.5,657.5,1,Single-ply,SBD
TS Adewale,GL,M,M-E-M2,83.1,93,-180,180,-210,180,120,-130,,120,220,,,220,520,1,Single-ply,SBD
Kevin Jane,EM,M,M-E-M3,92.7,93,240,-260,267.5,267.5,155,160,165,165,250,270,-280,270,702.5,1,Single-ply,SBD
Mick Ellender,SE,M,M-E-M4,90.5,93,145,155,160,160,105,115,120,120,205,225,-235,225,505,1,Single-ply,SBD
Steven Barber,WM,M,M-E-U23,100.2,105,230,240,-250,240,-150,150,-160,150,230,240,255,255,645,1,Single-ply,SBD
Jake O'Neill,EM,M,M-E-Open,104.9,105,-315,315,330,330,215,-222.5,230,230,285,295,-302.5,295,855,1,Single-ply,SBD
Jack Cook,EM,M,M-E-Open,103.6,105,285,300,-310,300,190,202.5,210,210,285,300,-310,300,810,2,Single-ply,SBD
Matt Saunders,EM,M,M-E-M1,100.3,105,-290,290,-300,290,-210,-210,-210,,250,290,310,310,,DQ,Single-ply,SBD
Stuart Crichton,Sc,M,M-E-M1,103.9,105,-280,-280,280,280,-205,-207.5,-207.5,,,,,,,DQ,Single-ply,SBD
Jack Johnson,SM,M,M-E-U18,118.7,120,205,220,-225,220,160,167.5,172.5,172.5,210,230,245,245,637.5,1,Single-ply,SBD
Sam Harvey,EM,M,M-E-U23,118.6,120,260,275,280,280,180,-192.5,192.5,192.5,247.5,257.5,-260,257.5,730,1,Single-ply,SBD
David Mills,YNE,M,M-E-Open,119.4,120,320,332.5,-342.5,332.5,230,242.5,-247.5,242.5,270,-280,-280,270,845,1,Single-ply,SBD
Dylan Hywel-Davies,W,M,M-E-M1,119,120,-230,240,-260,240,-160,160,-180,160,240,250,,250,650,1,Single-ply,SBD
Phil Frost,YNE,M,M-E-M2,110.5,120,215,225,-240,225,160,167.5,175,175,200,220,230,230,630,1,Single-ply,SBD
Mathew Pearce,WM,M,M-E-Open,151.3,120+,280,295,310,310,180,187.5,192.5,192.5,260,275,292.5,292.5,795,1,Single-ply,SBD
Jon Askey,WM,M,M-E-Open,122.4,120+,-255,265,277.5,277.5,180,190,197.5,197.5,-270,270,-285,270,745,2,Single-ply,SBD
