EESchema Schematic File Version 4
EELAYER 30 0
EELAYER END
$Descr A4 11693 8268
encoding utf-8
Sheet 1 1
Title ""
Date ""
Rev ""
Comp ""
Comment1 ""
Comment2 ""
Comment3 ""
Comment4 ""
$EndDescr
$Comp
L promicro:promicro M1
U 1 1 5B266749
P 2700 1300
F 0 "M1" H 3050 -1050 60  0000 C CNN
F 1 "promicro" H 3050 1750 60  0000 C CNN
F 2 "Housings_DIP.pretty:DIP-24_W15.24mm" H 2700 1600 60  0001 C CNN
F 3 "" H 2700 1600 60  0000 C CNN
	1    2700 1300
	1    0    0    -1  
$EndComp
$Comp
L power:GND #PWR01
U 1 1 5B26815B
P 2400 1900
F 0 "#PWR01" H 2400 1650 50  0001 C CNN
F 1 "GND" H 2400 1750 50  0000 C CNN
F 2 "" H 2400 1900 50  0000 C CNN
F 3 "" H 2400 1900 50  0000 C CNN
	1    2400 1900
	1    0    0    -1  
$EndComp
Wire Wire Line
	2400 1900 2500 1900
Wire Wire Line
	2500 1700 2400 1700
Wire Wire Line
	2400 1700 2400 1900
Connection ~ 2400 1900
Text GLabel 2200 2100 0    60   Input ~ 0
SDA
Text GLabel 2200 2300 0    60   Input ~ 0
SCL
Wire Wire Line
	2200 2300 2500 2300
Wire Wire Line
	2500 2100 2200 2100
Text GLabel 2150 1300 0    60   Input ~ 0
TX
Text GLabel 2150 1500 0    60   Input ~ 0
RX
Wire Wire Line
	2150 1500 2500 1500
Wire Wire Line
	2500 1300 2150 1300
Text GLabel 3800 2100 2    60   Input ~ 0
PF4
Text GLabel 3800 2300 2    60   Input ~ 0
PF5
Wire Wire Line
	3800 2300 3600 2300
Wire Wire Line
	3600 2100 3800 2100
Wire Wire Line
	3900 1900 3600 1900
$Comp
L power:GND #PWR03
U 1 1 5B268DFA
P 3800 1500
F 0 "#PWR03" H 3800 1250 50  0001 C CNN
F 1 "GND" H 3800 1350 50  0000 C CNN
F 2 "" H 3800 1500 50  0000 C CNN
F 3 "" H 3800 1500 50  0000 C CNN
	1    3800 1500
	0    -1   -1   0   
$EndComp
Wire Wire Line
	3600 1500 3800 1500
Text GLabel 3700 1700 2    60   Input ~ 0
~Reset
Text GLabel 3800 3300 2    60   Input ~ 0
MOSI
Text GLabel 3800 3100 2    60   Input ~ 0
MISO
Text GLabel 3800 2900 2    60   Input ~ 0
SCK
Wire Wire Line
	3600 2900 3800 2900
Wire Wire Line
	3600 3100 3800 3100
Wire Wire Line
	3600 3300 3800 3300
Wire Wire Line
	3700 1700 3600 1700
Text GLabel 5750 1200 2    60   Input ~ 0
MOSI
Text GLabel 4950 1200 0    60   Input ~ 0
SCK
Text GLabel 4950 1100 0    60   Input ~ 0
MISO
Text GLabel 4700 1300 0    60   Input ~ 0
~Reset
$Comp
L power:GND #PWR04
U 1 1 5B2695D5
P 5750 1350
F 0 "#PWR04" H 5750 1100 50  0001 C CNN
F 1 "GND" H 5750 1200 50  0000 C CNN
F 2 "" H 5750 1350 50  0000 C CNN
F 3 "" H 5750 1350 50  0000 C CNN
	1    5750 1350
	1    0    0    -1  
$EndComp
Text GLabel 3800 2500 2    60   Input ~ 0
PF6
Wire Wire Line
	3800 2500 3600 2500
Text GLabel 2200 2500 0    60   Input ~ 0
PD4
Text GLabel 2200 2700 0    60   Input ~ 0
PD6
Text GLabel 2200 2900 0    60   Input ~ 0
PD7
Text GLabel 2200 3100 0    60   Input ~ 0
PE6
Text GLabel 2200 3300 0    60   Input ~ 0
PB4
Text GLabel 2200 3500 0    60   Input ~ 0
PB5
Text GLabel 3800 3500 2    60   Input ~ 0
PB6
Text GLabel 3800 2700 2    60   Input ~ 0
PF7
Wire Wire Line
	3600 2700 3800 2700
Wire Wire Line
	3800 3500 3600 3500
Wire Wire Line
	2200 2500 2500 2500
Wire Wire Line
	2500 2700 2200 2700
Wire Wire Line
	2200 2900 2500 2900
Wire Wire Line
	2200 3100 2500 3100
Wire Wire Line
	2200 3300 2500 3300
Wire Wire Line
	2200 3500 2500 3500
$Comp
L power:+5V #PWR05
U 1 1 5B799960
P 5750 1050
F 0 "#PWR05" H 5750 900 50  0001 C CNN
F 1 "+5V" H 5750 1190 50  0000 C CNN
F 2 "" H 5750 1050 50  0000 C CNN
F 3 "" H 5750 1050 50  0000 C CNN
	1    5750 1050
	1    0    0    -1  
$EndComp
Wire Wire Line
	3600 1300 3900 1300
$Comp
L Connector_Generic:Conn_02x03_Odd_Even J?
U 1 1 5F4C6FC8
P 5300 1200
F 0 "J?" H 5350 1517 50  0000 C CNN
F 1 "isp" H 5350 1426 50  0000 C CNN
F 2 "" H 5300 1200 50  0001 C CNN
F 3 "~" H 5300 1200 50  0001 C CNN
	1    5300 1200
	1    0    0    -1  
$EndComp
Wire Wire Line
	5750 1050 5750 1100
Wire Wire Line
	5750 1100 5600 1100
Wire Wire Line
	5600 1200 5750 1200
Wire Wire Line
	5750 1350 5750 1300
Wire Wire Line
	5750 1300 5600 1300
Wire Wire Line
	5100 1300 4700 1300
Wire Wire Line
	5100 1200 4950 1200
Wire Wire Line
	4950 1100 5100 1100
$Comp
L Connector_Generic:Conn_02x04_Odd_Even J?
U 1 1 5F4E2A41
P 7150 1300
F 0 "J?" H 7200 1617 50  0000 C CNN
F 1 "ESP-01" H 7200 1526 50  0000 C CNN
F 2 "" H 7150 1300 50  0001 C CNN
F 3 "~" H 7150 1300 50  0001 C CNN
	1    7150 1300
	1    0    0    -1  
$EndComp
Text GLabel 6700 700  1    60   Input ~ 0
TX
Text GLabel 7700 1500 2    60   Input ~ 0
RX
$Comp
L power:GND #PWR?
U 1 1 5F4E4368
P 6700 1550
F 0 "#PWR?" H 6700 1300 50  0001 C CNN
F 1 "GND" H 6705 1377 50  0000 C CNN
F 2 "" H 6700 1550 50  0001 C CNN
F 3 "" H 6700 1550 50  0001 C CNN
	1    6700 1550
	1    0    0    -1  
$EndComp
Wire Wire Line
	6700 1550 6700 1500
Wire Wire Line
	6700 1500 6950 1500
Wire Wire Line
	6700 1200 6950 1200
Wire Wire Line
	7450 1500 7700 1500
$Comp
L power:+3.3V #PWR?
U 1 1 5F4E6560
P 7700 1150
F 0 "#PWR?" H 7700 1000 50  0001 C CNN
F 1 "+3.3V" H 7715 1323 50  0000 C CNN
F 2 "" H 7700 1150 50  0001 C CNN
F 3 "" H 7700 1150 50  0001 C CNN
	1    7700 1150
	1    0    0    -1  
$EndComp
Wire Wire Line
	7700 1150 7700 1200
Wire Wire Line
	7700 1200 7450 1200
$Comp
L power:+5V #PWR?
U 1 1 5F4E9785
P 3900 1900
F 0 "#PWR?" H 3900 1750 50  0001 C CNN
F 1 "+5V" V 3915 2028 50  0000 L CNN
F 2 "" H 3900 1900 50  0001 C CNN
F 3 "" H 3900 1900 50  0001 C CNN
	1    3900 1900
	0    1    1    0   
$EndComp
$Comp
L Device:R R?
U 1 1 5F4ECD3D
P 6700 950
F 0 "R?" H 6770 996 50  0000 L CNN
F 1 "10k" H 6770 905 50  0000 L CNN
F 2 "" V 6630 950 50  0001 C CNN
F 3 "~" H 6700 950 50  0001 C CNN
	1    6700 950 
	1    0    0    -1  
$EndComp
Wire Wire Line
	6700 700  6700 800 
Wire Wire Line
	6700 1100 6700 1200
$Comp
L Device:R R?
U 1 1 5F4EE92F
P 6700 1350
F 0 "R?" H 6550 1400 50  0000 L CNN
F 1 "20k" H 6500 1300 50  0000 L CNN
F 2 "" V 6630 1350 50  0001 C CNN
F 3 "~" H 6700 1350 50  0001 C CNN
	1    6700 1350
	1    0    0    -1  
$EndComp
Connection ~ 6700 1200
Connection ~ 6700 1500
$Comp
L Connector:Conn_01x03_Male J?
U 1 1 5F529612
P 750 2500
F 0 "J?" H 858 2781 50  0000 C CNN
F 1 "ds18b20" H 858 2690 50  0000 C CNN
F 2 "" H 750 2500 50  0001 C CNN
F 3 "~" H 750 2500 50  0001 C CNN
	1    750  2500
	1    0    0    1   
$EndComp
$Comp
L power:+5V #PWR?
U 1 1 5F52EB38
P 1250 2200
F 0 "#PWR?" H 1250 2050 50  0001 C CNN
F 1 "+5V" H 1265 2373 50  0000 C CNN
F 2 "" H 1250 2200 50  0001 C CNN
F 3 "" H 1250 2200 50  0001 C CNN
	1    1250 2200
	-1   0    0    -1  
$EndComp
Wire Wire Line
	1250 2200 1250 2400
Wire Wire Line
	1250 2400 950  2400
$Comp
L power:GND #PWR?
U 1 1 5F52F87C
P 1250 2850
F 0 "#PWR?" H 1250 2600 50  0001 C CNN
F 1 "GND" H 1255 2677 50  0000 C CNN
F 2 "" H 1250 2850 50  0001 C CNN
F 3 "" H 1250 2850 50  0001 C CNN
	1    1250 2850
	-1   0    0    -1  
$EndComp
Wire Wire Line
	1250 2850 1250 2600
Wire Wire Line
	1250 2600 950  2600
Text GLabel 1200 2500 2    60   Input ~ 0
PD4
Wire Wire Line
	1200 2500 950  2500
Text Notes 1550 2550 0    60   ~ 0
1-wire
$Comp
L Isolator:LTV-817 U?
U 1 1 5F532659
P 9150 1050
F 0 "U?" H 9150 1375 50  0000 C CNN
F 1 "LTV-817" H 9150 1284 50  0000 C CNN
F 2 "Package_DIP:DIP-4_W7.62mm" H 8950 850 50  0001 L CIN
F 3 "http://www.us.liteon.com/downloads/LTV-817-827-847.PDF" H 9150 950 50  0001 L CNN
	1    9150 1050
	1    0    0    -1  
$EndComp
$Comp
L Isolator:LTV-817 U?
U 1 1 5F5330FB
P 9150 1700
F 0 "U?" H 9150 2025 50  0000 C CNN
F 1 "LTV-817" H 9150 1934 50  0000 C CNN
F 2 "Package_DIP:DIP-4_W7.62mm" H 8950 1500 50  0001 L CIN
F 3 "http://www.us.liteon.com/downloads/LTV-817-827-847.PDF" H 9150 1600 50  0001 L CNN
	1    9150 1700
	1    0    0    -1  
$EndComp
$Comp
L Isolator:LTV-817 U?
U 1 1 5F5338B2
P 9150 2400
F 0 "U?" H 9150 2725 50  0000 C CNN
F 1 "LTV-817" H 9150 2634 50  0000 C CNN
F 2 "Package_DIP:DIP-4_W7.62mm" H 8950 2200 50  0001 L CIN
F 3 "http://www.us.liteon.com/downloads/LTV-817-827-847.PDF" H 9150 2300 50  0001 L CNN
	1    9150 2400
	1    0    0    -1  
$EndComp
$Comp
L Isolator:LTV-817 U?
U 1 1 5F53463B
P 9150 3150
F 0 "U?" H 9150 3475 50  0000 C CNN
F 1 "LTV-817" H 9150 3384 50  0000 C CNN
F 2 "Package_DIP:DIP-4_W7.62mm" H 8950 2950 50  0001 L CIN
F 3 "http://www.us.liteon.com/downloads/LTV-817-827-847.PDF" H 9150 3050 50  0001 L CNN
	1    9150 3150
	-1   0    0    -1  
$EndComp
Wire Wire Line
	9600 700  9600 950 
Wire Wire Line
	9600 950  9450 950 
Wire Wire Line
	9600 950  9600 1600
Wire Wire Line
	9600 1600 9450 1600
Connection ~ 9600 950 
Wire Wire Line
	9600 1600 9600 2300
Wire Wire Line
	9600 2300 9450 2300
Connection ~ 9600 1600
$Comp
L Device:R R?
U 1 1 5F539772
P 9950 2500
F 0 "R?" V 10157 2500 50  0000 C CNN
F 1 "10k" V 9950 2500 50  0000 C CNN
F 2 "" V 9880 2500 50  0001 C CNN
F 3 "~" H 9950 2500 50  0001 C CNN
	1    9950 2500
	0    -1   -1   0   
$EndComp
$Comp
L Device:R R?
U 1 1 5F54042B
P 9950 1800
F 0 "R?" V 10157 1800 50  0000 C CNN
F 1 "10k" V 9950 1800 50  0000 C CNN
F 2 "" V 9880 1800 50  0001 C CNN
F 3 "~" H 9950 1800 50  0001 C CNN
	1    9950 1800
	0    -1   -1   0   
$EndComp
$Comp
L Device:R R?
U 1 1 5F540837
P 9950 1150
F 0 "R?" V 10157 1150 50  0000 C CNN
F 1 "10k" V 9950 1150 50  0000 C CNN
F 2 "" V 9880 1150 50  0001 C CNN
F 3 "~" H 9950 1150 50  0001 C CNN
	1    9950 1150
	0    -1   -1   0   
$EndComp
Wire Wire Line
	9800 1150 9700 1150
Wire Wire Line
	9450 1800 9700 1800
Wire Wire Line
	9800 2500 9700 2500
Wire Wire Line
	10250 3400 10250 3250
Wire Wire Line
	10250 2500 10100 2500
Wire Wire Line
	10250 2500 10250 1800
Wire Wire Line
	10250 1800 10100 1800
Connection ~ 10250 2500
Wire Wire Line
	10250 1800 10250 1150
Wire Wire Line
	10250 1150 10100 1150
Connection ~ 10250 1800
Wire Wire Line
	9700 1150 9700 950 
Wire Wire Line
	9700 950  10600 950 
Connection ~ 9700 1150
Wire Wire Line
	9700 1150 9450 1150
Text GLabel 10600 950  2    60   Input ~ 0
ADC_SCK
Text GLabel 10600 1600 2    60   Input ~ 0
CS_ph
Text GLabel 10600 2300 2    60   Input ~ 0
CS_orp
Wire Wire Line
	9700 1800 9700 1600
Wire Wire Line
	9700 1600 10600 1600
Connection ~ 9700 1800
Wire Wire Line
	9700 1800 9800 1800
Wire Wire Line
	9700 2500 9700 2300
Wire Wire Line
	9700 2300 10600 2300
Connection ~ 9700 2500
Wire Wire Line
	9700 2500 9450 2500
Wire Wire Line
	9450 3250 10250 3250
Connection ~ 10250 3250
Wire Wire Line
	10250 3250 10250 2500
$Comp
L Device:R R?
U 1 1 5F55C00F
P 9950 3050
F 0 "R?" V 9743 3050 50  0000 C CNN
F 1 "390" V 9950 3050 50  0000 C CNN
F 2 "" V 9880 3050 50  0001 C CNN
F 3 "~" H 9950 3050 50  0001 C CNN
	1    9950 3050
	0    1    1    0   
$EndComp
Wire Wire Line
	9800 3050 9450 3050
Wire Wire Line
	10100 3050 10600 3050
Text GLabel 10600 3050 2    60   Input ~ 0
ADC_SDO
$Comp
L Device:R R?
U 1 1 5F56390F
P 8450 2300
F 0 "R?" V 8243 2300 50  0000 C CNN
F 1 "390" V 8450 2300 50  0000 C CNN
F 2 "" V 8380 2300 50  0001 C CNN
F 3 "~" H 8450 2300 50  0001 C CNN
	1    8450 2300
	0    1    1    0   
$EndComp
$Comp
L Device:R R?
U 1 1 5F563F81
P 8450 1600
F 0 "R?" V 8243 1600 50  0000 C CNN
F 1 "390" V 8450 1600 50  0000 C CNN
F 2 "" V 8380 1600 50  0001 C CNN
F 3 "~" H 8450 1600 50  0001 C CNN
	1    8450 1600
	0    1    1    0   
$EndComp
$Comp
L Device:R R?
U 1 1 5F5643C9
P 8450 950
F 0 "R?" V 8243 950 50  0000 C CNN
F 1 "390" V 8450 950 50  0000 C CNN
F 2 "" V 8380 950 50  0001 C CNN
F 3 "~" H 8450 950 50  0001 C CNN
	1    8450 950 
	0    1    1    0   
$EndComp
Wire Wire Line
	8850 1150 8750 1150
Wire Wire Line
	8750 1150 8750 1800
$Comp
L power:GND #PWR?
U 1 1 5F5667BF
P 8750 3450
F 0 "#PWR?" H 8750 3200 50  0001 C CNN
F 1 "GND" H 8755 3277 50  0000 C CNN
F 2 "" H 8750 3450 50  0001 C CNN
F 3 "" H 8750 3450 50  0001 C CNN
	1    8750 3450
	1    0    0    -1  
$EndComp
Wire Wire Line
	8600 950  8850 950 
Wire Wire Line
	8850 1600 8600 1600
Wire Wire Line
	8600 2300 8850 2300
Wire Wire Line
	8850 2500 8750 2500
Connection ~ 8750 2500
Wire Wire Line
	8750 2500 8750 3350
Wire Wire Line
	8850 1800 8750 1800
Connection ~ 8750 1800
Wire Wire Line
	8750 1800 8750 2500
$Comp
L power:+5V #PWR?
U 1 1 5F57152F
P 8600 2900
F 0 "#PWR?" H 8600 2750 50  0001 C CNN
F 1 "+5V" H 8615 3073 50  0000 C CNN
F 2 "" H 8600 2900 50  0001 C CNN
F 3 "" H 8600 2900 50  0001 C CNN
	1    8600 2900
	1    0    0    -1  
$EndComp
Wire Wire Line
	8600 2900 8600 3050
Wire Wire Line
	8600 3050 8850 3050
$Comp
L Device:R R?
U 1 1 5F573CE5
P 8500 3350
F 0 "R?" V 8707 3350 50  0000 C CNN
F 1 "10k" V 8500 3350 50  0000 C CNN
F 2 "" V 8430 3350 50  0001 C CNN
F 3 "~" H 8500 3350 50  0001 C CNN
	1    8500 3350
	0    -1   -1   0   
$EndComp
Wire Wire Line
	8650 3350 8750 3350
Connection ~ 8750 3350
Wire Wire Line
	8750 3350 8750 3450
Wire Wire Line
	8850 3250 8350 3250
Wire Wire Line
	8350 3250 8350 3350
Connection ~ 8350 3250
Text GLabel 8200 950  0    60   Input ~ 0
PF4
Text GLabel 8200 1600 0    60   Input ~ 0
PF5
Text GLabel 8200 2300 0    60   Input ~ 0
PF6
Text GLabel 8200 3250 0    60   Input ~ 0
PF7
Wire Wire Line
	8200 3250 8350 3250
Wire Wire Line
	8300 2300 8200 2300
Wire Wire Line
	8200 1600 8300 1600
Wire Wire Line
	8300 950  8200 950 
Text Notes 4050 2150 0    60   ~ 0
ADC SCK
Text Notes 4050 2350 0    60   ~ 0
~ADC CS ph
Text Notes 4050 2550 0    60   ~ 0
~ADC CS orp
Text Notes 4050 2750 0    60   ~ 0
ADC SDO
$Comp
L Connector:Conn_01x04_Male J?
U 1 1 5F58AEDA
P 6800 2600
F 0 "J?" H 6800 2000 50  0000 R CNN
F 1 "pumps" H 6900 2200 50  0000 R CNN
F 2 "" H 6800 2600 50  0001 C CNN
F 3 "~" H 6800 2600 50  0001 C CNN
	1    6800 2600
	-1   0    0    1   
$EndComp
Text Notes 6850 2700 0    60   ~ 0
Pump 1 -\nPump 1 +\nPump 2 -\nPump 2 +
$Comp
L power:+6V #PWR?
U 1 1 5F58CA34
P 6400 2200
F 0 "#PWR?" H 6400 2050 50  0001 C CNN
F 1 "+6V" H 6415 2373 50  0000 C CNN
F 2 "" H 6400 2200 50  0001 C CNN
F 3 "" H 6400 2200 50  0001 C CNN
	1    6400 2200
	1    0    0    -1  
$EndComp
Wire Wire Line
	6400 2200 6400 2500
Wire Wire Line
	6400 2500 6600 2500
Wire Wire Line
	6600 2700 6400 2700
Wire Wire Line
	6400 2700 6400 2500
Connection ~ 6400 2500
$Comp
L Transistor_FET:IRF7748L1 Q?
U 1 1 5F593F48
P 6100 2900
F 0 "Q?" H 6305 2946 50  0000 L CNN
F 1 "IRF7748L1" H 6305 2855 50  0000 L CNN
F 2 "Package_DirectFET:DirectFET_L6" H 6100 2900 50  0001 C CIN
F 3 "https://www.infineon.com/dgdl/irf7748l1pbf.pdf?fileId=5546d462533600a40153560434c11c9e" H 6100 2900 50  0001 L CNN
	1    6100 2900
	1    0    0    -1  
$EndComp
$Comp
L Transistor_FET:IRF7748L1 Q?
U 1 1 5F595AEC
P 5650 2600
F 0 "Q?" H 5855 2646 50  0000 L CNN
F 1 "IRF7748L1" H 5855 2555 50  0000 L CNN
F 2 "Package_DirectFET:DirectFET_L6" H 5650 2600 50  0001 C CIN
F 3 "https://www.infineon.com/dgdl/irf7748l1pbf.pdf?fileId=5546d462533600a40153560434c11c9e" H 5650 2600 50  0001 L CNN
	1    5650 2600
	1    0    0    -1  
$EndComp
Wire Wire Line
	6200 2700 6200 2600
$Comp
L power:GND #PWR?
U 1 1 5F59C990
P 5750 3300
F 0 "#PWR?" H 5750 3050 50  0001 C CNN
F 1 "GND" H 5755 3127 50  0000 C CNN
F 2 "" H 5750 3300 50  0001 C CNN
F 3 "" H 5750 3300 50  0001 C CNN
	1    5750 3300
	1    0    0    -1  
$EndComp
Wire Wire Line
	5750 3300 5750 2800
$Comp
L power:GND #PWR?
U 1 1 5F59FC09
P 6200 3300
F 0 "#PWR?" H 6200 3050 50  0001 C CNN
F 1 "GND" H 6205 3127 50  0000 C CNN
F 2 "" H 6200 3300 50  0001 C CNN
F 3 "" H 6200 3300 50  0001 C CNN
	1    6200 3300
	1    0    0    -1  
$EndComp
Wire Wire Line
	6200 3300 6200 3100
Wire Wire Line
	5900 2900 5550 2900
Wire Wire Line
	5450 2600 5400 2600
Text GLabel 5300 2900 0    60   Input ~ 0
PB5
Text GLabel 5300 2600 0    60   Input ~ 0
PB4
Wire Wire Line
	5750 2400 6600 2400
Wire Wire Line
	6200 2600 6600 2600
Text Notes 1500 3550 0    60   ~ 0
Pump 1\n\nPump 2
$Comp
L Regulator_Switching:CRE1S0505SC U?
U 1 1 5F5E1126
P 7200 5350
F 0 "U?" H 7200 5817 50  0000 C CNN
F 1 "HLK-1D0505" H 7200 5726 50  0000 C CNN
F 2 "Converter_DCDC:Converter_DCDC_muRata_CRE1xxxxxxSC_THT" H 7200 4950 50  0001 C CNN
F 3 "http://power.murata.com/datasheet?/data/power/ncl/kdc_cre1.pdf" H 7200 4850 50  0001 C CNN
	1    7200 5350
	1    0    0    -1  
$EndComp
$Comp
L power:+5V #PWR?
U 1 1 5F6323DB
P 6350 4900
F 0 "#PWR?" H 6350 4750 50  0001 C CNN
F 1 "+5V" H 6365 5073 50  0000 C CNN
F 2 "" H 6350 4900 50  0001 C CNN
F 3 "" H 6350 4900 50  0001 C CNN
	1    6350 4900
	1    0    0    -1  
$EndComp
$Comp
L power:GND #PWR?
U 1 1 5F63276B
P 6350 5750
F 0 "#PWR?" H 6350 5500 50  0001 C CNN
F 1 "GND" H 6355 5577 50  0000 C CNN
F 2 "" H 6350 5750 50  0001 C CNN
F 3 "" H 6350 5750 50  0001 C CNN
	1    6350 5750
	1    0    0    -1  
$EndComp
Wire Wire Line
	6350 5750 6350 5550
Wire Wire Line
	6350 5550 6700 5550
Wire Wire Line
	6700 5150 6350 5150
Wire Wire Line
	6350 5150 6350 4900
Wire Wire Line
	8000 5150 7700 5150
Wire Wire Line
	8000 5550 7700 5550
$Comp
L Device:C C?
U 1 1 5F640F0C
P 6350 5350
F 0 "C?" H 6465 5396 50  0000 L CNN
F 1 "4.7uF" H 6465 5305 50  0000 L CNN
F 2 "" H 6388 5200 50  0001 C CNN
F 3 "~" H 6350 5350 50  0001 C CNN
	1    6350 5350
	1    0    0    -1  
$EndComp
Wire Wire Line
	6350 5200 6350 5150
Connection ~ 6350 5150
Wire Wire Line
	6350 5500 6350 5550
Connection ~ 6350 5550
$Comp
L Device:C C?
U 1 1 5F648D8C
P 8000 5350
F 0 "C?" H 8000 5450 50  0000 L CNN
F 1 "10uF" H 8000 5250 50  0000 L CNN
F 2 "" H 8038 5200 50  0001 C CNN
F 3 "~" H 8000 5350 50  0001 C CNN
	1    8000 5350
	1    0    0    -1  
$EndComp
Wire Wire Line
	8000 5200 8000 5150
Connection ~ 8000 5150
Wire Wire Line
	8000 5500 8000 5550
Connection ~ 8000 5550
$Comp
L Amplifier_Operational:LM2904 U?
U 1 1 5F65468D
P 2150 5050
F 0 "U?" H 2150 5417 50  0000 C CNN
F 1 "LMP7702" H 2150 5326 50  0000 C CNN
F 2 "" H 2150 5050 50  0001 C CNN
F 3 "http://www.ti.com/lit/ds/symlink/lm358.pdf" H 2150 5050 50  0001 C CNN
	1    2150 5050
	1    0    0    -1  
$EndComp
$Comp
L Amplifier_Operational:LM2904 U?
U 3 1 5F6577AE
P 5950 6950
F 0 "U?" H 5800 7400 50  0000 L CNN
F 1 "LM358" H 5750 6450 50  0000 L CNN
F 2 "" H 5950 6950 50  0001 C CNN
F 3 "http://www.ti.com/lit/ds/symlink/lm358.pdf" H 5950 6950 50  0001 C CNN
	3    5950 6950
	1    0    0    -1  
$EndComp
Connection ~ 8000 5050
Wire Wire Line
	8000 5050 8000 5150
Connection ~ 8000 5650
Wire Wire Line
	8000 5650 8000 5550
Wire Wire Line
	1850 5150 1850 5200
Wire Wire Line
	1850 5350 2450 5350
Wire Wire Line
	2450 5350 2450 5050
$Comp
L Device:C C?
U 1 1 5F676A70
P 1600 5100
F 0 "C?" H 1550 5400 50  0000 L CNN
F 1 "100nF" H 1500 5300 50  0000 L CNN
F 2 "" H 1638 4950 50  0001 C CNN
F 3 "~" H 1600 5100 50  0001 C CNN
	1    1600 5100
	1    0    0    -1  
$EndComp
$Comp
L Device:R R?
U 1 1 5F6779CF
P 1250 4950
F 0 "R?" V 1100 4950 50  0000 C CNN
F 1 "100k" V 1250 4950 50  0000 C CNN
F 2 "" V 1180 4950 50  0001 C CNN
F 3 "~" H 1250 4950 50  0001 C CNN
	1    1250 4950
	0    1    1    0   
$EndComp
Wire Wire Line
	1400 4950 1600 4950
Wire Wire Line
	1600 4950 1850 4950
Connection ~ 1600 4950
$Comp
L Connector:Conn_Coaxial J?
U 1 1 5F68246A
P 750 4950
F 0 "J?" H 678 5188 50  0000 C CNN
F 1 "pH" H 678 5097 50  0000 C CNN
F 2 "" H 750 4950 50  0001 C CNN
F 3 " ~" H 750 4950 50  0001 C CNN
	1    750  4950
	-1   0    0    -1  
$EndComp
Wire Wire Line
	950  4950 1100 4950
$Comp
L power:GNDA #PWR?
U 1 1 5F6894B7
P 750 5300
F 0 "#PWR?" H 750 5050 50  0001 C CNN
F 1 "GNDA" H 755 5127 50  0000 C CNN
F 2 "" H 750 5300 50  0001 C CNN
F 3 "" H 750 5300 50  0001 C CNN
	1    750  5300
	1    0    0    -1  
$EndComp
Wire Wire Line
	750  5150 750  5300
$Comp
L power:GNDA #PWR?
U 1 1 5F68ED5A
P 1600 5300
F 0 "#PWR?" H 1600 5050 50  0001 C CNN
F 1 "GNDA" H 1605 5127 50  0000 C CNN
F 2 "" H 1600 5300 50  0001 C CNN
F 3 "" H 1600 5300 50  0001 C CNN
	1    1600 5300
	1    0    0    -1  
$EndComp
Wire Wire Line
	1600 5300 1600 5250
Wire Notes Line
	650  4850 2000 4850
Wire Notes Line
	2000 4850 2000 5100
Wire Notes Line
	2000 5100 650  5100
Wire Notes Line
	650  5100 650  4850
Wire Wire Line
	1850 5200 1800 5200
Wire Wire Line
	1800 5200 1800 5100
Connection ~ 1850 5200
Wire Wire Line
	1850 5200 1850 5350
Text Notes 900  5200 0    30   ~ 0
Guard trace driven\nby opamp output
$Comp
L Analog_ADC:MCP3550-50-EMS U?
U 1 1 5F6C1D76
P 3500 5000
F 0 "U?" H 3500 5581 50  0000 C CNN
F 1 "MCP3550-50-EMS" H 3150 5350 50  0000 C CNN
F 2 "" H 3500 5000 50  0001 C CIN
F 3 "http://ww1.microchip.com/downloads/en/devicedoc/21950c.pdf" H 3500 5000 50  0001 C CNN
	1    3500 5000
	1    0    0    -1  
$EndComp
$Comp
L Reference_Voltage:REF5025AD U?
U 1 1 5F6C3DF0
P 8900 5350
F 0 "U?" H 8900 5831 50  0000 C CNN
F 1 "AD680" H 8900 5740 50  0000 C CNN
F 2 "Package_SO:SOIC-8_3.9x4.9mm_P1.27mm" H 8825 5100 50  0001 L CIN
F 3 "http://www.ti.com/lit/ds/symlink/ref5030.pdf" H 8850 5350 50  0001 C CIN
	1    8900 5350
	1    0    0    -1  
$EndComp
$Comp
L power:-2V5 #PWR?
U 1 1 5F6E42A3
P 8000 5850
F 0 "#PWR?" H 8000 5950 50  0001 C CNN
F 1 "-2V5" H 8015 6023 50  0000 C CNN
F 2 "" H 8000 5850 50  0001 C CNN
F 3 "" H 8000 5850 50  0001 C CNN
	1    8000 5850
	-1   0    0    1   
$EndComp
Wire Wire Line
	8000 5650 8000 5850
$Comp
L power:+2V5 #PWR?
U 1 1 5F6EBC63
P 8000 4900
F 0 "#PWR?" H 8000 4750 50  0001 C CNN
F 1 "+2V5" H 8015 5073 50  0000 C CNN
F 2 "" H 8000 4900 50  0001 C CNN
F 3 "" H 8000 4900 50  0001 C CNN
	1    8000 4900
	1    0    0    -1  
$EndComp
Wire Wire Line
	8000 4900 8000 5050
Wire Wire Line
	8000 5050 8350 5050
Wire Wire Line
	8000 5650 8350 5650
$Comp
L Amplifier_Operational:LM358 U?
U 1 1 5F70B520
P 10100 5350
F 0 "U?" H 10100 5717 50  0000 C CNN
F 1 "LM358" H 10100 5626 50  0000 C CNN
F 2 "" H 10100 5350 50  0001 C CNN
F 3 "http://www.ti.com/lit/ds/symlink/lm358.pdf" H 10100 5350 50  0001 C CNN
	1    10100 5350
	1    0    0    -1  
$EndComp
Wire Wire Line
	9800 5450 9800 5600
Wire Wire Line
	9800 5600 10500 5600
Wire Wire Line
	10500 5600 10500 5350
Connection ~ 10500 5350
Wire Wire Line
	10500 5350 10400 5350
$Comp
L power:GNDA #PWR?
U 1 1 5F63D12B
P 10500 5850
F 0 "#PWR?" H 10500 5600 50  0001 C CNN
F 1 "GNDA" H 10505 5677 50  0000 C CNN
F 2 "" H 10500 5850 50  0001 C CNN
F 3 "" H 10500 5850 50  0001 C CNN
	1    10500 5850
	1    0    0    -1  
$EndComp
$Comp
L Device:C C?
U 1 1 5F793F3A
P 8350 5350
F 0 "C?" H 8400 5450 50  0000 L CNN
F 1 "100nF" H 8350 5250 50  0000 L CNN
F 2 "" H 8388 5200 50  0001 C CNN
F 3 "~" H 8350 5350 50  0001 C CNN
	1    8350 5350
	1    0    0    -1  
$EndComp
Wire Wire Line
	8350 5200 8350 5050
Connection ~ 8350 5050
Wire Wire Line
	8350 5050 8800 5050
Wire Wire Line
	8350 5500 8350 5650
Connection ~ 8350 5650
Wire Wire Line
	8350 5650 8800 5650
Wire Wire Line
	9300 5250 9800 5250
$Comp
L Amplifier_Operational:LM358 U?
U 3 1 5F7B2989
P 5550 6950
F 0 "U?" H 5400 7400 50  0000 L CNN
F 1 "LMP7702" H 5400 6450 50  0000 L CNN
F 2 "" H 5550 6950 50  0001 C CNN
F 3 "http://www.ti.com/lit/ds/symlink/lm358.pdf" H 5550 6950 50  0001 C CNN
	3    5550 6950
	1    0    0    -1  
$EndComp
$Comp
L Device:C C?
U 1 1 5F7B6F6F
P 10900 5500
F 0 "C?" H 10950 5600 50  0000 L CNN
F 1 "1uF" H 10900 5400 50  0000 L CNN
F 2 "" H 10938 5350 50  0001 C CNN
F 3 "~" H 10900 5500 50  0001 C CNN
	1    10900 5500
	1    0    0    -1  
$EndComp
$Comp
L power:-2V5 #PWR?
U 1 1 5F7CE9B2
P 6200 7500
F 0 "#PWR?" H 6200 7600 50  0001 C CNN
F 1 "-2V5" H 6215 7673 50  0000 C CNN
F 2 "" H 6200 7500 50  0001 C CNN
F 3 "" H 6200 7500 50  0001 C CNN
	1    6200 7500
	-1   0    0    1   
$EndComp
Wire Wire Line
	5450 7350 5450 7250
Wire Wire Line
	5450 7350 5850 7350
Wire Wire Line
	5850 7350 5850 7250
$Comp
L power:+2V5 #PWR?
U 1 1 5F7E3E8F
P 6200 6500
F 0 "#PWR?" H 6200 6350 50  0001 C CNN
F 1 "+2V5" H 6215 6673 50  0000 C CNN
F 2 "" H 6200 6500 50  0001 C CNN
F 3 "" H 6200 6500 50  0001 C CNN
	1    6200 6500
	1    0    0    -1  
$EndComp
Wire Wire Line
	5450 6600 5850 6600
Wire Wire Line
	5850 6600 5850 6650
Wire Wire Line
	5450 6600 5450 6650
$Comp
L power:+2V5 #PWR?
U 1 1 5F7F4BD5
P 3600 4500
F 0 "#PWR?" H 3600 4350 50  0001 C CNN
F 1 "+2V5" H 3615 4673 50  0000 C CNN
F 2 "" H 3600 4500 50  0001 C CNN
F 3 "" H 3600 4500 50  0001 C CNN
	1    3600 4500
	1    0    0    -1  
$EndComp
Wire Wire Line
	3600 4500 3600 4600
$Comp
L Device:C C?
U 1 1 5F7FD724
P 6200 6950
F 0 "C?" H 6250 7050 50  0000 L CNN
F 1 "100nF" H 6200 6850 50  0000 L CNN
F 2 "" H 6238 6800 50  0001 C CNN
F 3 "~" H 6200 6950 50  0001 C CNN
	1    6200 6950
	1    0    0    -1  
$EndComp
$Comp
L Device:C C?
U 1 1 5F80C6BA
P 6550 6950
F 0 "C?" H 6600 7050 50  0000 L CNN
F 1 "100nF" H 6550 6850 50  0000 L CNN
F 2 "" H 6588 6800 50  0001 C CNN
F 3 "~" H 6550 6950 50  0001 C CNN
	1    6550 6950
	1    0    0    -1  
$EndComp
Wire Wire Line
	6550 6800 6550 6600
Wire Wire Line
	6550 6600 6200 6600
Connection ~ 5850 6600
Wire Wire Line
	6200 6800 6200 6600
Connection ~ 6200 6600
Wire Wire Line
	6200 6600 5850 6600
Wire Wire Line
	5850 7350 6200 7350
Wire Wire Line
	6200 7350 6200 7100
Connection ~ 5850 7350
Wire Wire Line
	6200 7350 6550 7350
Wire Wire Line
	6550 7350 6550 7100
Connection ~ 6200 7350
$Comp
L power:GNDA #PWR?
U 1 1 5F82DE7A
P 3200 5600
F 0 "#PWR?" H 3200 5350 50  0001 C CNN
F 1 "GNDA" H 3205 5427 50  0000 C CNN
F 2 "" H 3200 5600 50  0001 C CNN
F 3 "" H 3200 5600 50  0001 C CNN
	1    3200 5600
	1    0    0    -1  
$EndComp
Wire Wire Line
	3400 5400 3400 5550
$Comp
L power:-2V5 #PWR?
U 1 1 5F83F49A
P 3600 5600
F 0 "#PWR?" H 3600 5700 50  0001 C CNN
F 1 "-2V5" H 3615 5773 50  0000 C CNN
F 2 "" H 3600 5600 50  0001 C CNN
F 3 "" H 3600 5600 50  0001 C CNN
	1    3600 5600
	-1   0    0    1   
$EndComp
Wire Wire Line
	3600 5400 3600 5600
Wire Wire Line
	3000 5100 3000 5550
Wire Wire Line
	3000 5550 3200 5550
Wire Wire Line
	3000 4900 2700 4900
Wire Wire Line
	2700 4900 2700 5050
Wire Wire Line
	2700 5050 2450 5050
Connection ~ 2450 5050
Text GLabel 4500 4900 2    60   Input ~ 0
ADC_SCK
Text GLabel 4500 5100 2    60   Input ~ 0
CS_ph
Text GLabel 4600 6700 2    60   Input ~ 0
CS_orp
Text GLabel 4500 5000 2    60   Input ~ 0
ADC_SDO
$Comp
L Amplifier_Operational:LM2904 U?
U 2 1 5F8E5D9A
P 2150 6650
F 0 "U?" H 2150 7017 50  0000 C CNN
F 1 "LMP7702" H 2150 6926 50  0000 C CNN
F 2 "" H 2150 6650 50  0001 C CNN
F 3 "http://www.ti.com/lit/ds/symlink/lm358.pdf" H 2150 6650 50  0001 C CNN
	2    2150 6650
	1    0    0    -1  
$EndComp
Wire Wire Line
	1850 6750 1850 6800
Wire Wire Line
	1850 6950 2450 6950
Wire Wire Line
	2450 6950 2450 6650
$Comp
L Device:C C?
U 1 1 5F8E5DA7
P 1600 6700
F 0 "C?" H 1550 7000 50  0000 L CNN
F 1 "100nF" H 1500 6900 50  0000 L CNN
F 2 "" H 1638 6550 50  0001 C CNN
F 3 "~" H 1600 6700 50  0001 C CNN
	1    1600 6700
	1    0    0    -1  
$EndComp
$Comp
L Device:R R?
U 1 1 5F8E5DB1
P 1250 6550
F 0 "R?" V 1100 6550 50  0000 C CNN
F 1 "100k" V 1250 6550 50  0000 C CNN
F 2 "" V 1180 6550 50  0001 C CNN
F 3 "~" H 1250 6550 50  0001 C CNN
	1    1250 6550
	0    1    1    0   
$EndComp
Wire Wire Line
	1400 6550 1600 6550
Wire Wire Line
	1600 6550 1850 6550
Connection ~ 1600 6550
$Comp
L Connector:Conn_Coaxial J?
U 1 1 5F8E5DBE
P 750 6550
F 0 "J?" H 678 6788 50  0000 C CNN
F 1 "ORP" H 678 6697 50  0000 C CNN
F 2 "" H 750 6550 50  0001 C CNN
F 3 " ~" H 750 6550 50  0001 C CNN
	1    750  6550
	-1   0    0    -1  
$EndComp
Wire Wire Line
	950  6550 1100 6550
$Comp
L power:GNDA #PWR?
U 1 1 5F8E5DC9
P 750 6900
F 0 "#PWR?" H 750 6650 50  0001 C CNN
F 1 "GNDA" H 755 6727 50  0000 C CNN
F 2 "" H 750 6900 50  0001 C CNN
F 3 "" H 750 6900 50  0001 C CNN
	1    750  6900
	1    0    0    -1  
$EndComp
Wire Wire Line
	750  6750 750  6900
$Comp
L power:GNDA #PWR?
U 1 1 5F8E5DD4
P 1600 6900
F 0 "#PWR?" H 1600 6650 50  0001 C CNN
F 1 "GNDA" H 1605 6727 50  0000 C CNN
F 2 "" H 1600 6900 50  0001 C CNN
F 3 "" H 1600 6900 50  0001 C CNN
	1    1600 6900
	1    0    0    -1  
$EndComp
Wire Wire Line
	1600 6900 1600 6850
Wire Notes Line
	650  6450 2000 6450
Wire Notes Line
	2000 6450 2000 6700
Wire Notes Line
	2000 6700 650  6700
Wire Notes Line
	650  6700 650  6450
Wire Wire Line
	1850 6800 1800 6800
Wire Wire Line
	1800 6800 1800 6700
Connection ~ 1850 6800
Wire Wire Line
	1850 6800 1850 6950
$Comp
L Analog_ADC:MCP3550-50-EMS U?
U 1 1 5F8E5DE8
P 3500 6600
F 0 "U?" H 3500 7181 50  0000 C CNN
F 1 "MCP3550-50-EMS" H 3150 6950 50  0000 C CNN
F 2 "" H 3500 6600 50  0001 C CIN
F 3 "http://ww1.microchip.com/downloads/en/devicedoc/21950c.pdf" H 3500 6600 50  0001 C CNN
	1    3500 6600
	1    0    0    -1  
$EndComp
$Comp
L power:+2V5 #PWR?
U 1 1 5F8E5DF2
P 3600 6100
F 0 "#PWR?" H 3600 5950 50  0001 C CNN
F 1 "+2V5" H 3615 6273 50  0000 C CNN
F 2 "" H 3600 6100 50  0001 C CNN
F 3 "" H 3600 6100 50  0001 C CNN
	1    3600 6100
	1    0    0    -1  
$EndComp
Wire Wire Line
	3600 6100 3600 6200
$Comp
L power:GNDA #PWR?
U 1 1 5F8E5DFD
P 3200 7200
F 0 "#PWR?" H 3200 6950 50  0001 C CNN
F 1 "GNDA" H 3205 7027 50  0000 C CNN
F 2 "" H 3200 7200 50  0001 C CNN
F 3 "" H 3200 7200 50  0001 C CNN
	1    3200 7200
	1    0    0    -1  
$EndComp
Wire Wire Line
	3400 7000 3400 7150
$Comp
L power:-2V5 #PWR?
U 1 1 5F8E5E08
P 3600 7200
F 0 "#PWR?" H 3600 7300 50  0001 C CNN
F 1 "-2V5" H 3615 7373 50  0000 C CNN
F 2 "" H 3600 7200 50  0001 C CNN
F 3 "" H 3600 7200 50  0001 C CNN
	1    3600 7200
	-1   0    0    1   
$EndComp
Wire Wire Line
	3600 7000 3600 7200
Wire Wire Line
	3000 6700 3000 7150
Wire Wire Line
	3000 7150 3200 7150
Wire Wire Line
	3000 6500 2700 6500
Wire Wire Line
	2700 6500 2700 6650
Wire Wire Line
	2700 6650 2450 6650
Connection ~ 2450 6650
$Comp
L power:-2V5 #PWR?
U 1 1 5FA00522
P 10900 5850
F 0 "#PWR?" H 10900 5950 50  0001 C CNN
F 1 "-2V5" H 10915 6023 50  0000 C CNN
F 2 "" H 10900 5850 50  0001 C CNN
F 3 "" H 10900 5850 50  0001 C CNN
	1    10900 5850
	-1   0    0    1   
$EndComp
Wire Wire Line
	10900 5650 10900 5850
Wire Wire Line
	6200 7500 6200 7350
Wire Wire Line
	6200 6500 6200 6600
Wire Wire Line
	4500 5100 4000 5100
Wire Wire Line
	4000 5000 4150 5000
Wire Wire Line
	4000 4900 4050 4900
Wire Wire Line
	4050 4900 4050 6500
Wire Wire Line
	4050 6500 4000 6500
Connection ~ 4050 4900
Wire Wire Line
	4050 4900 4500 4900
Wire Wire Line
	4150 5000 4150 6600
Wire Wire Line
	4150 6600 4000 6600
Connection ~ 4150 5000
Wire Wire Line
	4150 5000 4500 5000
Wire Wire Line
	4000 6700 4600 6700
Text Notes 950  6800 0    30   ~ 0
Guard trace driven\nby opamp output
Wire Wire Line
	3200 5600 3200 5550
Connection ~ 3200 5550
Wire Wire Line
	3200 5550 3400 5550
Wire Wire Line
	3200 7200 3200 7150
Connection ~ 3200 7150
Wire Wire Line
	3200 7150 3400 7150
Wire Wire Line
	10500 5350 10900 5350
Wire Wire Line
	10500 5850 10500 5600
Connection ~ 10500 5600
$Comp
L power:+2V5 #PWR?
U 1 1 5FAFF54D
P 9600 700
F 0 "#PWR?" H 9600 550 50  0001 C CNN
F 1 "+2V5" H 9615 873 50  0000 C CNN
F 2 "" H 9600 700 50  0001 C CNN
F 3 "" H 9600 700 50  0001 C CNN
	1    9600 700 
	1    0    0    -1  
$EndComp
$Comp
L power:-2V5 #PWR?
U 1 1 5FAFFD03
P 10250 3400
F 0 "#PWR?" H 10250 3500 50  0001 C CNN
F 1 "-2V5" H 10265 3573 50  0000 C CNN
F 2 "" H 10250 3400 50  0001 C CNN
F 3 "" H 10250 3400 50  0001 C CNN
	1    10250 3400
	-1   0    0    1   
$EndComp
$Comp
L Transistor_FET:IRF7748L1 Q?
U 1 1 5F7E2D95
P 6100 3850
F 0 "Q?" H 6305 3896 50  0000 L CNN
F 1 "IRF7748L1" H 6305 3805 50  0000 L CNN
F 2 "Package_DirectFET:DirectFET_L6" H 6100 3850 50  0001 C CIN
F 3 "https://www.infineon.com/dgdl/irf7748l1pbf.pdf?fileId=5546d462533600a40153560434c11c9e" H 6100 3850 50  0001 L CNN
	1    6100 3850
	1    0    0    -1  
$EndComp
$Comp
L Device:R 10k
U 1 1 5F7E3DCA
P 5400 3100
F 0 "10k" V 5400 3050 50  0000 L CNN
F 1 "R" H 5250 3050 50  0000 L CNN
F 2 "" V 5330 3100 50  0001 C CNN
F 3 "~" H 5400 3100 50  0001 C CNN
	1    5400 3100
	1    0    0    -1  
$EndComp
$Comp
L Device:R 10k
U 1 1 5F7E49F5
P 5550 3100
F 0 "10k" V 5550 3050 50  0000 L CNN
F 1 "R" H 5620 3055 50  0000 L CNN
F 2 "" V 5480 3100 50  0001 C CNN
F 3 "~" H 5550 3100 50  0001 C CNN
	1    5550 3100
	1    0    0    -1  
$EndComp
Wire Wire Line
	5400 2950 5400 2600
Connection ~ 5400 2600
Wire Wire Line
	5400 2600 5300 2600
Wire Wire Line
	5550 2950 5550 2900
Connection ~ 5550 2900
Wire Wire Line
	5550 2900 5300 2900
$Comp
L power:GND #PWR?
U 1 1 5F7FD4D1
P 5550 3300
F 0 "#PWR?" H 5550 3050 50  0001 C CNN
F 1 "GND" H 5555 3127 50  0000 C CNN
F 2 "" H 5550 3300 50  0001 C CNN
F 3 "" H 5550 3300 50  0001 C CNN
	1    5550 3300
	1    0    0    -1  
$EndComp
$Comp
L power:GND #PWR?
U 1 1 5F7FD8C4
P 5400 3300
F 0 "#PWR?" H 5400 3050 50  0001 C CNN
F 1 "GND" H 5405 3127 50  0000 C CNN
F 2 "" H 5400 3300 50  0001 C CNN
F 3 "" H 5400 3300 50  0001 C CNN
	1    5400 3300
	1    0    0    -1  
$EndComp
Wire Wire Line
	5400 3250 5400 3300
Wire Wire Line
	5550 3250 5550 3300
$Comp
L Device:R 10k?
U 1 1 5F83264E
P 5750 4050
F 0 "10k?" V 5750 4000 50  0000 L CNN
F 1 "R" H 5820 4005 50  0000 L CNN
F 2 "" V 5680 4050 50  0001 C CNN
F 3 "~" H 5750 4050 50  0001 C CNN
	1    5750 4050
	1    0    0    -1  
$EndComp
Text GLabel 5600 3850 0    60   Input ~ 0
PE6
$Comp
L power:GND #PWR?
U 1 1 5F834366
P 5750 4300
F 0 "#PWR?" H 5750 4050 50  0001 C CNN
F 1 "GND" H 5755 4127 50  0000 C CNN
F 2 "" H 5750 4300 50  0001 C CNN
F 3 "" H 5750 4300 50  0001 C CNN
	1    5750 4300
	1    0    0    -1  
$EndComp
$Comp
L power:GND #PWR?
U 1 1 5F834AFE
P 6200 4300
F 0 "#PWR?" H 6200 4050 50  0001 C CNN
F 1 "GND" H 6205 4127 50  0000 C CNN
F 2 "" H 6200 4300 50  0001 C CNN
F 3 "" H 6200 4300 50  0001 C CNN
	1    6200 4300
	1    0    0    -1  
$EndComp
Wire Wire Line
	5600 3850 5750 3850
Wire Wire Line
	5750 3900 5750 3850
Connection ~ 5750 3850
Wire Wire Line
	5750 3850 5900 3850
Wire Wire Line
	5750 4300 5750 4200
Wire Wire Line
	6200 4300 6200 4050
$Comp
L Connector:Conn_01x02_Male J?
U 1 1 5F86AA4F
P 6800 3750
F 0 "J?" H 6850 3850 50  0000 R CNN
F 1 "Pump 0" H 6850 3500 50  0000 R CNN
F 2 "" H 6800 3750 50  0001 C CNN
F 3 "~" H 6800 3750 50  0001 C CNN
	1    6800 3750
	-1   0    0    1   
$EndComp
$Comp
L power:+6V #PWR?
U 1 1 5F86B434
P 6450 3550
F 0 "#PWR?" H 6450 3400 50  0001 C CNN
F 1 "+6V" H 6465 3723 50  0000 C CNN
F 2 "" H 6450 3550 50  0001 C CNN
F 3 "" H 6450 3550 50  0001 C CNN
	1    6450 3550
	1    0    0    -1  
$EndComp
Wire Wire Line
	6450 3550 6450 3750
Wire Wire Line
	6450 3750 6600 3750
Wire Wire Line
	6600 3650 6200 3650
Text Notes 1500 3150 0    60   ~ 0
Pump 0
Text Notes 6850 3800 0    60   ~ 0
Pump 0 -\nPump 0 +
$EndSCHEMATC
