(module cog-badge:mpu6050-module (layer F.Cu) (tedit 5B9943C2)
  (fp_text reference P1 (at 13.97 10.16 90) (layer F.SilkS)
    (effects (font (size 1 1) (thickness 0.15)))
  )
  (fp_text value MPU6050 (at 11.43 10.16 90) (layer F.Fab)
    (effects (font (size 1 1) (thickness 0.15)))
  )
  (fp_text user INT (at 3.81 19.05) (layer F.SilkS)
    (effects (font (size 1 1) (thickness 0.15)))
  )
  (fp_text user AD0 (at 3.81 16.51) (layer F.SilkS)
    (effects (font (size 1 1) (thickness 0.15)))
  )
  (fp_text user XCL (at 3.81 13.97) (layer F.SilkS)
    (effects (font (size 1 1) (thickness 0.15)))
  )
  (fp_text user XDA (at 3.81 11.43) (layer F.SilkS)
    (effects (font (size 1 1) (thickness 0.15)))
  )
  (fp_text user SDA (at 3.81 8.89) (layer F.SilkS)
    (effects (font (size 1 1) (thickness 0.15)))
  )
  (fp_text user SCL (at 3.81 6.35) (layer F.SilkS)
    (effects (font (size 1 1) (thickness 0.15)))
  )
  (fp_text user GND (at 3.81 3.81) (layer F.SilkS)
    (effects (font (size 1 1) (thickness 0.15)))
  )
  (fp_text user VCC (at 3.81 1.27) (layer F.SilkS)
    (effects (font (size 1 1) (thickness 0.15)))
  )
  (fp_line (start 0 0) (end 16.002 0) (layer F.SilkS) (width 0.15))
  (fp_line (start 16.002 0) (end 16.002 20.32) (layer F.SilkS) (width 0.15))
  (fp_line (start 16.002 20.32) (end 0 20.32) (layer F.SilkS) (width 0.15))
  (fp_line (start 0 20.32) (end 0 0) (layer F.SilkS) (width 0.15))
  (pad 1 thru_hole circle (at 1.27 1.27) (size 1.524 1.524) (drill 0.9) (layers *.Cu *.Mask F.SilkS))
  (pad 2 thru_hole circle (at 1.27 3.81) (size 1.524 1.524) (drill 0.9) (layers *.Cu *.Mask F.SilkS))
  (pad 3 thru_hole circle (at 1.27 6.35) (size 1.524 1.524) (drill 0.9) (layers *.Cu *.Mask F.SilkS))
  (pad 4 thru_hole circle (at 1.27 8.89) (size 1.524 1.524) (drill 0.9) (layers *.Cu *.Mask F.SilkS))
  (pad 5 thru_hole circle (at 1.27 11.43) (size 1.524 1.524) (drill 0.9) (layers *.Cu *.Mask F.SilkS))
  (pad 6 thru_hole circle (at 1.27 13.97) (size 1.524 1.524) (drill 0.9) (layers *.Cu *.Mask F.SilkS))
  (pad 7 thru_hole circle (at 1.27 16.51) (size 1.524 1.524) (drill 0.9) (layers *.Cu *.Mask F.SilkS))
  (pad 8 thru_hole circle (at 1.27 19.05) (size 1.524 1.524) (drill 0.9) (layers *.Cu *.Mask F.SilkS))
)
