(module LOGO (layer F.Cu)
  (at 0 0)
 (fp_text reference "G***" (at 0 0) (layer F.SilkS) hide
  (effects (font (thickness 0.3)))
  )
  (fp_text value "LOGO" (at 0.75 0) (layer F.SilkS) hide
  (effects (font (thickness 0.3)))
  )
  (fp_poly (pts (xy 3.334144 -0.734892) (xy 3.386667 -0.682845) (xy 3.415572 -0.553096) (xy 3.481168 -0.365345) (xy 3.575670 -0.127000) (xy 3.678789 -0.423333) (xy 3.816033 -0.667232) (xy 3.965287 -0.746722)
     (xy 4.109724 -0.755684) (xy 4.148667 -0.741761) (xy 4.121598 -0.653229) (xy 4.049287 -0.444063) (xy 3.945074 -0.152506) (xy 3.895556 -0.016205) (xy 3.642446 0.677334) (xy 3.916723 0.687231)
     (xy 4.030361 0.699212) (xy 3.990276 0.723612) (xy 3.789856 0.763504) (xy 3.731255 0.773395) (xy 3.439813 0.809621) (xy 3.274091 0.795267) (xy 3.205177 0.742331) (xy 3.099200 0.704637)
     (xy 2.850985 0.675327) (xy 2.487419 0.654352) (xy 2.035385 0.641663) (xy 1.521772 0.637215) (xy 0.973463 0.640957) (xy 0.417344 0.652843) (xy -0.119698 0.672824) (xy -0.610779 0.700853)
     (xy -1.029012 0.736882) (xy -1.143000 0.750084) (xy -1.571266 0.807108) (xy -2.063448 0.878003) (xy -2.582191 0.956804) (xy -3.090136 1.037544) (xy -3.549928 1.114259) (xy -3.924210 1.180984)
     (xy -4.175625 1.231754) (xy -4.208080 1.239519) (xy -4.362533 1.258250) (xy -4.391212 1.194398) (xy -4.386015 1.176116) (xy -4.272143 1.078780) (xy -4.006769 0.983840) (xy -3.607723 0.893320)
     (xy -3.092837 0.809249) (xy -2.479942 0.733653) (xy -1.786867 0.668558) (xy -1.031444 0.615992) (xy -0.231504 0.577980) (xy 0.595122 0.556550) (xy 1.100667 0.552490) (xy 1.722417 0.548864)
     (xy 2.270072 0.539787) (xy 2.723330 0.526001) (xy 3.061890 0.508251) (xy 3.265451 0.487280) (xy 3.316594 0.471305) (xy 3.317313 0.357772) (xy 3.264744 0.135480) (xy 3.170227 -0.147818)
     (xy 3.168427 -0.152609) (xy 3.066002 -0.429067) (xy 2.992481 -0.635786) (xy 2.963359 -0.729166) (xy 2.963333 -0.729747) (xy 3.036013 -0.754022) (xy 3.175000 -0.762000) (xy 3.334144 -0.734892) )(layer F.SilkS) (width  0.010000)
  )
  (fp_poly (pts (xy -3.436236 -1.137877) (xy -3.176455 -0.998347) (xy -3.056039 -0.770999) (xy -3.048000 -0.677333) (xy -3.123879 -0.425291) (xy -3.327550 -0.246273) (xy -3.623065 -0.170144) (xy -3.659506 -0.169333)
     (xy -3.817838 -0.150694) (xy -3.882756 -0.060875) (xy -3.894667 0.127000) (xy -3.913609 0.331239) (xy -3.987556 0.413647) (xy -4.064000 0.423334) (xy -4.142703 0.411188) (xy -4.192374 0.353810)
     (xy -4.219627 0.219790) (xy -4.231075 -0.022284) (xy -4.233333 -0.381000) (xy -4.233333 -0.677333) (xy -3.894667 -0.677333) (xy -3.881708 -0.496626) (xy -3.811822 -0.434186) (xy -3.638491 -0.460619)
     (xy -3.577167 -0.476697) (xy -3.429159 -0.577077) (xy -3.391478 -0.725957) (xy -3.473608 -0.855750) (xy -3.520592 -0.879941) (xy -3.745390 -0.931655) (xy -3.863233 -0.860681) (xy -3.894667 -0.677333)
     (xy -4.233333 -0.677333) (xy -4.233333 -1.185333) (xy -3.828839 -1.185333) (xy -3.436236 -1.137877) )(layer F.SilkS) (width  0.010000)
  )
  (fp_poly (pts (xy -0.773296 -1.162326) (xy -0.533205 -1.102768) (xy -0.460705 -1.065175) (xy -0.353798 -0.957170) (xy -0.349493 -0.821382) (xy -0.392778 -0.689622) (xy -0.446406 -0.502411) (xy -0.414147 -0.411751)
     (xy -0.371590 -0.389104) (xy -0.281834 -0.276231) (xy -0.258078 -0.080485) (xy -0.298695 0.125764) (xy -0.386133 0.258260) (xy -0.539104 0.325628) (xy -0.782887 0.378550) (xy -1.056417 0.410387)
     (xy -1.298627 0.414502) (xy -1.448453 0.384254) (xy -1.460500 0.375058) (xy -1.488950 0.266344) (xy -1.510810 0.030972) (xy -1.515131 -0.084666) (xy -1.100667 -0.084666) (xy -1.051058 0.048118)
     (xy -0.889000 0.084667) (xy -0.723019 0.044980) (xy -0.677333 -0.084666) (xy -0.726942 -0.217451) (xy -0.889000 -0.254000) (xy -1.054981 -0.214313) (xy -1.100667 -0.084666) (xy -1.515131 -0.084666)
     (xy -1.522747 -0.288412) (xy -1.524000 -0.437444) (xy -1.524000 -0.768208) (xy -1.100667 -0.768208) (xy -1.044884 -0.623458) (xy -0.925125 -0.592666) (xy -0.790189 -0.638287) (xy -0.777931 -0.739861)
     (xy -0.856636 -0.876896) (xy -0.978672 -0.918435) (xy -1.078566 -0.858730) (xy -1.100667 -0.768208) (xy -1.524000 -0.768208) (xy -1.524000 -1.185333) (xy -1.074516 -1.185333) (xy -0.773296 -1.162326) )(layer F.SilkS) (width  0.010000)
  )
  (fp_poly (pts (xy 0.130616 -1.136693) (xy 0.216116 -0.964185) (xy 0.218842 -0.952500) (xy 0.280831 -0.687973) (xy 0.335073 -0.465666) (xy 0.398568 -0.211666) (xy 0.499798 -0.592666) (xy 0.583306 -0.898319)
     (xy 0.644709 -1.075268) (xy 0.704585 -1.158677) (xy 0.783514 -1.183708) (xy 0.846667 -1.185333) (xy 0.946257 -1.178139) (xy 1.014767 -1.133116) (xy 1.072779 -1.015101) (xy 1.140870 -0.788931)
     (xy 1.193535 -0.592666) (xy 1.294765 -0.211666) (xy 1.358260 -0.465666) (xy 1.424647 -0.738844) (xy 1.474491 -0.952500) (xy 1.557288 -1.131731) (xy 1.719082 -1.185242) (xy 1.729242 -1.185333)
     (xy 1.931258 -1.185333) (xy 1.806988 -0.698500) (xy 1.692543 -0.250662) (xy 1.609956 0.058895) (xy 1.547952 0.255634) (xy 1.495255 0.365022) (xy 1.440591 0.412525) (xy 1.372685 0.423609)
     (xy 1.310289 0.423334) (xy 1.174348 0.397356) (xy 1.086219 0.291165) (xy 1.012264 0.062374) (xy 1.006805 0.040894) (xy 0.931840 -0.197469) (xy 0.854027 -0.358362) (xy 0.791394 -0.415076)
     (xy 0.761969 -0.340902) (xy 0.761528 -0.322497) (xy 0.739675 -0.172526) (xy 0.686346 0.056072) (xy 0.672881 0.105834) (xy 0.590663 0.321251) (xy 0.479755 0.411320) (xy 0.380284 0.423334)
     (xy 0.233074 0.389544) (xy 0.141055 0.258762) (xy 0.093237 0.105834) (xy 0.024310 -0.160691) (xy -0.062130 -0.497084) (xy -0.113655 -0.698500) (xy -0.237925 -1.185333) (xy -0.035909 -1.185333)
     (xy 0.130616 -1.136693) )(layer F.SilkS) (width  0.010000)
  )
  (fp_poly (pts (xy 2.502263 -0.818648) (xy 2.729316 -0.740777) (xy 2.757659 -0.723526) (xy 2.876281 -0.623255) (xy 2.938363 -0.487229) (xy 2.961211 -0.262540) (xy 2.963333 -0.094810) (xy 2.963333 0.399143)
     (xy 2.502505 0.399143) (xy 2.228678 0.383652) (xy 2.021700 0.343891) (xy 1.952171 0.309638) (xy 1.872535 0.132595) (xy 1.875853 0.057344) (xy 2.232632 0.057344) (xy 2.342735 0.156607)
     (xy 2.417997 0.169334) (xy 2.516905 0.098839) (xy 2.540000 0.000000) (xy 2.479748 -0.136208) (xy 2.351424 -0.165958) (xy 2.243667 -0.084666) (xy 2.232632 0.057344) (xy 1.875853 0.057344)
     (xy 1.882075 -0.083734) (xy 1.968500 -0.235520) (xy 2.132456 -0.314932) (xy 2.286000 -0.351721) (xy 2.435826 -0.403445) (xy 2.444549 -0.473293) (xy 2.332257 -0.527511) (xy 2.175533 -0.537345)
     (xy 2.003844 -0.553143) (xy 1.961178 -0.640416) (xy 1.964560 -0.664345) (xy 2.061418 -0.776069) (xy 2.260141 -0.828958) (xy 2.502263 -0.818648) )(layer F.SilkS) (width  0.010000)
  )
  (fp_poly (pts (xy -1.974729 -1.118285) (xy -1.739388 -1.016466) (xy -1.687943 -0.967172) (xy -1.627895 -0.817788) (xy -1.696709 -0.732488) (xy -1.854819 -0.757901) (xy -1.862239 -0.761771) (xy -2.148080 -0.842060)
     (xy -2.419943 -0.796847) (xy -2.569211 -0.691833) (xy -2.694344 -0.479533) (xy -2.667511 -0.259104) (xy -2.577533 -0.103505) (xy -2.391627 0.039701) (xy -2.149840 0.084904) (xy -1.928842 0.022594)
     (xy -1.879600 -0.016933) (xy -1.765570 -0.073802) (xy -1.672167 -0.011233) (xy -1.634606 0.109591) (xy -1.733735 0.221858) (xy -1.937335 0.305048) (xy -2.213187 0.338640) (xy -2.221559 0.338667)
     (xy -2.510895 0.294028) (xy -2.735297 0.136139) (xy -2.755710 0.114637) (xy -2.933337 -0.184213) (xy -2.959785 -0.501940) (xy -2.842414 -0.797933) (xy -2.588584 -1.031577) (xy -2.543474 -1.056537)
     (xy -2.266687 -1.134142) (xy -1.974729 -1.118285) )(layer F.SilkS) (width  0.010000)
  )
)
